<?xml version="1.0" encoding="UTF-8" standalone="no"?>
<!-- Created with Inkscape (http://www.inkscape.org/) -->

<svg
   version="1.1"
   id="svg27999"
   xml:space="preserve"
   width="436.32132"
   height="142.948"
   viewBox="0 0 436.32132 142.948"
   sodipodi:docname="dot2.svg"
   inkscape:version="1.1 (c68e22c387, 2021-05-23)"
   xmlns:inkscape="http://www.inkscape.org/namespaces/inkscape"
   xmlns:sodipodi="http://sodipodi.sourceforge.net/DTD/sodipodi-0.dtd"
   xmlns="http://www.w3.org/2000/svg"
   xmlns:svg="http://www.w3.org/2000/svg"><defs
     id="defs28003"><clipPath
       clipPathUnits="userSpaceOnUse"
       id="clipPath28009"><path
         d="M 179.584,546.494 H 506.825 V 653.705 H 179.584 Z"
         id="path28007" /></clipPath></defs><sodipodi:namedview
     id="namedview28001"
     pagecolor="#ffffff"
     bordercolor="#666666"
     borderopacity="1.0"
     inkscape:pageshadow="2"
     inkscape:pageopacity="0.0"
     inkscape:pagecheckerboard="0"
     showgrid="false"
     fit-margin-top="0"
     fit-margin-left="0"
     fit-margin-right="0"
     fit-margin-bottom="0"
     inkscape:zoom="1.505771"
     inkscape:cx="172.33696"
     inkscape:cy="36.858194"
     inkscape:window-width="1680"
     inkscape:window-height="971"
     inkscape:window-x="-9"
     inkscape:window-y="-9"
     inkscape:window-maximized="1"
     inkscape:current-layer="g28005" /><g
     id="g28005"
     inkscape:groupmode="layer"
     inkscape:label="EMTdot"
     transform="matrix(1.3333333,0,0,-1.3333333,-239.44533,871.60664)"
     clip-path="url(#clipPath28009)"><path
       d="m 0,700.21 h 23.88 v -0.1 H 0 Z"
       style="fill:#231f20;fill-opacity:1;fill-rule:nonzero;stroke:none"
       id="path28013" /><path
       d="m 0,43.33 h 23.88 v -0.1 H 0 Z"
       style="fill:#231f20;fill-opacity:1;fill-rule:nonzero;stroke:none"
       id="path28019" /><path
       d="m 41.73,25.26 h 0.1 V 1.35 h -0.1 z"
       style="fill:#231f20;fill-opacity:1;fill-rule:nonzero;stroke:none"
       id="path28021" /><path
       d="m 572.61,25.26 h 0.1 V 1.35 h -0.1 z"
       style="fill:#231f20;fill-opacity:1;fill-rule:nonzero;stroke:none"
       id="path28023" /><path
       d="m 590.73,43.33 h 23.91 v -0.1 h -23.91 z"
       style="fill:#231f20;fill-opacity:1;fill-rule:nonzero;stroke:none"
       id="path28025" /><g
       id="g28035"
       transform="translate(196.133,582.076)"><path
         d="M 0,0 88.898,51.997"
         style="fill:none;stroke:#000000;stroke-width:1.134;stroke-linecap:butt;stroke-linejoin:miter;stroke-miterlimit:2.613;stroke-dasharray:none;stroke-opacity:1"
         id="path28037" /></g><g
       id="g28039"
       transform="translate(289.28999,636.564)"><path
         d="m 0,0 -6.418,-1.549 c 1.42,-0.639 2.061,-1.734 1.921,-3.285 L 0,0"
         style="fill:#000000;fill-opacity:1;fill-rule:evenodd;stroke:none"
         id="path28041" /></g><g
       id="g28043"
       transform="translate(196.267,582.075)"><path
         d="M 0,0 H 47.005"
         style="fill:none;stroke:#00adef;stroke-width:1.134;stroke-linecap:butt;stroke-linejoin:miter;stroke-miterlimit:2.613;stroke-dasharray:none;stroke-opacity:1"
         id="path28045" /></g><g
       id="g28047"
       transform="translate(248.224,582.075)"><path
         d="m 0,0 -6.346,1.911 c 0.907,-1.274 0.907,-2.547 0,-3.821 L 0,0"
         style="fill:#00adef;fill-opacity:1;fill-rule:evenodd;stroke:none"
         id="path28049" /></g><path
       d="m 249.686,581.91499 h 40.211"
       style="fill:none;stroke:#ff0000;stroke-width:1.134;stroke-linecap:butt;stroke-linejoin:miter;stroke-miterlimit:2.613;stroke-dasharray:5.669, 3.402;stroke-dashoffset:0;stroke-opacity:1"
       id="path28053" /><g
       id="g28055"
       transform="translate(290.722,582.033)"><path
         d="M 0,0 H 42.57 M -0.884,0.057 v 54.658"
         style="fill:none;stroke:#b2b2b2;stroke-width:0.425;stroke-linecap:butt;stroke-linejoin:miter;stroke-miterlimit:2.613;stroke-dasharray:4.252, 1.276;stroke-dashoffset:0;stroke-opacity:1"
         id="path28057" /></g><g
       id="g28059"
       transform="translate(235.595,600.409)"><path
         d="M 0,0 C 2.491,-5.313 3.985,-11.622 3.985,-17.599"
         style="fill:none;stroke:#b2b2b2;stroke-width:0.283;stroke-linecap:butt;stroke-linejoin:miter;stroke-miterlimit:2.613;stroke-dasharray:none;stroke-opacity:1"
         id="path28061" /></g><g
       id="g28063"
       transform="translate(234.049,603.70799)"><path
         d="m 0,0 2.874,-3.207 c -1,0.182 -1.749,-0.169 -2.248,-1.053 L 0,0"
         style="fill:#b2b2b2;fill-opacity:1;fill-rule:evenodd;stroke:none"
         id="path28065" /></g><path
       d="m 196.621,577.08 c 0,0 -0.472,-2.359 3.42,-2.359 3.891,0 39.976,0 39.976,0 0,0 3.065,0.371 3.065,-3.419 0,3.79 3.065,3.419 3.065,3.419 0,0 36.085,0 39.976,0 3.892,0 3.42,2.359 3.42,2.359"
       style="fill:none;stroke:#ff0000;stroke-width:0.567;stroke-linecap:butt;stroke-linejoin:miter;stroke-miterlimit:2.613;stroke-dasharray:none;stroke-opacity:1"
       id="path28069" /><g
       id="g28071"
       transform="translate(361.52,582.076)"><path
         d="M 0,0 88.899,51.997"
         style="fill:none;stroke:#000000;stroke-width:1.134;stroke-linecap:butt;stroke-linejoin:miter;stroke-miterlimit:2.613;stroke-dasharray:none;stroke-opacity:1"
         id="path28073" /></g><g
       id="g28075"
       transform="translate(454.677,636.564)"><path
         d="m 0,0 -6.418,-1.549 c 1.42,-0.639 2.061,-1.734 1.922,-3.285 L 0,0"
         style="fill:#000000;fill-opacity:1;fill-rule:evenodd;stroke:none"
         id="path28077" /></g><path
       d="M 412.849,581.91499 H 451.41"
       style="fill:none;stroke:#ff0000;stroke-width:0.567;stroke-linecap:butt;stroke-linejoin:miter;stroke-miterlimit:2.613;stroke-dasharray:none;stroke-opacity:1"
       id="path28081" /><path
       d="m 455.811,581.91499 -5.641,1.699 c 0.806,-1.133 0.806,-2.265 0,-3.397 l 5.641,1.698"
       style="fill:#ff0000;fill-opacity:1;fill-rule:evenodd;stroke:none"
       id="path28085" /><g
       id="g28087"
       transform="translate(456.11,582.033)"><path
         d="M 0,0 H 42.569 M -0.885,0.057 v 54.658"
         style="fill:none;stroke:#b2b2b2;stroke-width:0.425;stroke-linecap:butt;stroke-linejoin:miter;stroke-miterlimit:2.613;stroke-dasharray:4.252, 1.276;stroke-dashoffset:0;stroke-opacity:1"
         id="path28089" /></g><g
       id="g28091"
       transform="translate(400.98199,600.409)"><path
         d="M 0,0 C 2.491,-5.313 3.985,-11.622 3.985,-17.599"
         style="fill:none;stroke:#b2b2b2;stroke-width:0.283;stroke-linecap:butt;stroke-linejoin:miter;stroke-miterlimit:2.613;stroke-dasharray:none;stroke-opacity:1"
         id="path28093" /></g><g
       id="g28095"
       transform="translate(399.436,603.70799)"><path
         d="M 0,0 2.874,-3.207 C 1.875,-3.025 1.126,-3.376 0.626,-4.26 L 0,0"
         style="fill:#b2b2b2;fill-opacity:1;fill-rule:evenodd;stroke:none"
         id="path28097" /></g><path
       d="m 362.008,577.08 c 0,0 -0.47,-2.359 3.42,-2.359 3.891,0 39.977,0 39.977,0 0,0 3.064,0.371 3.064,-3.419 0,3.79 3.066,3.419 3.066,3.419 0,0 36.085,0 39.976,0 3.891,0 3.419,2.359 3.419,2.359"
       style="fill:none;stroke:#ff0000;stroke-width:0.567;stroke-linecap:butt;stroke-linejoin:miter;stroke-miterlimit:2.613;stroke-dasharray:none;stroke-opacity:1"
       id="path28101" /><g
       id="g28103"
       transform="translate(361.65601,582.075)"><path
         d="M 0,0 H 47.004"
         style="fill:none;stroke:#00adef;stroke-width:1.134;stroke-linecap:butt;stroke-linejoin:miter;stroke-miterlimit:2.613;stroke-dasharray:none;stroke-opacity:1"
         id="path28105" /></g><g
       id="g28107"
       transform="translate(413.61099,582.075)"><path
         d="m 0,0 -6.345,1.911 c 0.906,-1.274 0.906,-2.547 0,-3.821 L 0,0"
         style="fill:#00adef;fill-opacity:1;fill-rule:evenodd;stroke:none"
         id="path28109" /></g><g
       id="g28115"
       transform="translate(220.56799,584.957)"><path
         d="m 0,0 c -0.445,-0.393 -0.845,-0.59 -1.2,-0.59 -0.208,0 -0.381,0.069 -0.519,0.207 -0.138,0.135 -0.206,0.307 -0.206,0.512 0,0.28 0.119,0.53 0.358,0.752 C -1.327,1.104 -0.805,1.4 0,1.769 v 0.368 c 0,0.276 -0.015,0.449 -0.045,0.522 -0.03,0.071 -0.087,0.134 -0.17,0.188 -0.084,0.053 -0.177,0.08 -0.281,0.08 -0.169,0 -0.309,-0.039 -0.419,-0.114 -0.066,-0.047 -0.101,-0.101 -0.101,-0.164 0,-0.054 0.037,-0.122 0.109,-0.203 0.099,-0.113 0.15,-0.221 0.15,-0.325 C -0.757,1.993 -0.805,1.885 -0.9,1.794 -0.996,1.705 -1.12,1.66 -1.273,1.66 c -0.164,0 -0.302,0.05 -0.412,0.149 -0.111,0.1 -0.167,0.215 -0.167,0.348 0,0.187 0.075,0.366 0.223,0.536 0.149,0.172 0.356,0.302 0.621,0.393 0.265,0.091 0.541,0.136 0.828,0.136 0.347,0 0.62,-0.073 0.823,-0.22 C 0.844,2.855 0.975,2.697 1.035,2.524 1.072,2.415 1.089,2.163 1.089,1.769 V 0.352 c 0,-0.167 0.007,-0.272 0.02,-0.314 0.014,-0.044 0.032,-0.075 0.059,-0.097 0.025,-0.02 0.056,-0.031 0.089,-0.031 0.068,0 0.138,0.048 0.208,0.144 L 1.581,-0.039 C 1.452,-0.232 1.317,-0.372 1.177,-0.459 1.039,-0.546 0.88,-0.59 0.703,-0.59 0.495,-0.59 0.332,-0.54 0.215,-0.443 0.097,-0.344 0.025,-0.198 0,0 Z M 0,0.285 V 1.508 C -0.315,1.323 -0.549,1.125 -0.703,0.915 -0.805,0.773 -0.856,0.632 -0.856,0.49 c 0,-0.121 0.043,-0.226 0.129,-0.318 0.066,-0.071 0.156,-0.106 0.274,-0.106 0.13,0 0.281,0.074 0.453,0.219"
         style="fill:#000000;fill-opacity:1;fill-rule:evenodd;stroke:none"
         id="path28117" /></g><g
       id="g28143"
       transform="translate(254.201,552.351)"><path
         d="m 0,0 v -0.144 c -0.394,0.199 -0.722,0.43 -0.984,0.696 -0.375,0.377 -0.664,0.822 -0.867,1.336 -0.204,0.512 -0.305,1.044 -0.305,1.596 0,0.808 0.2,1.544 0.597,2.21 C -1.16,6.359 -0.64,6.835 0,7.121 V 6.958 C -0.32,6.78 -0.583,6.539 -0.79,6.231 -0.995,5.924 -1.148,5.535 -1.249,5.063 -1.351,4.593 -1.402,4.099 -1.402,3.587 c 0,-0.557 0.043,-1.064 0.128,-1.52 0.069,-0.36 0.151,-0.648 0.247,-0.865 C -0.931,0.984 -0.802,0.775 -0.639,0.575 -0.476,0.374 -0.263,0.183 0,0"
         style="fill:#000000;fill-opacity:1;fill-rule:evenodd;stroke:none"
         id="path28145" /></g><g
       id="g28147"
       transform="translate(258.561,559.30901)"><path
         d="M 0,0 V 0.163 C 0.396,-0.03 0.725,-0.262 0.988,-0.528 1.36,-0.908 1.648,-1.354 1.85,-1.865 2.054,-2.378 2.156,-2.911 2.156,-3.466 2.156,-4.272 1.957,-5.008 1.56,-5.674 1.162,-6.339 0.642,-6.814 0,-7.102 v 0.144 c 0.32,0.181 0.584,0.423 0.79,0.73 0.207,0.305 0.362,0.694 0.462,1.168 0.1,0.472 0.15,0.965 0.15,1.477 0,0.556 -0.044,1.061 -0.129,1.52 -0.065,0.36 -0.147,0.647 -0.244,0.865 C 0.93,-0.983 0.801,-0.775 0.64,-0.575 0.478,-0.374 0.265,-0.183 0,0"
         style="fill:#000000;fill-opacity:1;fill-rule:evenodd;stroke:none"
         id="path28149" /></g><g
       id="g28151"
       transform="translate(258.134,557.452)"><path
         d="m 0,0 -0.761,-2.647 -0.086,-0.356 c -0.008,-0.034 -0.012,-0.062 -0.012,-0.085 0,-0.041 0.014,-0.079 0.039,-0.11 0.021,-0.024 0.047,-0.035 0.079,-0.035 0.033,0 0.077,0.021 0.132,0.063 0.102,0.075 0.237,0.231 0.406,0.468 l 0.134,-0.092 c -0.18,-0.272 -0.366,-0.479 -0.555,-0.621 -0.191,-0.142 -0.367,-0.212 -0.528,-0.212 -0.112,0 -0.196,0.028 -0.252,0.084 -0.056,0.056 -0.084,0.137 -0.084,0.245 0,0.126 0.029,0.294 0.087,0.504 l 0.081,0.291 c -0.341,-0.446 -0.655,-0.755 -0.941,-0.934 -0.206,-0.126 -0.408,-0.19 -0.606,-0.19 -0.19,0 -0.354,0.079 -0.492,0.236 -0.138,0.157 -0.206,0.374 -0.206,0.65 0,0.414 0.124,0.851 0.372,1.311 0.249,0.458 0.565,0.827 0.948,1.102 0.298,0.219 0.581,0.328 0.848,0.328 0.158,0 0.29,-0.041 0.396,-0.123 0.105,-0.084 0.185,-0.222 0.24,-0.415 l 0.141,0.445 z m -1.391,-0.202 c -0.166,0 -0.342,-0.079 -0.53,-0.235 -0.266,-0.221 -0.502,-0.549 -0.71,-0.983 -0.206,-0.435 -0.31,-0.829 -0.31,-1.181 0,-0.177 0.045,-0.317 0.133,-0.42 0.088,-0.102 0.191,-0.152 0.305,-0.152 0.283,0 0.592,0.209 0.926,0.628 0.445,0.556 0.668,1.128 0.668,1.714 0,0.221 -0.043,0.381 -0.13,0.481 -0.085,0.098 -0.202,0.148 -0.352,0.148"
         style="fill:#000000;fill-opacity:1;fill-rule:evenodd;stroke:none"
         id="path28153" /></g><g
       id="g28155"
       transform="translate(399.718,562.55901)"><path
         d="m 0,0 v -0.144 c -0.393,0.199 -0.722,0.43 -0.984,0.696 -0.375,0.377 -0.664,0.822 -0.866,1.336 -0.204,0.512 -0.306,1.045 -0.306,1.596 0,0.808 0.2,1.544 0.598,2.21 C -1.16,6.359 -0.64,6.835 0,7.121 V 6.958 C -0.32,6.78 -0.583,6.539 -0.79,6.231 -0.995,5.924 -1.148,5.535 -1.249,5.063 -1.35,4.592 -1.402,4.099 -1.402,3.587 c 0,-0.557 0.043,-1.064 0.129,-1.52 0.068,-0.36 0.15,-0.648 0.246,-0.865 C -0.931,0.984 -0.801,0.775 -0.639,0.575 -0.475,0.374 -0.262,0.183 0,0"
         style="fill:#000000;fill-opacity:1;fill-rule:evenodd;stroke:none"
         id="path28157" /></g><g
       id="g28159"
       transform="translate(415.414,569.517)"><path
         d="m 0,0 v 0.163 c 0.396,-0.193 0.725,-0.425 0.988,-0.69 0.372,-0.381 0.66,-0.827 0.863,-1.339 0.203,-0.512 0.305,-1.045 0.305,-1.6 0,-0.806 -0.199,-1.542 -0.596,-2.208 C 1.164,-6.339 0.643,-6.815 0,-7.102 v 0.144 c 0.32,0.181 0.584,0.423 0.792,0.73 0.205,0.305 0.36,0.695 0.46,1.168 0.1,0.472 0.15,0.965 0.15,1.477 0,0.556 -0.043,1.061 -0.129,1.52 -0.065,0.36 -0.146,0.647 -0.244,0.865 C 0.931,-0.983 0.801,-0.775 0.64,-0.575 0.479,-0.374 0.265,-0.183 0,0"
         style="fill:#000000;fill-opacity:1;fill-rule:evenodd;stroke:none"
         id="path28161" /></g><g
       id="g28167"
       transform="translate(408.23399,567.24899)"><path
         d="m 0,0 c 0.182,0 0.336,-0.064 0.463,-0.191 0.127,-0.128 0.189,-0.28 0.189,-0.461 0,-0.18 -0.063,-0.332 -0.191,-0.459 C 0.333,-1.238 0.18,-1.3 0,-1.3 c -0.18,0 -0.333,0.062 -0.459,0.189 -0.126,0.127 -0.189,0.279 -0.189,0.459 0,0.181 0.063,0.333 0.189,0.461 C -0.333,-0.064 -0.18,0 0,0"
         style="fill:#000000;fill-opacity:1;fill-rule:evenodd;stroke:none"
         id="path28169" /></g><g
       id="g28171"
       transform="translate(413.519,564.66499)"><path
         d="m 0,0 c -0.444,-0.394 -0.845,-0.59 -1.2,-0.59 -0.208,0 -0.381,0.068 -0.518,0.207 -0.139,0.135 -0.207,0.307 -0.207,0.512 0,0.28 0.119,0.53 0.359,0.752 C -1.326,1.104 -0.805,1.4 0,1.769 V 2.137 C 0,2.413 -0.014,2.586 -0.045,2.659 -0.074,2.73 -0.132,2.793 -0.214,2.846 -0.298,2.9 -0.392,2.926 -0.496,2.926 -0.665,2.926 -0.805,2.888 -0.914,2.813 -0.98,2.766 -1.016,2.712 -1.016,2.649 c 0,-0.055 0.038,-0.123 0.111,-0.203 0.097,-0.113 0.148,-0.221 0.148,-0.325 0,-0.128 -0.048,-0.236 -0.142,-0.327 C -0.996,1.705 -1.12,1.66 -1.273,1.66 c -0.164,0 -0.301,0.05 -0.412,0.149 -0.111,0.1 -0.167,0.215 -0.167,0.348 0,0.187 0.076,0.365 0.223,0.536 0.149,0.172 0.356,0.301 0.621,0.393 0.266,0.091 0.542,0.136 0.828,0.136 0.347,0 0.62,-0.073 0.823,-0.22 C 0.845,2.854 0.976,2.697 1.035,2.524 1.072,2.414 1.09,2.162 1.09,1.769 V 0.352 c 0,-0.167 0.007,-0.272 0.02,-0.315 0.013,-0.043 0.031,-0.074 0.058,-0.096 0.026,-0.02 0.057,-0.031 0.09,-0.031 0.068,0 0.137,0.048 0.207,0.144 L 1.582,-0.039 C 1.452,-0.232 1.318,-0.372 1.178,-0.459 1.039,-0.545 0.88,-0.59 0.703,-0.59 0.495,-0.59 0.332,-0.54 0.215,-0.443 0.099,-0.345 0.025,-0.198 0,0 Z M 0,0.285 V 1.508 C -0.313,1.323 -0.549,1.125 -0.702,0.914 -0.805,0.773 -0.855,0.632 -0.855,0.49 c 0,-0.121 0.042,-0.226 0.129,-0.318 0.065,-0.071 0.157,-0.106 0.273,-0.106 0.132,0 0.281,0.074 0.453,0.219"
         style="fill:#000000;fill-opacity:1;fill-rule:evenodd;stroke:none"
         id="path28173" /></g><g
       id="g28175"
       transform="translate(422.183,564.66499)"><path
         d="m 0,0 c -0.444,-0.394 -0.845,-0.59 -1.2,-0.59 -0.208,0 -0.381,0.068 -0.518,0.207 -0.138,0.135 -0.207,0.307 -0.207,0.512 0,0.28 0.119,0.53 0.36,0.752 C -1.326,1.104 -0.805,1.4 0,1.769 V 2.137 C 0,2.413 -0.015,2.586 -0.045,2.659 -0.074,2.73 -0.132,2.793 -0.214,2.846 -0.299,2.9 -0.392,2.926 -0.496,2.926 -0.665,2.926 -0.805,2.888 -0.915,2.813 -0.98,2.766 -1.016,2.712 -1.016,2.649 c 0,-0.055 0.039,-0.123 0.11,-0.203 0.098,-0.113 0.149,-0.221 0.149,-0.325 0,-0.128 -0.048,-0.236 -0.142,-0.327 C -0.996,1.705 -1.12,1.66 -1.273,1.66 c -0.164,0 -0.301,0.05 -0.412,0.149 -0.111,0.1 -0.167,0.215 -0.167,0.348 0,0.187 0.076,0.365 0.223,0.536 0.149,0.172 0.356,0.301 0.621,0.393 0.266,0.091 0.542,0.136 0.828,0.136 0.347,0 0.62,-0.073 0.824,-0.22 C 0.844,2.854 0.976,2.697 1.035,2.524 1.072,2.414 1.09,2.162 1.09,1.769 V 0.352 c 0,-0.167 0.007,-0.272 0.02,-0.315 0.013,-0.043 0.032,-0.074 0.058,-0.096 0.026,-0.02 0.057,-0.031 0.09,-0.031 0.068,0 0.137,0.048 0.207,0.144 L 1.582,-0.039 C 1.452,-0.232 1.317,-0.372 1.177,-0.459 1.039,-0.545 0.88,-0.59 0.703,-0.59 0.495,-0.59 0.332,-0.54 0.215,-0.443 0.098,-0.345 0.025,-0.198 0,0 Z M 0,0.285 V 1.508 C -0.313,1.323 -0.549,1.125 -0.702,0.914 -0.805,0.773 -0.855,0.632 -0.855,0.49 c 0,-0.121 0.043,-0.226 0.129,-0.318 0.065,-0.071 0.157,-0.106 0.273,-0.106 0.131,0 0.281,0.074 0.453,0.219"
         style="fill:#000000;fill-opacity:1;fill-rule:evenodd;stroke:none"
         id="path28177" /></g><g
       id="g28179"
       transform="translate(419.545,552.351)"><path
         d="m 0,0 v -0.144 c -0.394,0.199 -0.721,0.43 -0.984,0.696 -0.375,0.377 -0.665,0.822 -0.867,1.336 -0.203,0.512 -0.305,1.044 -0.305,1.596 0,0.808 0.2,1.544 0.597,2.21 C -1.16,6.359 -0.64,6.835 0,7.121 V 6.958 C -0.321,6.78 -0.583,6.539 -0.79,6.231 -0.995,5.924 -1.148,5.535 -1.25,5.063 -1.351,4.593 -1.402,4.099 -1.402,3.587 c 0,-0.557 0.043,-1.064 0.128,-1.52 0.068,-0.36 0.151,-0.648 0.247,-0.865 C -0.93,0.984 -0.801,0.775 -0.638,0.575 -0.476,0.374 -0.262,0.183 0,0"
         style="fill:#000000;fill-opacity:1;fill-rule:evenodd;stroke:none"
         id="path28181" /></g><g
       id="g28183"
       transform="translate(423.905,559.30901)"><path
         d="M 0,0 V 0.163 C 0.395,-0.03 0.725,-0.262 0.987,-0.528 1.359,-0.908 1.647,-1.354 1.85,-1.865 2.054,-2.378 2.155,-2.911 2.155,-3.466 2.155,-4.272 1.957,-5.008 1.559,-5.674 1.162,-6.339 0.642,-6.814 0,-7.102 v 0.144 c 0.319,0.181 0.584,0.423 0.79,0.73 0.207,0.305 0.361,0.694 0.462,1.168 0.1,0.472 0.15,0.965 0.15,1.477 0,0.556 -0.044,1.061 -0.129,1.52 -0.064,0.36 -0.146,0.647 -0.244,0.865 C 0.93,-0.983 0.801,-0.775 0.639,-0.575 0.478,-0.374 0.265,-0.183 0,0"
         style="fill:#000000;fill-opacity:1;fill-rule:evenodd;stroke:none"
         id="path28185" /></g><g
       id="g28187"
       transform="translate(422.033,559.472)"><path
         d="m 0,0 -0.77,-2.698 c 0.251,0.26 0.468,0.439 0.655,0.534 0.186,0.098 0.381,0.144 0.584,0.144 0.287,0 0.521,-0.094 0.703,-0.283 0.182,-0.191 0.273,-0.448 0.273,-0.775 0,-0.419 -0.119,-0.836 -0.358,-1.252 -0.241,-0.415 -0.541,-0.738 -0.904,-0.971 -0.361,-0.23 -0.718,-0.346 -1.07,-0.346 -0.393,0 -0.796,0.146 -1.211,0.441 l 1.188,4.089 c 0.091,0.315 0.136,0.5 0.136,0.555 0,0.068 -0.019,0.119 -0.06,0.152 -0.061,0.049 -0.15,0.071 -0.268,0.071 -0.055,0 -0.137,-0.01 -0.249,-0.027 v 0.148 z m -1.511,-5.249 c 0.261,-0.144 0.489,-0.216 0.686,-0.216 0.23,0 0.467,0.084 0.714,0.252 0.247,0.168 0.46,0.452 0.64,0.852 0.182,0.396 0.272,0.799 0.272,1.206 0,0.24 -0.059,0.426 -0.177,0.562 -0.118,0.135 -0.259,0.203 -0.42,0.203 -0.242,0 -0.481,-0.098 -0.711,-0.291 -0.232,-0.194 -0.397,-0.464 -0.495,-0.81 l -0.509,-1.758"
         style="fill:#000000;fill-opacity:1;fill-rule:evenodd;stroke:none"
         id="path28189" /></g><g
       id="g28191"
       transform="translate(387.245,584.957)"><path
         d="m 0,0 c -0.445,-0.393 -0.845,-0.59 -1.2,-0.59 -0.208,0 -0.381,0.069 -0.518,0.207 -0.139,0.135 -0.207,0.307 -0.207,0.512 0,0.28 0.119,0.53 0.359,0.752 C -1.326,1.104 -0.805,1.4 0,1.769 v 0.368 c 0,0.276 -0.015,0.449 -0.044,0.522 -0.03,0.071 -0.087,0.134 -0.169,0.188 -0.085,0.053 -0.179,0.08 -0.283,0.08 -0.168,0 -0.309,-0.039 -0.418,-0.114 -0.067,-0.047 -0.102,-0.101 -0.102,-0.164 0,-0.054 0.038,-0.122 0.11,-0.203 0.098,-0.113 0.15,-0.221 0.15,-0.325 C -0.756,1.993 -0.805,1.885 -0.9,1.794 -0.996,1.705 -1.12,1.66 -1.273,1.66 c -0.164,0 -0.301,0.05 -0.412,0.149 -0.11,0.1 -0.167,0.215 -0.167,0.348 0,0.187 0.075,0.366 0.224,0.536 0.148,0.172 0.355,0.302 0.62,0.393 0.266,0.091 0.543,0.136 0.828,0.136 0.347,0 0.62,-0.073 0.823,-0.22 C 0.844,2.855 0.975,2.697 1.036,2.524 1.072,2.415 1.09,2.163 1.09,1.769 V 0.352 c 0,-0.167 0.006,-0.272 0.02,-0.314 0.014,-0.044 0.031,-0.075 0.059,-0.097 0.025,-0.02 0.055,-0.031 0.089,-0.031 0.069,0 0.137,0.048 0.207,0.144 L 1.583,-0.039 C 1.453,-0.232 1.317,-0.372 1.177,-0.459 1.04,-0.546 0.88,-0.59 0.704,-0.59 0.496,-0.59 0.332,-0.54 0.215,-0.443 0.097,-0.344 0.025,-0.198 0,0 Z M 0,0.285 V 1.508 C -0.314,1.323 -0.548,1.125 -0.703,0.915 -0.805,0.773 -0.856,0.632 -0.856,0.49 c 0,-0.121 0.043,-0.226 0.13,-0.318 0.065,-0.071 0.156,-0.106 0.273,-0.106 0.131,0 0.282,0.074 0.453,0.219"
         style="fill:#000000;fill-opacity:1;fill-rule:evenodd;stroke:none"
         id="path28193" /></g><text
       xml:space="preserve"
       style="font-size:30px;line-height:1.25;font-family:'Times New Roman';-inkscape-font-specification:'Times New Roman, ';stroke-width:0.75"
       x="224.90962"
       y="-643.99237"
       id="text31465"
       transform="scale(1,-1)"><tspan
         sodipodi:role="line"
         id="tspan31463"
         style="stroke-width:0.75"
         x="224.90962"
         y="-643.99237" /></text><text
       xml:space="preserve"
       style="font-size:10px;line-height:1.25;font-family:'Times New Roman';-inkscape-font-specification:'Times New Roman, ';stroke-width:0.75"
       x="263.76016"
       y="-628.30273"
       id="text33581"
       transform="scale(1,-1)"><tspan
         sodipodi:role="line"
         id="tspan33579"
         style="font-style:normal;font-variant:normal;font-weight:bold;font-stretch:normal;font-size:10px;font-family:'Times New Roman';-inkscape-font-specification:'Times New Roman,  Bold';stroke-width:0.75"
         x="263.76016"
         y="-628.30273">C</tspan></text><text
       xml:space="preserve"
       style="font-size:10px;line-height:1.25;font-family:'Times New Roman';-inkscape-font-specification:'Times New Roman, ';stroke-width:0.75"
       x="426.08688"
       y="-626.97876"
       id="text33581-2"
       transform="scale(1,-1)"><tspan
         sodipodi:role="line"
         id="tspan33579-4"
         style="font-style:normal;font-variant:normal;font-weight:bold;font-stretch:normal;font-size:10px;font-family:'Times New Roman';-inkscape-font-specification:'Times New Roman,  Bold';stroke-width:0.75"
         x="426.08688"
         y="-626.97876">C</tspan></text><text
       xml:space="preserve"
       style="font-size:10px;line-height:1.25;font-family:'Times New Roman';-inkscape-font-specification:'Times New Roman, ';stroke-width:0.75"
       x="399.95584"
       y="-563.40149"
       id="text33581-2-8"
       transform="scale(1,-1)"><tspan
         sodipodi:role="line"
         id="tspan33579-4-6"
         style="font-style:normal;font-variant:normal;font-weight:bold;font-stretch:normal;font-size:10px;font-family:'Times New Roman';-inkscape-font-specification:'Times New Roman,  Bold';stroke-width:0.75"
         x="399.95584"
         y="-563.40149">C</tspan></text><g
       id="g40024"><g
         id="g28135"
         transform="translate(244.06,567.24899)"><path
           d="m 0,0 c 0.182,0 0.336,-0.064 0.462,-0.191 0.127,-0.128 0.19,-0.28 0.19,-0.461 0,-0.18 -0.064,-0.332 -0.191,-0.459 C 0.333,-1.238 0.18,-1.3 0,-1.3 c -0.18,0 -0.334,0.062 -0.459,0.189 -0.127,0.127 -0.189,0.279 -0.189,0.459 0,0.181 0.062,0.333 0.189,0.461 C -0.334,-0.064 -0.18,0 0,0"
           style="fill:#000000;fill-opacity:1;fill-rule:evenodd;stroke:none"
           id="path28137" /></g><g
         id="g28139"
         transform="translate(249.345,564.66499)"><path
           d="m 0,0 c -0.445,-0.394 -0.845,-0.59 -1.2,-0.59 -0.208,0 -0.381,0.068 -0.518,0.207 -0.139,0.135 -0.207,0.307 -0.207,0.512 0,0.28 0.119,0.53 0.358,0.752 C -1.326,1.104 -0.805,1.4 0,1.769 v 0.368 c 0,0.276 -0.015,0.449 -0.045,0.522 -0.029,0.071 -0.087,0.134 -0.169,0.187 -0.085,0.054 -0.178,0.08 -0.282,0.08 -0.169,0 -0.309,-0.038 -0.419,-0.113 -0.066,-0.047 -0.101,-0.101 -0.101,-0.164 0,-0.055 0.038,-0.123 0.11,-0.203 C -0.808,2.333 -0.757,2.225 -0.757,2.121 -0.757,1.993 -0.805,1.885 -0.9,1.794 -0.996,1.705 -1.12,1.66 -1.273,1.66 c -0.164,0 -0.301,0.05 -0.412,0.149 -0.111,0.1 -0.167,0.215 -0.167,0.348 0,0.187 0.075,0.365 0.223,0.536 0.149,0.172 0.356,0.301 0.621,0.393 0.265,0.091 0.542,0.136 0.828,0.136 0.347,0 0.62,-0.073 0.823,-0.22 C 0.844,2.854 0.975,2.697 1.035,2.524 1.072,2.414 1.089,2.162 1.089,1.769 V 0.352 c 0,-0.167 0.007,-0.272 0.021,-0.315 0.013,-0.043 0.031,-0.074 0.058,-0.096 0.026,-0.02 0.056,-0.031 0.09,-0.031 0.068,0 0.137,0.048 0.207,0.144 L 1.582,-0.039 C 1.452,-0.232 1.317,-0.372 1.177,-0.459 1.039,-0.545 0.88,-0.59 0.703,-0.59 0.495,-0.59 0.332,-0.54 0.215,-0.443 0.097,-0.345 0.025,-0.198 0,0 Z M 0,0.285 V 1.508 C -0.315,1.323 -0.549,1.125 -0.703,0.914 -0.805,0.773 -0.856,0.632 -0.856,0.49 c 0,-0.121 0.043,-0.226 0.13,-0.318 0.065,-0.071 0.156,-0.106 0.273,-0.106 0.131,0 0.281,0.074 0.453,0.219"
           style="fill:#000000;fill-opacity:1;fill-rule:evenodd;stroke:none"
           id="path28141" /></g><text
         xml:space="preserve"
         style="font-size:10px;line-height:1.25;font-family:'Times New Roman';-inkscape-font-specification:'Times New Roman, ';stroke-width:0.75"
         x="235.07176"
         y="-563.48462"
         id="text33581-8"
         transform="scale(1,-1)"><tspan
           sodipodi:role="line"
           id="tspan33579-9"
           style="font-style:normal;font-variant:normal;font-weight:bold;font-stretch:normal;font-size:10px;font-family:'Times New Roman';-inkscape-font-specification:'Times New Roman,  Bold';stroke-width:0.75"
           x="235.07176"
           y="-563.48462">C</tspan></text></g><g
       id="g45909"><g
         id="g28119"
         transform="translate(242.84801,596.852)"><path
           d="m 0,0 c 0.06,0.279 0.104,0.532 0.133,0.761 0.028,0.228 0.043,0.44 0.043,0.635 0,0.328 -0.052,0.576 -0.155,0.746 -0.102,0.169 -0.255,0.254 -0.454,0.254 -0.264,0 -0.519,-0.205 -0.764,-0.617 C -1.444,1.367 -1.665,0.774 -1.864,0 Z m -1.945,-0.311 c -0.084,-0.334 -0.146,-0.635 -0.187,-0.903 -0.04,-0.268 -0.06,-0.507 -0.06,-0.719 0,-0.301 0.051,-0.54 0.151,-0.714 0.1,-0.175 0.236,-0.262 0.408,-0.262 0.286,0 0.565,0.226 0.834,0.676 0.27,0.451 0.508,1.091 0.718,1.922 z m -0.903,-0.957 c 0,0.395 0.061,0.81 0.185,1.241 0.124,0.43 0.299,0.84 0.526,1.228 0.268,0.458 0.55,0.806 0.848,1.045 0.297,0.238 0.597,0.357 0.902,0.357 0.378,0 0.674,-0.163 0.888,-0.488 0.215,-0.325 0.323,-0.773 0.323,-1.344 0,-0.472 -0.072,-0.94 -0.217,-1.406 -0.144,-0.466 -0.35,-0.899 -0.615,-1.296 -0.257,-0.39 -0.529,-0.686 -0.812,-0.89 -0.284,-0.204 -0.563,-0.306 -0.836,-0.306 -0.365,0 -0.655,0.166 -0.869,0.5 -0.215,0.333 -0.323,0.786 -0.323,1.359"
           style="fill:#000000;fill-opacity:1;fill-rule:evenodd;stroke:none"
           id="path28121" /></g><g
         id="g28127"
         transform="translate(250.32001,594.373)"><path
           d="m 0,0 -0.571,-1.986 -0.064,-0.267 c -0.006,-0.025 -0.009,-0.046 -0.009,-0.064 0,-0.031 0.01,-0.059 0.029,-0.082 0.016,-0.018 0.035,-0.025 0.059,-0.025 0.025,0 0.058,0.014 0.099,0.045 0.077,0.057 0.178,0.174 0.305,0.352 l 0.1,-0.07 c -0.135,-0.202 -0.274,-0.358 -0.416,-0.465 -0.143,-0.106 -0.275,-0.158 -0.396,-0.158 -0.084,0 -0.147,0.02 -0.189,0.062 -0.042,0.042 -0.063,0.104 -0.063,0.183 0,0.095 0.022,0.222 0.065,0.378 l 0.061,0.219 c -0.256,-0.334 -0.491,-0.567 -0.706,-0.7 -0.154,-0.095 -0.306,-0.142 -0.454,-0.142 -0.143,0 -0.266,0.058 -0.369,0.176 -0.104,0.119 -0.155,0.282 -0.155,0.488 0,0.31 0.093,0.638 0.279,0.983 0.187,0.344 0.424,0.62 0.711,0.827 C -1.46,-0.082 -1.248,0 -1.048,0 c 0.119,0 0.218,-0.031 0.297,-0.093 0.079,-0.063 0.139,-0.166 0.18,-0.311 l 0.106,0.334 z m -1.043,-0.152 c -0.125,0 -0.257,-0.059 -0.398,-0.176 -0.199,-0.166 -0.376,-0.412 -0.532,-0.738 -0.155,-0.326 -0.233,-0.621 -0.233,-0.885 0,-0.133 0.034,-0.238 0.1,-0.315 0.066,-0.076 0.143,-0.115 0.229,-0.115 0.212,0 0.444,0.157 0.694,0.471 0.334,0.418 0.501,0.847 0.501,1.286 0,0.166 -0.032,0.286 -0.097,0.361 -0.064,0.074 -0.152,0.111 -0.264,0.111"
           style="fill:#000000;fill-opacity:1;fill-rule:evenodd;stroke:none"
           id="path28129" /></g><text
         xml:space="preserve"
         style="font-size:6px;line-height:1.25;font-family:'Times New Roman';-inkscape-font-specification:'Times New Roman, ';stroke-width:0.75"
         x="242.85213"
         y="-591.45605"
         id="text41122"
         transform="scale(1,-1)"><tspan
           sodipodi:role="line"
           id="tspan41120"
           style="font-style:italic;font-variant:normal;font-weight:normal;font-stretch:normal;font-size:6px;font-family:'Times New Roman';-inkscape-font-specification:'Times New Roman,  Italic';stroke-width:0.75"
           x="242.85213"
           y="-591.45605">C</tspan></text></g><g
       id="g45909-7"
       transform="translate(166.84692,-0.02665798)"><g
         id="g28119-9"
         transform="translate(242.84801,596.852)"><path
           d="m 0,0 c 0.06,0.279 0.104,0.532 0.133,0.761 0.028,0.228 0.043,0.44 0.043,0.635 0,0.328 -0.052,0.576 -0.155,0.746 -0.102,0.169 -0.255,0.254 -0.454,0.254 -0.264,0 -0.519,-0.205 -0.764,-0.617 C -1.444,1.367 -1.665,0.774 -1.864,0 Z m -1.945,-0.311 c -0.084,-0.334 -0.146,-0.635 -0.187,-0.903 -0.04,-0.268 -0.06,-0.507 -0.06,-0.719 0,-0.301 0.051,-0.54 0.151,-0.714 0.1,-0.175 0.236,-0.262 0.408,-0.262 0.286,0 0.565,0.226 0.834,0.676 0.27,0.451 0.508,1.091 0.718,1.922 z m -0.903,-0.957 c 0,0.395 0.061,0.81 0.185,1.241 0.124,0.43 0.299,0.84 0.526,1.228 0.268,0.458 0.55,0.806 0.848,1.045 0.297,0.238 0.597,0.357 0.902,0.357 0.378,0 0.674,-0.163 0.888,-0.488 0.215,-0.325 0.323,-0.773 0.323,-1.344 0,-0.472 -0.072,-0.94 -0.217,-1.406 -0.144,-0.466 -0.35,-0.899 -0.615,-1.296 -0.257,-0.39 -0.529,-0.686 -0.812,-0.89 -0.284,-0.204 -0.563,-0.306 -0.836,-0.306 -0.365,0 -0.655,0.166 -0.869,0.5 -0.215,0.333 -0.323,0.786 -0.323,1.359"
           style="fill:#000000;fill-opacity:1;fill-rule:evenodd;stroke:none"
           id="path28121-7" /></g><g
         id="g28127-8"
         transform="translate(250.32001,594.373)"><path
           d="m 0,0 -0.571,-1.986 -0.064,-0.267 c -0.006,-0.025 -0.009,-0.046 -0.009,-0.064 0,-0.031 0.01,-0.059 0.029,-0.082 0.016,-0.018 0.035,-0.025 0.059,-0.025 0.025,0 0.058,0.014 0.099,0.045 0.077,0.057 0.178,0.174 0.305,0.352 l 0.1,-0.07 c -0.135,-0.202 -0.274,-0.358 -0.416,-0.465 -0.143,-0.106 -0.275,-0.158 -0.396,-0.158 -0.084,0 -0.147,0.02 -0.189,0.062 -0.042,0.042 -0.063,0.104 -0.063,0.183 0,0.095 0.022,0.222 0.065,0.378 l 0.061,0.219 c -0.256,-0.334 -0.491,-0.567 -0.706,-0.7 -0.154,-0.095 -0.306,-0.142 -0.454,-0.142 -0.143,0 -0.266,0.058 -0.369,0.176 -0.104,0.119 -0.155,0.282 -0.155,0.488 0,0.31 0.093,0.638 0.279,0.983 0.187,0.344 0.424,0.62 0.711,0.827 C -1.46,-0.082 -1.248,0 -1.048,0 c 0.119,0 0.218,-0.031 0.297,-0.093 0.079,-0.063 0.139,-0.166 0.18,-0.311 l 0.106,0.334 z m -1.043,-0.152 c -0.125,0 -0.257,-0.059 -0.398,-0.176 -0.199,-0.166 -0.376,-0.412 -0.532,-0.738 -0.155,-0.326 -0.233,-0.621 -0.233,-0.885 0,-0.133 0.034,-0.238 0.1,-0.315 0.066,-0.076 0.143,-0.115 0.229,-0.115 0.212,0 0.444,0.157 0.694,0.471 0.334,0.418 0.501,0.847 0.501,1.286 0,0.166 -0.032,0.286 -0.097,0.361 -0.064,0.074 -0.152,0.111 -0.264,0.111"
           style="fill:#000000;fill-opacity:1;fill-rule:evenodd;stroke:none"
           id="path28129-9" /></g><text
         xml:space="preserve"
         style="font-size:6px;line-height:1.25;font-family:'Times New Roman';-inkscape-font-specification:'Times New Roman, ';stroke-width:0.75"
         x="242.85213"
         y="-591.45605"
         id="text41122-7"
         transform="scale(1,-1)"><tspan
           sodipodi:role="line"
           id="tspan41120-0"
           style="font-style:italic;font-variant:normal;font-weight:normal;font-stretch:normal;font-size:6px;font-family:'Times New Roman';-inkscape-font-specification:'Times New Roman,  Italic';stroke-width:0.75"
           x="242.85213"
           y="-591.45605">C</tspan></text></g></g></svg>
