%YAML 1.1
%TAG !u! tag:unity3d.com,2011:
--- !u!21 &2100000
Material:
  serializedVersion: 6
  m_ObjectHideFlags: 0
  m_CorrespondingSourceObject: {fileID: 0}
  m_PrefabInstance: {fileID: 0}
  m_PrefabAsset: {fileID: 0}
  m_Name: Mask_PavingStones_MAT
  m_Shader: {fileID: -6465566751694194690, guid: b7c0b9854a7b18240a726fef890ef065,
    type: 3}
  m_ShaderKeywords: 
  m_LightmapFlags: 4
  m_EnableInstancingVariants: 0
  m_DoubleSidedGI: 0
  m_CustomRenderQueue: -1
  stringTagMap: {}
  disabledShaderPasses: []
  m_SavedProperties:
    serializedVersion: 3
    m_TexEnvs:
    - _MainTexture:
        m_Texture: {fileID: 2800000, guid: 182ea1172c9e92d4984454c09ede9281, type: 3}
        m_Scale: {x: 1, y: 1}
        m_Offset: {x: 0, y: 0}
    - _NormalTex:
        m_Texture: {fileID: 2800000, guid: 7168a4bdac531ca4cbb8d36d16b6656e, type: 3}
        m_Scale: {x: 1, y: 1}
        m_Offset: {x: 0, y: 0}
    m_Floats:
    - Vector1_203C29B1: 0
    - Vector1_4A92C493: 1
    - Vector1_F1B76E27: 0
    - _Metallic: 0.165
    - _Smoothness: 0.424
    m_Colors:
    - _MainColor: {r: 0.7122642, g: 0.78733224, b: 1, a: 1}
    - _SecondaryColor: {r: 1, g: 1, b: 1, a: 1}
