%YAML 1.1
%TAG !u! tag:unity3d.com,2011:
--- !u!21 &2100000
Material:
  serializedVersion: 6
  m_ObjectHideFlags: 0
  m_CorrespondingSourceObject: {fileID: 0}
  m_PrefabInstance: {fileID: 0}
  m_PrefabAsset: {fileID: 0}
  m_Name: Shader Graphs_Simple Water
  m_Shader: {fileID: -6465566751694194690, guid: 27b042674da390c46a1ff4cc2317d5f2,
    type: 3}
  m_ShaderKeywords: 
  m_LightmapFlags: 4
  m_EnableInstancingVariants: 0
  m_DoubleSidedGI: 0
  m_CustomRenderQueue: -1
  stringTagMap: {}
  disabledShaderPasses: []
  m_SavedProperties:
    serializedVersion: 3
    m_TexEnvs: []
    m_Floats:
    - Vector1_29A8EAB: 0.7
    - Vector1_3C2CF0EB: 0.0047
    - Vector1_53B9698E: 15
    - Vector1_6D9DC178: 87.3
    - Vector1_93DCFAA9: 9.91
    - Vector1_95BBCBE0: 90.37
    - Vector1_C5543ECF: 4.8
    - Vector1_E23798DE: 0.45
    m_Colors:
    - Color_A271762B: {r: 0, g: 0.47058824, b: 1.8196079, a: 0.9215686}
    - Color_AFFD055F: {r: 0.8490566, g: 0.8467092, b: 0.8442506, a: 1}
    - Color_E0824245: {r: 0.25161964, g: 1.5357349, b: 2.3396225, a: 0.4823529}
  m_BuildTextureStacks: []
