%YAML 1.1
%TAG !u! tag:unity3d.com,2011:
--- !u!114 &11400000
MonoBehaviour:
  m_ObjectHideFlags: 0
  m_CorrespondingSourceObject: {fileID: 0}
  m_PrefabInstance: {fileID: 0}
  m_PrefabAsset: {fileID: 0}
  m_GameObject: {fileID: 0}
  m_Enabled: 1
  m_EditorHideFlags: 0
  m_Script: {fileID: 11500000, guid: 4b735dc819c5cd34b9292194ac6570f4, type: 3}
  m_Name: Enemy Attack Base
  m_EditorClassIdentifier: 
  isSpecial: 0
  actionsPerSecond: 10
  energyPerAction: 10
  projectilePrefab: {fileID: 426248465037995018, guid: 4df86d8c1341c7247b96d7dcf533b915,
    type: 3}
  aimScreenCenter: 0
  attackOnDown: 1
  attackOnHold: 1
  attackOnUp: 0
  chargeOnHold: 0
  chargeTime: 1
  chargeable: {fileID: 0}
  attackNumber: 1
  bulletSeparation: 0.5
  fov: 45
