%YAML 1.1
%TAG !u! tag:unity3d.com,2011:
--- !u!21 &2100000
Material:
  serializedVersion: 6
  m_ObjectHideFlags: 0
  m_CorrespondingSourceObject: {fileID: 0}
  m_PrefabInstance: {fileID: 0}
  m_PrefabAsset: {fileID: 0}
  m_Name: Toon_Vertex_Logo
  m_Shader: {fileID: -6465566751694194690, guid: 6e4626b07a1a2ea49922976f783b065a,
    type: 3}
  m_ShaderKeywords: 
  m_LightmapFlags: 4
  m_EnableInstancingVariants: 0
  m_DoubleSidedGI: 0
  m_CustomRenderQueue: -1
  stringTagMap: {}
  disabledShaderPasses: []
  m_SavedProperties:
    serializedVersion: 3
    m_TexEnvs:
    - Texture2D_a0d314737d064dddba04e422cac6e2a3:
        m_Texture: {fileID: 2800000, guid: b1647ea301d018c43b35db58198e382e, type: 3}
        m_Scale: {x: 1, y: 1}
        m_Offset: {x: 0, y: 0}
    m_Floats:
    - Vector1_02b4005b8a69416382e3e1f9791d0104: 1
    - Vector1_1d9b514a45e141218d8652d4caafd00c: 0
    - Vector1_610805d7363e4c5a95e5a4fc2beb64ed: 0
    - Vector1_6f01ec778abc45aea7f1b0efee27f870: 0.4
    - Vector1_7e6732481a564681b4a489b4bd94631f: 5
    - Vector1_933c68c57c2a48038a6dbb856f150f0b: 0.888
    - Vector1_b531716a48f44eb69599b7339eac1a49: 0.18
    - Vector1_f0fd6eda6d1547f9b0b2babf25cd0666: 0.05
    - Vector1_fd36bbf533f74140892d9a76400243a4: 2
    - _HitEffect: 1
    m_Colors:
    - Color_7c94ed4f0fd241e1b0fa8c311979867e: {r: 1, g: 1, b: 1, a: 1}
    - Color_a2697f6422104fac8dbfa6b556508922: {r: 1.4352942, g: 0.21176471, b: 1.2941177,
        a: 1}
    - Color_af94935346864900b9ec2f92b5e1d09b: {r: 0.10852615, g: 0.8584906, b: 0.848863,
        a: 1}
    - Color_f8ba60ee1ff140e4a8e40d7bb0d38035: {r: 0, g: 0, b: 0, a: 0}
    - Vector2_7a4cf385a4b24ae6887404ff123518d9: {r: 1, g: 1, b: 0, a: 0}
    - Vector2_e043ccd6aa4647598f399cc3594e6105: {r: 0.6, g: 1, b: 0, a: 0}
  m_BuildTextureStacks: []
