{
    "m_Type": "UnityEditor.ShaderGraph.GraphData",
    "m_ObjectId": "ebfe8d495104486bad7d40073e5789d7",
    "m_Version": 2,
    "m_Properties": [
        {
            "m_Id": "24f417f1957a4561aca4ac7f5df4cca5"
        }
    ],
    "m_Keywords": [],
    "m_Nodes": [
        {
            "m_Id": "ee3c8529d4234ed795c1eba7d4349ed6"
        },
        {
            "m_Id": "27097a899b3f4196ae25ff4cb72b51d9"
        },
        {
            "m_Id": "37611e1b0c32460fb633fa3cc69a18ad"
        },
        {
            "m_Id": "1b5b65a6c5aa405aa6e97aadacdd789c"
        },
        {
            "m_Id": "8390fb4194a246b19c038f5ecaf23a86"
        },
        {
            "m_Id": "1b366b23e45f42ffa3eee34c52fed958"
        },
        {
            "m_Id": "8634d2a182364b92a8a0c883f1f3e4bb"
        },
        {
            "m_Id": "aea3d98850234498948563007db16d3b"
        },
        {
            "m_Id": "38c70e8bd6df4d8eaa465f9aefd11611"
        },
        {
            "m_Id": "34ec7fe980a44cbfa0fe0d138d0d57dd"
        },
        {
            "m_Id": "e755d12e91b948068fa068ea4641a7f9"
        }
    ],
    "m_GroupDatas": [],
    "m_StickyNoteDatas": [],
    "m_Edges": [
        {
            "m_OutputSlot": {
                "m_Node": {
                    "m_Id": "34ec7fe980a44cbfa0fe0d138d0d57dd"
                },
                "m_SlotId": 0
            },
            "m_InputSlot": {
                "m_Node": {
                    "m_Id": "1b5b65a6c5aa405aa6e97aadacdd789c"
                },
                "m_SlotId": 0
            }
        },
        {
            "m_OutputSlot": {
                "m_Node": {
                    "m_Id": "e755d12e91b948068fa068ea4641a7f9"
                },
                "m_SlotId": 0
            },
            "m_InputSlot": {
                "m_Node": {
                    "m_Id": "34ec7fe980a44cbfa0fe0d138d0d57dd"
                },
                "m_SlotId": 1
            }
        }
    ],
    "m_VertexContext": {
        "m_Position": {
            "x": 0.0,
            "y": 0.0
        },
        "m_Blocks": [
            {
                "m_Id": "ee3c8529d4234ed795c1eba7d4349ed6"
            },
            {
                "m_Id": "27097a899b3f4196ae25ff4cb72b51d9"
            },
            {
                "m_Id": "37611e1b0c32460fb633fa3cc69a18ad"
            }
        ]
    },
    "m_FragmentContext": {
        "m_Position": {
            "x": 0.0,
            "y": 200.0
        },
        "m_Blocks": [
            {
                "m_Id": "1b5b65a6c5aa405aa6e97aadacdd789c"
            },
            {
                "m_Id": "8390fb4194a246b19c038f5ecaf23a86"
            },
            {
                "m_Id": "1b366b23e45f42ffa3eee34c52fed958"
            },
            {
                "m_Id": "8634d2a182364b92a8a0c883f1f3e4bb"
            },
            {
                "m_Id": "aea3d98850234498948563007db16d3b"
            },
            {
                "m_Id": "38c70e8bd6df4d8eaa465f9aefd11611"
            }
        ]
    },
    "m_PreviewData": {
        "serializedMesh": {
            "m_SerializedMesh": "{\"mesh\":{\"instanceID\":0}}",
            "m_Guid": ""
        }
    },
    "m_Path": "Shader Graphs",
    "m_ConcretePrecision": 0,
    "m_OutputNode": {
        "m_Id": ""
    },
    "m_ActiveTargets": [
        {
            "m_Id": "64acb99c525346868f4832aad688323f"
        }
    ]
}

{
    "m_Type": "UnityEditor.ShaderGraph.TangentMaterialSlot",
    "m_ObjectId": "01b1f04fd06b46b685c96869fce76316",
    "m_Id": 0,
    "m_DisplayName": "Tangent",
    "m_SlotType": 0,
    "m_Priority": 2147483647,
    "m_Hidden": false,
    "m_ShaderOutputName": "Tangent",
    "m_StageCapability": 1,
    "m_Value": {
        "x": 0.0,
        "y": 0.0,
        "z": 0.0
    },
    "m_DefaultValue": {
        "x": 0.0,
        "y": 0.0,
        "z": 0.0
    },
    "m_Labels": [
        "X",
        "Y",
        "Z"
    ],
    "m_Space": 0
}

{
    "m_Type": "UnityEditor.ShaderGraph.BlockNode",
    "m_ObjectId": "1b366b23e45f42ffa3eee34c52fed958",
    "m_Group": {
        "m_Id": ""
    },
    "m_Name": "SurfaceDescription.Metallic",
    "m_NodeVersion": 0,
    "m_DrawState": {
        "m_Expanded": true,
        "m_Position": {
            "serializedVersion": "2",
            "x": 0.0,
            "y": 0.0,
            "width": 0.0,
            "height": 0.0
        }
    },
    "m_Slots": [
        {
            "m_Id": "57c9cf876a82414f934a95eec291fb3a"
        }
    ],
    "m_Precision": 0,
    "m_PreviewExpanded": true,
    "m_CustomColors": {
        "m_SerializableColors": []
    },
    "m_SerializedDescriptor": "SurfaceDescription.Metallic"
}

{
    "m_Type": "UnityEditor.ShaderGraph.BlockNode",
    "m_ObjectId": "1b5b65a6c5aa405aa6e97aadacdd789c",
    "m_Group": {
        "m_Id": ""
    },
    "m_Name": "SurfaceDescription.BaseColor",
    "m_NodeVersion": 0,
    "m_DrawState": {
        "m_Expanded": true,
        "m_Position": {
            "serializedVersion": "2",
            "x": 0.0,
            "y": 0.0,
            "width": 0.0,
            "height": 0.0
        }
    },
    "m_Slots": [
        {
            "m_Id": "f92d0992be8f4f289720fa5b975ff9a0"
        }
    ],
    "m_Precision": 0,
    "m_PreviewExpanded": true,
    "m_CustomColors": {
        "m_SerializableColors": []
    },
    "m_SerializedDescriptor": "SurfaceDescription.BaseColor"
}

{
    "m_Type": "UnityEditor.ShaderGraph.SamplerStateMaterialSlot",
    "m_ObjectId": "20cec6d4915f4e068e8f5f6298bf2188",
    "m_Id": 3,
    "m_DisplayName": "Sampler",
    "m_SlotType": 0,
    "m_Priority": 2147483647,
    "m_Hidden": false,
    "m_ShaderOutputName": "Sampler",
    "m_StageCapability": 3
}

{
    "m_Type": "UnityEditor.ShaderGraph.Internal.Texture2DShaderProperty",
    "m_ObjectId": "24f417f1957a4561aca4ac7f5df4cca5",
    "m_Guid": {
        "m_GuidSerialized": "b2381cd1-10e9-47ab-80eb-c4a22213cefd"
    },
    "m_Name": "_MainTexture",
    "m_DefaultReferenceName": "Texture2D_24f417f1957a4561aca4ac7f5df4cca5",
    "m_OverrideReferenceName": "_MainTexture",
    "m_GeneratePropertyBlock": true,
    "m_Precision": 0,
    "m_GPUInstanced": false,
    "m_Hidden": false,
    "m_Value": {
        "m_SerializedTexture": "{\"texture\":{\"instanceID\":0}}",
        "m_Guid": ""
    },
    "m_Modifiable": true,
    "m_DefaultType": 0
}

{
    "m_Type": "UnityEditor.ShaderGraph.BlockNode",
    "m_ObjectId": "27097a899b3f4196ae25ff4cb72b51d9",
    "m_Group": {
        "m_Id": ""
    },
    "m_Name": "VertexDescription.Normal",
    "m_NodeVersion": 0,
    "m_DrawState": {
        "m_Expanded": true,
        "m_Position": {
            "serializedVersion": "2",
            "x": 0.0,
            "y": 0.0,
            "width": 0.0,
            "height": 0.0
        }
    },
    "m_Slots": [
        {
            "m_Id": "9232a36c113544d2b8b5c7b71d4b8ac1"
        }
    ],
    "m_Precision": 0,
    "m_PreviewExpanded": true,
    "m_CustomColors": {
        "m_SerializableColors": []
    },
    "m_SerializedDescriptor": "VertexDescription.Normal"
}

{
    "m_Type": "UnityEditor.ShaderGraph.Texture2DMaterialSlot",
    "m_ObjectId": "2f80207f0e0f48319a1184a5112ef60e",
    "m_Id": 0,
    "m_DisplayName": "_MainTexture",
    "m_SlotType": 1,
    "m_Priority": 2147483647,
    "m_Hidden": false,
    "m_ShaderOutputName": "Out",
    "m_StageCapability": 3
}

{
    "m_Type": "UnityEditor.ShaderGraph.SampleTexture2DNode",
    "m_ObjectId": "34ec7fe980a44cbfa0fe0d138d0d57dd",
    "m_Group": {
        "m_Id": ""
    },
    "m_Name": "Sample Texture 2D",
    "m_NodeVersion": 0,
    "m_DrawState": {
        "m_Expanded": true,
        "m_Position": {
            "serializedVersion": "2",
            "x": -807.2000732421875,
            "y": -16.79999542236328,
            "width": 208.0,
            "height": 434.4000549316406
        }
    },
    "m_Slots": [
        {
            "m_Id": "9de948f9d3744122bb64f0259747f47b"
        },
        {
            "m_Id": "3bb3c0f1d83843eb9a18c12876c89aaf"
        },
        {
            "m_Id": "a90d74f5822443b6b8305b5ee19aad78"
        },
        {
            "m_Id": "ba1050b6637c4f82948b9dcabd29fc3d"
        },
        {
            "m_Id": "489a152bb9d44206b44500606f2a4f19"
        },
        {
            "m_Id": "e821da9a871b48e7bba124e3cd2177c1"
        },
        {
            "m_Id": "d4c22d697d3a4efcbcd2a42b1c774fe4"
        },
        {
            "m_Id": "20cec6d4915f4e068e8f5f6298bf2188"
        }
    ],
    "m_Precision": 0,
    "m_PreviewExpanded": true,
    "m_CustomColors": {
        "m_SerializableColors": []
    },
    "m_TextureType": 0,
    "m_NormalMapSpace": 0
}

{
    "m_Type": "UnityEditor.ShaderGraph.BlockNode",
    "m_ObjectId": "37611e1b0c32460fb633fa3cc69a18ad",
    "m_Group": {
        "m_Id": ""
    },
    "m_Name": "VertexDescription.Tangent",
    "m_NodeVersion": 0,
    "m_DrawState": {
        "m_Expanded": true,
        "m_Position": {
            "serializedVersion": "2",
            "x": 0.0,
            "y": 0.0,
            "width": 0.0,
            "height": 0.0
        }
    },
    "m_Slots": [
        {
            "m_Id": "01b1f04fd06b46b685c96869fce76316"
        }
    ],
    "m_Precision": 0,
    "m_PreviewExpanded": true,
    "m_CustomColors": {
        "m_SerializableColors": []
    },
    "m_SerializedDescriptor": "VertexDescription.Tangent"
}

{
    "m_Type": "UnityEditor.ShaderGraph.BlockNode",
    "m_ObjectId": "38c70e8bd6df4d8eaa465f9aefd11611",
    "m_Group": {
        "m_Id": ""
    },
    "m_Name": "SurfaceDescription.Occlusion",
    "m_NodeVersion": 0,
    "m_DrawState": {
        "m_Expanded": true,
        "m_Position": {
            "serializedVersion": "2",
            "x": 0.0,
            "y": 0.0,
            "width": 0.0,
            "height": 0.0
        }
    },
    "m_Slots": [
        {
            "m_Id": "af93096d3072430a9994ce418a480b59"
        }
    ],
    "m_Precision": 0,
    "m_PreviewExpanded": true,
    "m_CustomColors": {
        "m_SerializableColors": []
    },
    "m_SerializedDescriptor": "SurfaceDescription.Occlusion"
}

{
    "m_Type": "UnityEditor.ShaderGraph.Vector1MaterialSlot",
    "m_ObjectId": "3bb3c0f1d83843eb9a18c12876c89aaf",
    "m_Id": 4,
    "m_DisplayName": "R",
    "m_SlotType": 1,
    "m_Priority": 2147483647,
    "m_Hidden": false,
    "m_ShaderOutputName": "R",
    "m_StageCapability": 2,
    "m_Value": 0.0,
    "m_DefaultValue": 0.0,
    "m_Labels": [
        "X"
    ]
}

{
    "m_Type": "UnityEditor.ShaderGraph.Vector1MaterialSlot",
    "m_ObjectId": "489a152bb9d44206b44500606f2a4f19",
    "m_Id": 7,
    "m_DisplayName": "A",
    "m_SlotType": 1,
    "m_Priority": 2147483647,
    "m_Hidden": false,
    "m_ShaderOutputName": "A",
    "m_StageCapability": 2,
    "m_Value": 0.0,
    "m_DefaultValue": 0.0,
    "m_Labels": [
        "X"
    ]
}

{
    "m_Type": "UnityEditor.ShaderGraph.Vector1MaterialSlot",
    "m_ObjectId": "5631c71897004841a88e3849c14fc214",
    "m_Id": 0,
    "m_DisplayName": "Smoothness",
    "m_SlotType": 0,
    "m_Priority": 2147483647,
    "m_Hidden": false,
    "m_ShaderOutputName": "Smoothness",
    "m_StageCapability": 2,
    "m_Value": 0.5,
    "m_DefaultValue": 0.5,
    "m_Labels": [
        "X"
    ]
}

{
    "m_Type": "UnityEditor.ShaderGraph.Vector1MaterialSlot",
    "m_ObjectId": "57c9cf876a82414f934a95eec291fb3a",
    "m_Id": 0,
    "m_DisplayName": "Metallic",
    "m_SlotType": 0,
    "m_Priority": 2147483647,
    "m_Hidden": false,
    "m_ShaderOutputName": "Metallic",
    "m_StageCapability": 2,
    "m_Value": 0.0,
    "m_DefaultValue": 0.0,
    "m_Labels": [
        "X"
    ]
}

{
    "m_Type": "UnityEditor.ShaderGraph.ColorRGBMaterialSlot",
    "m_ObjectId": "5e9c62d184c54dee80946438353ee81d",
    "m_Id": 0,
    "m_DisplayName": "Emission",
    "m_SlotType": 0,
    "m_Priority": 2147483647,
    "m_Hidden": false,
    "m_ShaderOutputName": "Emission",
    "m_StageCapability": 2,
    "m_Value": {
        "x": 0.0,
        "y": 0.0,
        "z": 0.0
    },
    "m_DefaultValue": {
        "x": 0.0,
        "y": 0.0,
        "z": 0.0
    },
    "m_Labels": [
        "X",
        "Y",
        "Z"
    ],
    "m_ColorMode": 1
}

{
    "m_Type": "UnityEditor.Rendering.Universal.ShaderGraph.UniversalTarget",
    "m_ObjectId": "64acb99c525346868f4832aad688323f",
    "m_ActiveSubTarget": {
        "m_Id": "65e03775586644e39f727b83a6d34f16"
    },
    "m_SurfaceType": 0,
    "m_AlphaMode": 0,
    "m_TwoSided": false,
    "m_AlphaClip": false,
    "m_CustomEditorGUI": ""
}

{
    "m_Type": "UnityEditor.Rendering.Universal.ShaderGraph.UniversalLitSubTarget",
    "m_ObjectId": "65e03775586644e39f727b83a6d34f16",
    "m_WorkflowMode": 1,
    "m_NormalDropOffSpace": 0
}

{
    "m_Type": "UnityEditor.ShaderGraph.BlockNode",
    "m_ObjectId": "8390fb4194a246b19c038f5ecaf23a86",
    "m_Group": {
        "m_Id": ""
    },
    "m_Name": "SurfaceDescription.NormalTS",
    "m_NodeVersion": 0,
    "m_DrawState": {
        "m_Expanded": true,
        "m_Position": {
            "serializedVersion": "2",
            "x": 0.0,
            "y": 0.0,
            "width": 0.0,
            "height": 0.0
        }
    },
    "m_Slots": [
        {
            "m_Id": "cff24f4c90ab4c618b1cff187737c26b"
        }
    ],
    "m_Precision": 0,
    "m_PreviewExpanded": true,
    "m_CustomColors": {
        "m_SerializableColors": []
    },
    "m_SerializedDescriptor": "SurfaceDescription.NormalTS"
}

{
    "m_Type": "UnityEditor.ShaderGraph.BlockNode",
    "m_ObjectId": "8634d2a182364b92a8a0c883f1f3e4bb",
    "m_Group": {
        "m_Id": ""
    },
    "m_Name": "SurfaceDescription.Smoothness",
    "m_NodeVersion": 0,
    "m_DrawState": {
        "m_Expanded": true,
        "m_Position": {
            "serializedVersion": "2",
            "x": 0.0,
            "y": 0.0,
            "width": 0.0,
            "height": 0.0
        }
    },
    "m_Slots": [
        {
            "m_Id": "5631c71897004841a88e3849c14fc214"
        }
    ],
    "m_Precision": 0,
    "m_PreviewExpanded": true,
    "m_CustomColors": {
        "m_SerializableColors": []
    },
    "m_SerializedDescriptor": "SurfaceDescription.Smoothness"
}

{
    "m_Type": "UnityEditor.ShaderGraph.PositionMaterialSlot",
    "m_ObjectId": "90a829d46208424ead8fce9f10b7bba8",
    "m_Id": 0,
    "m_DisplayName": "Position",
    "m_SlotType": 0,
    "m_Priority": 2147483647,
    "m_Hidden": false,
    "m_ShaderOutputName": "Position",
    "m_StageCapability": 1,
    "m_Value": {
        "x": 0.0,
        "y": 0.0,
        "z": 0.0
    },
    "m_DefaultValue": {
        "x": 0.0,
        "y": 0.0,
        "z": 0.0
    },
    "m_Labels": [
        "X",
        "Y",
        "Z"
    ],
    "m_Space": 0
}

{
    "m_Type": "UnityEditor.ShaderGraph.NormalMaterialSlot",
    "m_ObjectId": "9232a36c113544d2b8b5c7b71d4b8ac1",
    "m_Id": 0,
    "m_DisplayName": "Normal",
    "m_SlotType": 0,
    "m_Priority": 2147483647,
    "m_Hidden": false,
    "m_ShaderOutputName": "Normal",
    "m_StageCapability": 1,
    "m_Value": {
        "x": 0.0,
        "y": 0.0,
        "z": 0.0
    },
    "m_DefaultValue": {
        "x": 0.0,
        "y": 0.0,
        "z": 0.0
    },
    "m_Labels": [
        "X",
        "Y",
        "Z"
    ],
    "m_Space": 0
}

{
    "m_Type": "UnityEditor.ShaderGraph.Vector4MaterialSlot",
    "m_ObjectId": "9de948f9d3744122bb64f0259747f47b",
    "m_Id": 0,
    "m_DisplayName": "RGBA",
    "m_SlotType": 1,
    "m_Priority": 2147483647,
    "m_Hidden": false,
    "m_ShaderOutputName": "RGBA",
    "m_StageCapability": 2,
    "m_Value": {
        "x": 0.0,
        "y": 0.0,
        "z": 0.0,
        "w": 0.0
    },
    "m_DefaultValue": {
        "x": 0.0,
        "y": 0.0,
        "z": 0.0,
        "w": 0.0
    }
}

{
    "m_Type": "UnityEditor.ShaderGraph.Vector1MaterialSlot",
    "m_ObjectId": "a90d74f5822443b6b8305b5ee19aad78",
    "m_Id": 5,
    "m_DisplayName": "G",
    "m_SlotType": 1,
    "m_Priority": 2147483647,
    "m_Hidden": false,
    "m_ShaderOutputName": "G",
    "m_StageCapability": 2,
    "m_Value": 0.0,
    "m_DefaultValue": 0.0,
    "m_Labels": [
        "X"
    ]
}

{
    "m_Type": "UnityEditor.ShaderGraph.BlockNode",
    "m_ObjectId": "aea3d98850234498948563007db16d3b",
    "m_Group": {
        "m_Id": ""
    },
    "m_Name": "SurfaceDescription.Emission",
    "m_NodeVersion": 0,
    "m_DrawState": {
        "m_Expanded": true,
        "m_Position": {
            "serializedVersion": "2",
            "x": 0.0,
            "y": 0.0,
            "width": 0.0,
            "height": 0.0
        }
    },
    "m_Slots": [
        {
            "m_Id": "5e9c62d184c54dee80946438353ee81d"
        }
    ],
    "m_Precision": 0,
    "m_PreviewExpanded": true,
    "m_CustomColors": {
        "m_SerializableColors": []
    },
    "m_SerializedDescriptor": "SurfaceDescription.Emission"
}

{
    "m_Type": "UnityEditor.ShaderGraph.Vector1MaterialSlot",
    "m_ObjectId": "af93096d3072430a9994ce418a480b59",
    "m_Id": 0,
    "m_DisplayName": "Ambient Occlusion",
    "m_SlotType": 0,
    "m_Priority": 2147483647,
    "m_Hidden": false,
    "m_ShaderOutputName": "Occlusion",
    "m_StageCapability": 2,
    "m_Value": 1.0,
    "m_DefaultValue": 1.0,
    "m_Labels": [
        "X"
    ]
}

{
    "m_Type": "UnityEditor.ShaderGraph.Vector1MaterialSlot",
    "m_ObjectId": "ba1050b6637c4f82948b9dcabd29fc3d",
    "m_Id": 6,
    "m_DisplayName": "B",
    "m_SlotType": 1,
    "m_Priority": 2147483647,
    "m_Hidden": false,
    "m_ShaderOutputName": "B",
    "m_StageCapability": 2,
    "m_Value": 0.0,
    "m_DefaultValue": 0.0,
    "m_Labels": [
        "X"
    ]
}

{
    "m_Type": "UnityEditor.ShaderGraph.NormalMaterialSlot",
    "m_ObjectId": "cff24f4c90ab4c618b1cff187737c26b",
    "m_Id": 0,
    "m_DisplayName": "Normal (Tangent Space)",
    "m_SlotType": 0,
    "m_Priority": 2147483647,
    "m_Hidden": false,
    "m_ShaderOutputName": "NormalTS",
    "m_StageCapability": 2,
    "m_Value": {
        "x": 0.0,
        "y": 0.0,
        "z": 0.0
    },
    "m_DefaultValue": {
        "x": 0.0,
        "y": 0.0,
        "z": 0.0
    },
    "m_Labels": [
        "X",
        "Y",
        "Z"
    ],
    "m_Space": 3
}

{
    "m_Type": "UnityEditor.ShaderGraph.UVMaterialSlot",
    "m_ObjectId": "d4c22d697d3a4efcbcd2a42b1c774fe4",
    "m_Id": 2,
    "m_DisplayName": "UV",
    "m_SlotType": 0,
    "m_Priority": 2147483647,
    "m_Hidden": false,
    "m_ShaderOutputName": "UV",
    "m_StageCapability": 3,
    "m_Value": {
        "x": 0.0,
        "y": 0.0
    },
    "m_DefaultValue": {
        "x": 0.0,
        "y": 0.0
    },
    "m_Labels": [
        "X",
        "Y"
    ],
    "m_Channel": 0
}

{
    "m_Type": "UnityEditor.ShaderGraph.PropertyNode",
    "m_ObjectId": "e755d12e91b948068fa068ea4641a7f9",
    "m_Group": {
        "m_Id": ""
    },
    "m_Name": "Property",
    "m_NodeVersion": 0,
    "m_DrawState": {
        "m_Expanded": true,
        "m_Position": {
            "serializedVersion": "2",
            "x": -1024.6500244140625,
            "y": -6.669981479644775,
            "width": 0.0,
            "height": 0.0
        }
    },
    "m_Slots": [
        {
            "m_Id": "2f80207f0e0f48319a1184a5112ef60e"
        }
    ],
    "m_Precision": 0,
    "m_PreviewExpanded": true,
    "m_CustomColors": {
        "m_SerializableColors": []
    },
    "m_Property": {
        "m_Id": "24f417f1957a4561aca4ac7f5df4cca5"
    }
}

{
    "m_Type": "UnityEditor.ShaderGraph.Texture2DInputMaterialSlot",
    "m_ObjectId": "e821da9a871b48e7bba124e3cd2177c1",
    "m_Id": 1,
    "m_DisplayName": "Texture",
    "m_SlotType": 0,
    "m_Priority": 2147483647,
    "m_Hidden": false,
    "m_ShaderOutputName": "Texture",
    "m_StageCapability": 3,
    "m_Texture": {
        "m_SerializedTexture": "{\"texture\":{\"instanceID\":0}}",
        "m_Guid": ""
    },
    "m_DefaultType": 0
}

{
    "m_Type": "UnityEditor.ShaderGraph.BlockNode",
    "m_ObjectId": "ee3c8529d4234ed795c1eba7d4349ed6",
    "m_Group": {
        "m_Id": ""
    },
    "m_Name": "VertexDescription.Position",
    "m_NodeVersion": 0,
    "m_DrawState": {
        "m_Expanded": true,
        "m_Position": {
            "serializedVersion": "2",
            "x": 0.0,
            "y": 0.0,
            "width": 0.0,
            "height": 0.0
        }
    },
    "m_Slots": [
        {
            "m_Id": "90a829d46208424ead8fce9f10b7bba8"
        }
    ],
    "m_Precision": 0,
    "m_PreviewExpanded": true,
    "m_CustomColors": {
        "m_SerializableColors": []
    },
    "m_SerializedDescriptor": "VertexDescription.Position"
}

{
    "m_Type": "UnityEditor.ShaderGraph.ColorRGBMaterialSlot",
    "m_ObjectId": "f92d0992be8f4f289720fa5b975ff9a0",
    "m_Id": 0,
    "m_DisplayName": "Base Color",
    "m_SlotType": 0,
    "m_Priority": 2147483647,
    "m_Hidden": false,
    "m_ShaderOutputName": "BaseColor",
    "m_StageCapability": 2,
    "m_Value": {
        "x": 0.5,
        "y": 0.5,
        "z": 0.5
    },
    "m_DefaultValue": {
        "x": 0.0,
        "y": 0.0,
        "z": 0.0
    },
    "m_Labels": [
        "X",
        "Y",
        "Z"
    ],
    "m_ColorMode": 0
}

