%YAML 1.1
%TAG !u! tag:unity3d.com,2011:
--- !u!21 &2100000
Material:
  serializedVersion: 6
  m_ObjectHideFlags: 0
  m_CorrespondingSourceObject: {fileID: 0}
  m_PrefabInstance: {fileID: 0}
  m_PrefabAsset: {fileID: 0}
  m_Name: Toon_Texture_Wall
  m_Shader: {fileID: -6465566751694194690, guid: e8f043c4f8d3566468d43767ee159021,
    type: 3}
  m_ShaderKeywords: BOOLEAN_43096D8976D0441EB4D65EE4A575D107_ON BOOLEAN_6DA599546C454D0EBEC1F7E35E283500_ON
  m_LightmapFlags: 4
  m_EnableInstancingVariants: 1
  m_DoubleSidedGI: 0
  m_CustomRenderQueue: -1
  stringTagMap: {}
  disabledShaderPasses: []
  m_SavedProperties:
    serializedVersion: 3
    m_TexEnvs:
    - Texture2D_a0d314737d064dddba04e422cac6e2a3:
        m_Texture: {fileID: 0}
        m_Scale: {x: 1, y: 1}
        m_Offset: {x: 0, y: 0}
    - Texture2D_f71f6edf09c441629075ffbaa771ad47:
        m_Texture: {fileID: 2800000, guid: bb5a351f44bdaf74cbd4c6be5d5e4a5e, type: 3}
        m_Scale: {x: 1, y: 1}
        m_Offset: {x: 0, y: 0}
    - _MainTexture:
        m_Texture: {fileID: 0}
        m_Scale: {x: 1, y: 1}
        m_Offset: {x: 0, y: 0}
    - unity_Lightmaps:
        m_Texture: {fileID: 0}
        m_Scale: {x: 1, y: 1}
        m_Offset: {x: 0, y: 0}
    - unity_LightmapsInd:
        m_Texture: {fileID: 0}
        m_Scale: {x: 1, y: 1}
        m_Offset: {x: 0, y: 0}
    - unity_ShadowMasks:
        m_Texture: {fileID: 0}
        m_Scale: {x: 1, y: 1}
        m_Offset: {x: 0, y: 0}
    m_Ints: []
    m_Floats:
    - BOOLEAN_43096D8976D0441EB4D65EE4A575D107: 1
    - BOOLEAN_6DA599546C454D0EBEC1F7E35E283500: 1
    - BOOLEAN_9C72444C55F04AADBBB5527E2CDAF7DF: 0
    - Vector1_01d0a3473ebb4303b43ebcb37994461d: 0.1
    - Vector1_02b4005b8a69416382e3e1f9791d0104: 2
    - Vector1_05ac236bbffd4ac0aad324adef09f643: 10
    - Vector1_1d9b514a45e141218d8652d4caafd00c: 0
    - Vector1_2690cd3ae3744303a4b29d66aa7a1ad1: 0.5
    - Vector1_3cab34096c5547ab8ef24b822a52b880: 20
    - Vector1_3e0ec0f4f1284b6e80083f791fe95c18: 0
    - Vector1_606705b2952f41c6844f793539ff9d52: 10
    - Vector1_610805d7363e4c5a95e5a4fc2beb64ed: 0.99
    - Vector1_6f01ec778abc45aea7f1b0efee27f870: 0.113
    - Vector1_7985b0dedd8545d38b2a31ee03515432: 5
    - Vector1_7e6732481a564681b4a489b4bd94631f: 9
    - Vector1_933c68c57c2a48038a6dbb856f150f0b: 0.96
    - Vector1_b531716a48f44eb69599b7339eac1a49: 0
    - Vector1_d380cd48878d4e52a6f5622702b060b5: 7
    - Vector1_e352398b8eb54345bf0befe1c5da4cde: 0.98
    - Vector1_f0fd6eda6d1547f9b0b2babf25cd0666: 0.05
    - Vector1_f227f7c309784cb095da4bad30cefc0d: 1000
    - Vector1_fd36bbf533f74140892d9a76400243a4: 1
    - _HitEffect: 1
    m_Colors:
    - Color_7c94ed4f0fd241e1b0fa8c311979867e: {r: 1, g: 1, b: 1, a: 1}
    - Color_a2697f6422104fac8dbfa6b556508922: {r: 1.3411952, g: 0.7597951, b: 0.43536177,
        a: 1}
    - Color_af94935346864900b9ec2f92b5e1d09b: {r: 0.3019608, g: 0.2101212, b: 0.043137252,
        a: 1}
    - Color_ef9f6544e33b4e56b1c9fab199d2b5ea: {r: 1, g: 1, b: 1, a: 1}
    - Color_f8ba60ee1ff140e4a8e40d7bb0d38035: {r: 0, g: 0, b: 0, a: 0}
    - Vector2_7a4cf385a4b24ae6887404ff123518d9: {r: 1, g: 1, b: 0, a: 0}
    - Vector2_e043ccd6aa4647598f399cc3594e6105: {r: 0, g: 1, b: 0, a: 0}
  m_BuildTextureStacks: []
