DATE,SALINITY,TEMPERATURE,LATITUDE,LONGITUDE
2018-01-01,30.9,6.1,53.4928,-130.6358
2018-01-02,30.8,6.8,53.4928,-130.6358
2018-01-03,30.9,6.9,53.4928,-130.6358
2018-01-04,31.1,7,53.4928,-130.6358
2018-01-05,30.9,7,53.4928,-130.6358
2018-01-06,30.9,6.7,53.4928,-130.6358
2018-01-07,30.9,6.9,53.4928,-130.6358
2018-01-08,30.7,6.8,53.4928,-130.6358
2018-01-09,31.2,7.2,53.4928,-130.6358
2018-01-10,31.3,6.8,53.4928,-130.6358
2018-01-11,31.3,6,53.4928,-130.6358
2018-01-12,31.4,6.1,53.4928,-130.6358
2018-01-13,31.1,6.4,53.4928,-130.6358
2018-01-14,30.8,7.4,53.4928,-130.6358
2018-01-15,30.9,7.5,53.4928,-130.6358
2018-01-16,31.3,7.5,53.4928,-130.6358
2018-01-17,31.3,7.2,53.4928,-130.6358
2018-01-18,31.4,7.2,53.4928,-130.6358
2018-01-19,31.6,7.5,53.4928,-130.6358
2018-01-20,31.1,7.1,53.4928,-130.6358
2018-01-21,31.4,7.1,53.4928,-130.6358
2018-01-22,31.2,6.9,53.4928,-130.6358
2018-01-23,31.3,6.7,53.4928,-130.6358
2018-01-24,31.2,6.5,53.4928,-130.6358
2018-01-25,31.3,6.9,53.4928,-130.6358
2018-01-26,31.4,6.7,53.4928,-130.6358
2018-01-27,31.1,6.7,53.4928,-130.6358
2018-01-28,31.6,6.8,53.4928,-130.6358
2018-01-29,31.5,7,53.4928,-130.6358
2018-01-30,31.4,7.1,53.4928,-130.6358
2018-01-31,31.3,7.2,53.4928,-130.6358
2018-02-01,31.4,7.1,53.4928,-130.6358
2018-02-02,31.3,7.4,53.4928,-130.6358
2018-02-03,31.5,7.3,53.4928,-130.6358
2018-02-04,31.2,7.5,53.4928,-130.6358
2018-02-05,31.5,7.1,53.4928,-130.6358
2018-02-06,31.4,7.3,53.4928,-130.6358
2018-02-07,31,7.4,53.4928,-130.6358
2018-02-08,31.4,7.1,53.4928,-130.6358
2018-02-09,31.5,6.8,53.4928,-130.6358
2018-02-10,31.4,5.9,53.4928,-130.6358
2018-02-11,31.4,7,53.4928,-130.6358
2018-02-12,31.1,6.6,53.4928,-130.6358
2018-02-13,31.2,7,53.4928,-130.6358
2018-02-14,31.3,7.2,53.4928,-130.6358
2018-02-15,31.3,6.9,53.4928,-130.6358
2018-02-16,31.2,7.1,53.4928,-130.6358
2018-02-17,30.9,7,53.4928,-130.6358
2018-02-18,31.4,6.7,53.4928,-130.6358
2018-02-19,31.3,6.6,53.4928,-130.6358
2018-02-20,31.3,6.9,53.4928,-130.6358
2018-02-21,31.5,6.4,53.4928,-130.6358
2018-02-22,31.1,6.6,53.4928,-130.6358
2018-02-23,31.4,6.4,53.4928,-130.6358
2018-02-24,31.5,6.4,53.4928,-130.6358
2018-02-25,31,6.3,53.4928,-130.6358
2018-02-26,31.4,6.4,53.4928,-130.6358
2018-02-27,31.2,6.5,53.4928,-130.6358
2018-02-28,31.4,6.5,53.4928,-130.6358
2018-03-01,31.1,6.7,53.4928,-130.6358
2018-03-02,31.3,6.7,53.4928,-130.6358
2018-03-03,31.2,6.9,53.4928,-130.6358
2018-03-04,31.3,6.7,53.4928,-130.6358
2018-03-05,31.4,6.7,53.4928,-130.6358
2018-03-06,30.9,7.1,53.4928,-130.6358
2018-03-07,31.3,6.8,53.4928,-130.6358
2018-03-08,31.2,6.9,53.4928,-130.6358
2018-03-09,31.1,6.5,53.4928,-130.6358
2018-03-10,31.3,6.2,53.4928,-130.6358
2018-03-11,31.3,6.4,53.4928,-130.6358
2018-03-12,31.3,7.1,53.4928,-130.6358
2018-03-13,31.5,7.5,53.4928,-130.6358
2018-03-14,31.5,7.5,53.4928,-130.6358
2018-03-15,30,7.5,53.4928,-130.6358
2018-03-16,30.9,7.2,53.4928,-130.6358
2018-03-17,30.9,7.3,53.4928,-130.6358
2018-03-18,31.1,7.4,53.4928,-130.6358
2018-03-19,31.5,7.3,53.4928,-130.6358
2018-03-20,31.2,7.6,53.4928,-130.6358
2018-03-21,31.5,7.6,53.4928,-130.6358
2018-03-22,31.5,7.5,53.4928,-130.6358
2018-03-23,31.4,8.2,53.4928,-130.6358
2018-03-24,31.6,7,53.4928,-130.6358
2018-03-25,30.9,6.2,53.4928,-130.6358
2018-03-26,31.4,7.2,53.4928,-130.6358
2018-03-27,31.4,7.4,53.4928,-130.6358
2018-03-28,31.4,7.7,53.4928,-130.6358
2018-03-29,31.4,7.4,53.4928,-130.6358
2018-03-30,31.3,7.3,53.4928,-130.6358
2018-03-31,31.5,7.3,53.4928,-130.6358
2018-04-01,31.5,7.4,53.4928,-130.6358
2018-04-02,29.2,7.2,53.4928,-130.6358
2018-04-03,31.4,7.6,53.4928,-130.6358
2018-04-04,31.4,7.9,53.4928,-130.6358
2018-04-05,30.7,7.5,53.4928,-130.6358
2018-04-06,31.3,7.6,53.4928,-130.6358
2018-04-07,31.5,8.4,53.4928,-130.6358
2018-04-08,31.5,7.3,53.4928,-130.6358
2018-04-09,31.3,7.7,53.4928,-130.6358
2018-04-10,31.6,7.6,53.4928,-130.6358
2018-04-11,31.3,7.6,53.4928,-130.6358
2018-04-12,30.8,8.2,53.4928,-130.6358
2018-04-13,31.4,7.3,53.4928,-130.6358
2018-04-14,31.3,7.7,53.4928,-130.6358
2018-04-15,31.4,7.7,53.4928,-130.6358
2018-04-16,31.4,7.8,53.4928,-130.6358
2018-04-17,31.4,7.8,53.4928,-130.6358
2018-04-18,31.5,7.9,53.4928,-130.6358
2018-04-19,31.1,8.1,53.4928,-130.6358
2018-04-21,31.4,8.1,53.4928,-130.6358
2018-04-22,31,8.3,53.4928,-130.6358
2018-04-23,31.4,7.7,53.4928,-130.6358
2018-04-24,30.8,8.1,53.4928,-130.6358
2018-04-25,30.5,8.2,53.4928,-130.6358
2018-04-26,31,8.5,53.4928,-130.6358
2018-04-27,30.8,8.2,53.4928,-130.6358
2018-04-28,30.8,8.2,53.4928,-130.6358
2018-04-29,30.6,8.1,53.4928,-130.6358
2018-04-30,30.6,8.4,53.4928,-130.6358
2018-05-01,30,8.8,53.4928,-130.6358
2018-05-02,30.4,9.1,53.4928,-130.6358
2018-05-03,31.4,8.8,53.4928,-130.6358
2018-05-04,31.1,8.9,53.4928,-130.6358
2018-05-05,31.3,9.3,53.4928,-130.6358
2018-05-06,29.6,9.8,53.4928,-130.6358
2018-05-07,30.9,10.2,53.4928,-130.6358
2018-05-08,31.6,9.2,53.4928,-130.6358
2018-05-09,31.1,9.8,53.4928,-130.6358
2018-05-10,31,9.8,53.4928,-130.6358
2018-05-11,30,9.6,53.4928,-130.6358
2018-05-12,31.3,10.4,53.4928,-130.6358
2018-05-13,31.1,10.5,53.4928,-130.6358
2018-05-14,31.2,10.3,53.4928,-130.6358
2018-05-15,31.4,9.2,53.4928,-130.6358
2018-05-16,30.9,9.2,53.4928,-130.6358
2018-05-17,31.6,9.4,53.4928,-130.6358
2018-05-18,31.5,9.9,53.4928,-130.6358
2018-05-19,31.4,10.1,53.4928,-130.6358
2018-05-20,31.7,10.7,53.4928,-130.6358
2018-05-21,31.3,9.8,53.4928,-130.6358
2018-05-22,31.2,9.4,53.4928,-130.6358
2018-05-23,31.4,9.7,53.4928,-130.6358
2018-05-24,31.2,9.9,53.4928,-130.6358
2018-05-25,31.4,9.7,53.4928,-130.6358
2018-05-26,31.3,9.5,53.4928,-130.6358
2018-05-28,30.6,9.9,53.4928,-130.6358
2018-05-29,31.5,10.3,53.4928,-130.6358
2018-05-30,31.4,10.6,53.4928,-130.6358
2018-05-31,31.4,10.3,53.4928,-130.6358
2018-06-01,31.3,10.3,53.4928,-130.6358
2018-06-02,31.5,10.6,53.4928,-130.6358
2018-06-03,31.1,11.3,53.4928,-130.6358
2018-06-04,31.5,11.1,53.4928,-130.6358
2018-06-05,31,10.8,53.4928,-130.6358
2018-06-06,31.2,10.9,53.4928,-130.6358
2018-06-07,30.6,10.7,53.4928,-130.6358
2018-06-08,31,10.6,53.4928,-130.6358
2018-06-09,30.9,11.7,53.4928,-130.6358
2018-06-10,31.3,11.4,53.4928,-130.6358
2018-06-11,31.2,11.5,53.4928,-130.6358
2018-06-12,31,10.8,53.4928,-130.6358
2018-06-13,31,10.8,53.4928,-130.6358
2018-06-14,31.4,10.9,53.4928,-130.6358
2018-06-15,31.4,11.4,53.4928,-130.6358
2018-06-16,31.3,11,53.4928,-130.6358
2018-06-17,30.8,11.1,53.4928,-130.6358
2018-06-18,30.6,11.2,53.4928,-130.6358
2018-06-19,31.5,11.7,53.4928,-130.6358
2018-06-20,31.7,10.7,53.4928,-130.6358
2018-06-21,30.9,11.3,53.4928,-130.6358
2018-06-22,31.5,10.6,53.4928,-130.6358
2018-06-23,31,11.7,53.4928,-130.6358
2018-06-24,31.5,12,53.4928,-130.6358
2018-06-25,30.9,12.5,53.4928,-130.6358
2018-06-26,31.1,12.3,53.4928,-130.6358
2018-06-27,31.4,12.6,53.4928,-130.6358
2018-06-28,30.2,12.2,53.4928,-130.6358
2018-06-29,30.9,12.1,53.4928,-130.6358
2018-06-30,30.9,12.6,53.4928,-130.6358
2018-07-01,30.6,13.2,53.4928,-130.6358
2018-07-02,31.1,13.2,53.4928,-130.6358
2018-07-03,31.2,12.9,53.4928,-130.6358
2018-07-04,31,13,53.4928,-130.6358
2018-07-05,31.3,12.4,53.4928,-130.6358
2018-07-06,31,12,53.4928,-130.6358
2018-07-07,31.3,12.6,53.4928,-130.6358
2018-07-08,30.9,12.7,53.4928,-130.6358
2018-07-09,31.3,13.2,53.4928,-130.6358
2018-07-10,31.2,12.9,53.4928,-130.6358
2018-07-11,31.3,13,53.4928,-130.6358
2018-07-12,30.8,13.1,53.4928,-130.6358
2018-07-13,31.1,12.2,53.4928,-130.6358
2018-07-14,31.1,11.6,53.4928,-130.6358
2018-07-15,31,11.6,53.4928,-130.6358
2018-07-16,31.1,10.6,53.4928,-130.6358
2018-07-17,31.4,10.7,53.4928,-130.6358
2018-07-18,31,11.7,53.4928,-130.6358
2018-07-19,31.2,13.1,53.4928,-130.6358
2018-07-20,31.1,12.9,53.4928,-130.6358
2018-07-21,31.4,11,53.4928,-130.6358
2018-07-22,30.9,11.1,53.4928,-130.6358
2018-07-23,31.4,11.6,53.4928,-130.6358
2018-07-24,31.4,11.3,53.4928,-130.6358
2018-07-25,31.5,11.1,53.4928,-130.6358
2018-07-26,31.5,11.4,53.4928,-130.6358
2018-07-27,31.2,11.3,53.4928,-130.6358
2018-07-28,31.5,11.1,53.4928,-130.6358
2018-07-29,31.5,11.2,53.4928,-130.6358
2018-07-30,31.6,11.1,53.4928,-130.6358
2018-07-31,31.4,11.3,53.4928,-130.6358
2018-08-02,34,14.3,53.4928,-130.6358
2018-08-06,34,14.5,53.4928,-130.6358
2018-08-07,33.1,14.6,53.4928,-130.6358
2018-08-08,33.7,14.9,53.4928,-130.6358
2018-08-09,36.6,14.2,53.4928,-130.6358
2018-08-14,29.8,14.1,53.4928,-130.6358
2018-08-15,34.6,12.6,53.4928,-130.6358
2018-08-16,34.5,13.4,53.4928,-130.6358
2018-08-18,33.7,12.7,53.4928,-130.6358
2018-08-19,34.2,12.8,53.4928,-130.6358
2018-08-20,34.6,11.7,53.4928,-130.6358
2018-08-21,33.5,13.3,53.4928,-130.6358
2018-08-22,34.6,11.4,53.4928,-130.6358
2018-08-23,34.6,12.6,53.4928,-130.6358
2018-08-24,33.1,13.7,53.4928,-130.6358
2018-08-25,33.8,12.9,53.4928,-130.6358
2018-08-26,33.4,14.4,53.4928,-130.6358
2018-08-27,33.6,13.5,53.4928,-130.6358
2018-08-28,34.1,14.4,53.4928,-130.6358
2018-08-29,33.2,14.3,53.4928,-130.6358
2018-08-30,33.7,14.5,53.4928,-130.6358
2018-08-31,34.2,13.7,53.4928,-130.6358
2018-09-01,31.7,11,53.4928,-130.6358
2018-09-02,31.8,11.5,53.4928,-130.6358
2018-09-03,31.6,11.4,53.4928,-130.6358
2018-09-04,31.4,11.5,53.4928,-130.6358
2018-09-05,31.6,11.9,53.4928,-130.6358
2018-09-06,31.8,11.5,53.4928,-130.6358
2018-09-07,31.6,11.8,53.4928,-130.6358
2018-09-08,31.5,11.6,53.4928,-130.6358
2018-09-09,31.6,11.9,53.4928,-130.6358
2018-09-10,31.3,12.1,53.4928,-130.6358
2018-09-11,31.3,12.6,53.4928,-130.6358
2018-09-12,31.5,12.2,53.4928,-130.6358
2018-09-13,31.1,12.1,53.4928,-130.6358
2018-09-14,31.9,12.5,53.4928,-130.6358
2018-09-15,31.4,12.4,53.4928,-130.6358
2018-09-16,31.7,12.4,53.4928,-130.6358
2018-09-17,31.8,11.3,53.4928,-130.6358
2018-09-18,31.7,12.3,53.4928,-130.6358
2018-09-19,31.5,13.8,53.4928,-130.6358
2018-09-20,31.3,12.6,53.4928,-130.6358
2018-09-21,31.5,13.4,53.4928,-130.6358
2018-09-22,31.5,13.1,53.4928,-130.6358
2018-09-23,31.8,12.5,53.4928,-130.6358
2018-09-24,31.5,12.7,53.4928,-130.6358
2018-09-25,31.7,12.8,53.4928,-130.6358
2018-09-26,31.7,12.4,53.4928,-130.6358
2018-09-27,31.5,13.3,53.4928,-130.6358
2018-09-28,31.9,12.2,53.4928,-130.6358
2018-09-29,31.5,12.4,53.4928,-130.6358
2018-09-30,31.5,12,53.4928,-130.6358
2018-10-01,31.7,11.9,53.4928,-130.6358
2018-10-02,31.8,11.8,53.4928,-130.6358
2018-10-03,31.8,10.8,53.4928,-130.6358
2018-10-04,31.8,12,53.4928,-130.6358
2018-10-05,31.7,11.8,53.4928,-130.6358
2018-10-06,31.9,11.9,53.4928,-130.6358
2018-10-07,31.8,11.7,53.4928,-130.6358
2018-10-08,31.6,11.9,53.4928,-130.6358
2018-10-09,31.7,11.5,53.4928,-130.6358
2018-10-10,31.7,11,53.4928,-130.6358
2018-10-11,31.8,11,53.4928,-130.6358
2018-10-12,31.7,11.3,53.4928,-130.6358
2018-10-13,31.8,11.4,53.4928,-130.6358
2018-10-14,31.7,11.3,53.4928,-130.6358
2018-10-15,31.8,11.3,53.4928,-130.6358
2018-10-16,31.8,11.6,53.4928,-130.6358
2018-10-17,31.5,11.4,53.4928,-130.6358
2018-10-18,31.4,11.5,53.4928,-130.6358
2018-10-19,31.7,11.1,53.4928,-130.6358
2018-10-20,31.5,10.9,53.4928,-130.6358
2018-10-21,31.5,11.2,53.4928,-130.6358
2018-10-22,31.3,10.7,53.4928,-130.6358
2018-10-23,30.9,10.7,53.4928,-130.6358
2018-10-24,31.7,10.6,53.4928,-130.6358
2018-10-25,31.4,11,53.4928,-130.6358
2018-10-26,31.8,10.7,53.4928,-130.6358
2018-10-27,31.3,10.9,53.4928,-130.6358
2018-10-28,31.9,10.5,53.4928,-130.6358
2018-10-29,31.3,10.9,53.4928,-130.6358
2018-10-30,31,10.5,53.4928,-130.6358
2018-10-31,31.2,10.4,53.4928,-130.6358
2018-11-01,31.3,10.5,53.4928,-130.6358
2018-11-02,31.4,10.8,53.4928,-130.6358
2018-11-03,31.5,10.7,53.4928,-130.6358
2018-11-04,31.5,10.6,53.4928,-130.6358
2018-11-05,31.4,10.6,53.4928,-130.6358
2018-11-06,30.5,10.3,53.4928,-130.6358
2018-11-07,31.7,10.1,53.4928,-130.6358
2018-11-08,31.6,9.9,53.4928,-130.6358
2018-11-09,31.5,10.1,53.4928,-130.6358
2018-11-10,31.1,10.2,53.4928,-130.6358
2018-11-11,31.9,9.8,53.4928,-130.6358
2018-11-13,31.5,10.2,53.4928,-130.6358
2018-11-14,31.6,10.1,53.4928,-130.6358
2018-11-15,31.3,9.7,53.4928,-130.6358
2018-11-16,31.8,9.3,53.4928,-130.6358
2018-11-17,31.5,9.2,53.4928,-130.6358
2018-11-18,31.5,9.5,53.4928,-130.6358
2018-11-19,31.4,9.3,53.4928,-130.6358
2018-11-20,31.2,9.1,53.4928,-130.6358
2018-11-21,31.1,9.4,53.4928,-130.6358
2018-11-22,31.2,9.2,53.4928,-130.6358
2018-11-23,31.4,9.1,53.4928,-130.6358
2018-11-24,31.4,9.2,53.4928,-130.6358
2018-11-25,31.3,9.4,53.4928,-130.6358
2018-11-26,31.3,9.5,53.4928,-130.6358
2018-11-27,31.5,9.6,53.4928,-130.6358
2018-11-28,30.9,9.7,53.4928,-130.6358
2018-11-29,30.8,9.4,53.4928,-130.6358
2018-11-30,31.2,9.5,53.4928,-130.6358
2018-12-01,31.2,8.8,53.4928,-130.6358
2018-12-02,31.1,8.6,53.4928,-130.6358
2018-12-03,31.3,8.8,53.4928,-130.6358
2018-12-04,31.3,9,53.4928,-130.6358
2018-12-05,31.4,8.7,53.4928,-130.6358
2018-12-06,31.1,8.6,53.4928,-130.6358
2018-12-07,30.4,7.3,53.4928,-130.6358
2018-12-08,31,8.4,53.4928,-130.6358
2018-12-09,30.9,8.7,53.4928,-130.6358
2018-12-10,30.9,8.9,53.4928,-130.6358
2018-12-11,30.9,8.5,53.4928,-130.6358
2018-12-12,30.9,8.4,53.4928,-130.6358
2018-12-13,31.1,8.3,53.4928,-130.6358
2018-12-14,31.3,8.4,53.4928,-130.6358
2018-12-15,31.1,8.3,53.4928,-130.6358
2018-12-16,31.3,8.6,53.4928,-130.6358
2018-12-17,31.2,8.8,53.4928,-130.6358
2018-12-18,31.2,8.9,53.4928,-130.6358
2018-12-19,30.8,8.8,53.4928,-130.6358
2018-12-20,31.3,8.6,53.4928,-130.6358
2018-12-21,31.6,8.4,53.4928,-130.6358
2018-12-22,31,8.1,53.4928,-130.6358
2018-12-23,31.3,8.1,53.4928,-130.6358
2018-12-24,31,8.4,53.4928,-130.6358
2018-12-25,31.2,8.3,53.4928,-130.6358
2018-12-26,31.4,7.9,53.4928,-130.6358
2018-12-27,30.5,8.3,53.4928,-130.6358
2018-12-28,31.1,8.7,53.4928,-130.6358
2018-12-29,31.3,8.4,53.4928,-130.6358
2018-12-30,31.2,8.4,53.4928,-130.6358
2018-12-31,31.1,7.1,53.4928,-130.6358
2019-01-01,30.3,8.2,53.4928,-130.6358
2019-01-02,30.5,8.5,53.4928,-130.6358
2019-01-03,30.7,8.5,53.4928,-130.6358
2019-01-04,30.6,8.3,53.4928,-130.6358
2019-01-05,31.3,8.1,53.4928,-130.6358
2019-01-06,31.6,7.9,53.4928,-130.6358
2019-01-07,31.2,7.4,53.4928,-130.6358
2019-01-08,31.2,7.7,53.4928,-130.6358
2019-01-09,30.7,7.6,53.4928,-130.6358
2019-01-10,30.6,7.8,53.4928,-130.6358
2019-01-11,30.4,8.1,53.4928,-130.6358
2019-01-12,31.9,7.4,53.4928,-130.6358
2019-01-13,30.9,8.2,53.4928,-130.6358
2019-01-14,30.7,8.4,53.4928,-130.6358
2019-01-15,30.9,7.9,53.4928,-130.6358
2019-01-16,30.7,7.7,53.4928,-130.6358
2019-01-17,30.8,7.3,53.4928,-130.6358
2019-01-18,30.9,8.1,53.4928,-130.6358
2019-01-19,30.8,8,53.4928,-130.6358
2019-01-20,30.8,8,53.4928,-130.6358
2019-01-21,30,8.1,53.4928,-130.6358
2019-01-22,30.7,7.9,53.4928,-130.6358
2019-01-23,30.8,8.3,53.4928,-130.6358
2019-01-24,30.1,8.2,53.4928,-130.6358
2019-01-25,30.5,8.5,53.4928,-130.6358
2019-01-26,30.8,8.4,53.4928,-130.6358
2019-01-27,30.4,8.3,53.4928,-130.6358
2019-01-28,30.2,8.1,53.4928,-130.6358
2019-01-29,30.1,7.9,53.4928,-130.6358
2019-01-30,30.5,7.7,53.4928,-130.6358
2019-01-31,30.6,8.1,53.4928,-130.6358
2019-02-01,30.3,8.2,53.4928,-130.6358
2019-02-02,30.9,7.6,53.4928,-130.6358
2019-02-03,30.9,7.2,53.4928,-130.6358
2019-02-04,30.1,7,53.4928,-130.6358
2019-02-05,31.2,7.3,53.4928,-130.6358
2019-02-06,30.6,6.9,53.4928,-130.6358
2019-02-07,31,7.1,53.4928,-130.6358
2019-02-08,30.5,7.3,53.4928,-130.6358
2019-02-09,31.7,6.4,53.4928,-130.6358
2019-02-10,31,6.7,53.4928,-130.6358
2019-02-11,31,6.6,53.4928,-130.6358
2019-02-12,30.9,6.2,53.4928,-130.6358
2019-02-13,30.7,6.3,53.4928,-130.6358
2019-02-14,30.9,5.9,53.4928,-130.6358
2019-02-15,30.6,5.8,53.4928,-130.6358
2019-02-16,30.1,6.5,53.4928,-130.6358
2019-02-17,30.7,6.6,53.4928,-130.6358
2019-02-18,30.3,6.6,53.4928,-130.6358
2019-02-19,30.7,6.6,53.4928,-130.6358
2019-02-20,30.6,6.6,53.4928,-130.6358
2019-02-21,30.6,6.7,53.4928,-130.6358
2019-02-22,30.2,6.8,53.4928,-130.6358
2019-02-23,30.1,6.7,53.4928,-130.6358
2019-02-24,30.6,6.8,53.4928,-130.6358
2019-02-25,30.8,6.2,53.4928,-130.6358
2019-02-26,31.1,6.1,53.4928,-130.6358
2019-02-27,30.9,5.9,53.4928,-130.6358
2019-02-28,30.8,6.2,53.4928,-130.6358
2019-03-01,30.8,6.3,53.4928,-130.6358
2019-03-02,31.1,6.1,53.4928,-130.6358
2019-03-03,31.1,6.4,53.4928,-130.6358
2019-03-04,30.8,6.2,53.4928,-130.6358
2019-03-05,30.8,6.5,53.4928,-130.6358
2019-03-06,30.9,6.6,53.4928,-130.6358
2019-03-07,30.9,6.7,53.4928,-130.6358
2019-03-08,31.2,6.7,53.4928,-130.6358
2019-03-09,31,6.9,53.4928,-130.6358
2019-03-10,30.6,6,53.4928,-130.6358
2019-03-11,30.9,6.9,53.4928,-130.6358
2019-03-12,31.1,7.2,53.4928,-130.6358
2019-03-13,31.1,6.9,53.4928,-130.6358
2019-03-14,31,6.7,53.4928,-130.6358
2019-03-15,29.8,6.6,53.4928,-130.6358
2019-03-16,29.7,7,53.4928,-130.6358
2019-03-17,30.9,7.4,53.4928,-130.6358
2019-03-18,30.8,7.3,53.4928,-130.6358
2019-03-19,30.9,7.4,53.4928,-130.6358
2019-03-20,30.8,7.5,53.4928,-130.6358
2019-03-21,31.1,7.4,53.4928,-130.6358
2019-03-22,31.2,7.4,53.4928,-130.6358
2019-03-23,31.5,7.6,53.4928,-130.6358
2019-03-24,31.1,8.1,53.4928,-130.6358
2019-03-25,31.3,7.8,53.4928,-130.6358
2019-03-26,31.3,7.9,53.4928,-130.6358
2019-03-27,31.1,7.5,53.4928,-130.6358
2019-03-28,30.9,7.5,53.4928,-130.6358
2019-03-29,31.1,7.5,53.4928,-130.6358
2019-03-30,31.2,7.6,53.4928,-130.6358
2019-03-31,31.2,7.6,53.4928,-130.6358
2019-04-01,31.2,8.1,53.4928,-130.6358
2019-04-02,31,8.3,53.4928,-130.6358
2019-04-03,31.2,8,53.4928,-130.6358
2019-04-04,31.2,8,53.4928,-130.6358
2019-04-05,31.3,8,53.4928,-130.6358
2019-04-06,31.2,8,53.4928,-130.6358
2019-04-07,31.4,9.2,53.4928,-130.6358
2019-04-08,31,7.9,53.4928,-130.6358
2019-04-09,31.1,8.1,53.4928,-130.6358
2019-04-10,31.1,8.7,53.4928,-130.6358
2019-04-11,31.2,9,53.4928,-130.6358
2019-04-12,31.2,9.6,53.4928,-130.6358
2019-04-13,30.2,7.8,53.4928,-130.6358
2019-04-14,31.1,8.1,53.4928,-130.6358
2019-04-15,31.2,8.2,53.4928,-130.6358
2019-04-16,31.2,8.1,53.4928,-130.6358
2019-04-17,30.9,8,53.4928,-130.6358
2019-04-18,30.8,8.4,53.4928,-130.6358
2019-04-19,31.2,8.4,53.4928,-130.6358
2019-04-20,31.4,8.5,53.4928,-130.6358
2019-04-21,31.2,8.3,53.4928,-130.6358
2019-04-22,31.1,9.3,53.4928,-130.6358
2019-04-23,31.2,8.8,53.4928,-130.6358
2019-04-24,31.2,8.9,53.4928,-130.6358
2019-04-25,31.2,9,53.4928,-130.6358
2019-04-26,31.1,9.1,53.4928,-130.6358
2019-04-27,31.2,8.2,53.4928,-130.6358
2019-04-28,31.2,9,53.4928,-130.6358
2019-04-29,31,9,53.4928,-130.6358
2019-04-30,30.9,9.3,53.4928,-130.6358
2019-05-01,31.2,8.6,53.4928,-130.6358
2019-05-02,31.2,8.6,53.4928,-130.6358
2019-05-03,30.6,8.2,53.4928,-130.6358
2019-05-04,31.8,8.7,53.4928,-130.6358
2019-05-05,31.2,9.1,53.4928,-130.6358
2019-05-06,31,8.9,53.4928,-130.6358
2019-05-07,31.2,9.8,53.4928,-130.6358
2019-05-08,31.3,9.4,53.4928,-130.6358
2019-05-09,31.4,10,53.4928,-130.6358
2019-05-10,31.2,9.8,53.4928,-130.6358
2019-05-11,31.4,9.3,53.4928,-130.6358
2019-05-12,31.5,9.2,53.4928,-130.6358
2019-05-13,31.5,9.1,53.4928,-130.6358
2019-05-14,31.1,8.1,53.4928,-130.6358
2019-05-15,31.1,9.4,53.4928,-130.6358
2019-05-16,31.3,9.1,53.4928,-130.6358
2019-05-17,31.3,9.4,53.4928,-130.6358
2019-05-18,31.2,9.7,53.4928,-130.6358
2019-05-19,30.9,9.8,53.4928,-130.6358
2019-05-20,31.3,9.6,53.4928,-130.6358
2019-05-21,31.5,9.9,53.4928,-130.6358
2019-05-22,31.1,10.1,53.4928,-130.6358
2019-05-23,31.3,10.1,53.4928,-130.6358
2019-05-24,31.3,9.8,53.4928,-130.6358
2019-05-25,31.2,9.8,53.4928,-130.6358
2019-05-26,31.2,9.8,53.4928,-130.6358
2019-05-27,31.1,9.6,53.4928,-130.6358
2019-05-28,31.2,10.2,53.4928,-130.6358
2019-05-29,31.1,9.9,53.4928,-130.6358
2019-05-30,30.7,10.1,53.4928,-130.6358
2019-05-31,31.2,9.6,53.4928,-130.6358
2019-06-01,31,10.2,53.4928,-130.6358
2019-06-02,31.4,9.7,53.4928,-130.6358
2019-06-03,30.7,10.5,53.4928,-130.6358
2019-06-04,30.9,10.9,53.4928,-130.6358
2019-06-05,31.4,11.1,53.4928,-130.6358
2019-06-06,31.3,9.9,53.4928,-130.6358
2019-06-07,31.1,10.9,53.4928,-130.6358
2019-06-08,31,11.5,53.4928,-130.6358
2019-06-09,31.3,9.6,53.4928,-130.6358
2019-06-10,31.4,10.1,53.4928,-130.6358
2019-06-11,31.5,10.5,53.4928,-130.6358
2019-06-12,31.3,10.8,53.4928,-130.6358
2019-06-13,30.1,12,53.4928,-130.6358
2019-06-14,31.6,10.4,53.4928,-130.6358
2019-06-15,31.4,10.8,53.4928,-130.6358
2019-06-16,31.4,11.2,53.4928,-130.6358
2019-06-17,31.3,11.2,53.4928,-130.6358
2019-06-18,31.5,10.6,53.4928,-130.6358
2019-06-19,32.2,10.9,53.4928,-130.6358
2019-06-20,31.2,12,53.4928,-130.6358
2019-06-21,31.5,11.3,53.4928,-130.6358
2019-06-22,31.6,10.6,53.4928,-130.6358
2019-06-23,31.5,10.5,53.4928,-130.6358
2019-06-24,31.2,11.3,53.4928,-130.6358
2019-06-25,31.3,11,53.4928,-130.6358
2019-06-26,31.3,10.6,53.4928,-130.6358
2019-06-27,31.4,10.6,53.4928,-130.6358
2019-06-28,31.7,10.9,53.4928,-130.6358
2019-06-29,32.9,9.7,53.4928,-130.6358
2019-06-30,32.5,10,53.4928,-130.6358
2019-07-01,32.3,9.8,53.4928,-130.6358
2019-07-02,32.3,10.6,53.4928,-130.6358
2019-07-03,32.2,10.2,53.4928,-130.6358
2019-07-04,31.8,10.8,53.4928,-130.6358
2019-07-05,32,10.4,53.4928,-130.6358
2019-07-08,32.1,11.8,53.4928,-130.6358
2019-07-09,32.1,13.1,53.4928,-130.6358
2019-07-10,32,12.7,53.4928,-130.6358
2019-07-11,31.6,13.1,53.4928,-130.6358
2019-07-12,31.8,12.9,53.4928,-130.6358
2019-07-13,31.6,13.7,53.4928,-130.6358
2019-07-14,31.8,13.5,53.4928,-130.6358
2019-07-15,31.6,13.1,53.4928,-130.6358
2019-07-16,31.6,11.8,53.4928,-130.6358
2019-07-17,31.3,13.4,53.4928,-130.6358
2019-07-18,31.1,13.2,53.4928,-130.6358
2019-07-19,31.4,13.2,53.4928,-130.6358
2019-07-20,31.4,13.5,53.4928,-130.6358
2019-07-21,31.5,13.5,53.4928,-130.6358
2019-07-22,31.4,13.3,53.4928,-130.6358
2019-07-23,31.7,14.7,53.4928,-130.6358
2019-07-24,31.5,14.8,53.4928,-130.6358
2019-07-25,31.4,14.3,53.4928,-130.6358
2019-07-26,30.9,14.7,53.4928,-130.6358
2019-07-27,31.2,14.9,53.4928,-130.6358
2019-08-01,31.6,14.1,53.4928,-130.6358
2019-08-02,30.5,13.1,53.4928,-130.6358
2019-08-03,32.1,13.6,53.4928,-130.6358
2019-08-04,31.2,12.1,53.4928,-130.6358
2019-08-05,32,12,53.4928,-130.6358
2019-08-06,32,11.9,53.4928,-130.6358
2019-08-07,31.8,12.1,53.4928,-130.6358
2019-08-08,32.2,12.1,53.4928,-130.6358
2019-08-09,32.1,13.4,53.4928,-130.6358
2019-08-10,31.8,14.7,53.4928,-130.6358
2019-08-11,31.8,14,53.4928,-130.6358
2019-08-12,31.8,14.6,53.4928,-130.6358
2019-08-13,31.9,14.4,53.4928,-130.6358
2019-08-14,31.7,14.1,53.4928,-130.6358
2019-08-15,31.8,14.2,53.4928,-130.6358
2019-08-16,32,13.2,53.4928,-130.6358
2019-08-17,32.1,12.3,53.4928,-130.6358
2019-08-18,31.8,13.7,53.4928,-130.6358
2019-08-19,31.1,12.9,53.4928,-130.6358
2019-08-20,30.5,14.5,53.4928,-130.6358
2019-08-21,30.9,14.2,53.4928,-130.6358
2019-08-22,30.8,12.9,53.4928,-130.6358
2019-08-23,31.4,14.5,53.4928,-130.6358
2019-08-24,31.7,13.9,53.4928,-130.6358
2019-08-25,31.7,13.2,53.4928,-130.6358
2019-08-26,31.6,13.6,53.4928,-130.6358
2019-08-27,31.6,14.1,53.4928,-130.6358
2019-08-28,31.7,14.1,53.4928,-130.6358
2019-08-29,31.9,13.2,53.4928,-130.6358
2019-08-30,31.8,12.7,53.4928,-130.6358
2019-08-31,31.4,12.1,53.4928,-130.6358
2019-09-01,32.2,12.2,53.4928,-130.6358
2019-09-02,31.2,12.2,53.4928,-130.6358
2019-09-03,32.3,12.3,53.4928,-130.6358
2019-09-04,32.3,12.6,53.4928,-130.6358
2019-09-05,32.1,12.3,53.4928,-130.6358
2019-09-06,32.1,12,53.4928,-130.6358
2019-09-07,31.9,12.5,53.4928,-130.6358
2019-09-08,32,12.7,53.4928,-130.6358
2019-09-09,32,12.5,53.4928,-130.6358
2019-09-10,32,12.6,53.4928,-130.6358
2019-09-11,32.1,13.1,53.4928,-130.6358
2019-09-12,31.7,13.9,53.4928,-130.6358
2019-09-13,31.8,13.4,53.4928,-130.6358
2019-09-14,31.7,13.3,53.4928,-130.6358
2019-09-15,31.6,13.3,53.4928,-130.6358
2019-09-16,31.7,13.1,53.4928,-130.6358
2019-09-17,31.7,13.2,53.4928,-130.6358
2019-09-18,31.6,13.1,53.4928,-130.6358
2019-09-19,31.4,13.7,53.4928,-130.6358
2019-09-20,31.7,13.1,53.4928,-130.6358
2019-09-21,31.6,13.6,53.4928,-130.6358
2019-09-22,32.6,13.5,53.4928,-130.6358
2019-09-23,31.5,12.8,53.4928,-130.6358
2019-09-24,31.7,13.7,53.4928,-130.6358
2019-09-25,31.8,13.3,53.4928,-130.6358
2019-09-26,31.6,13.2,53.4928,-130.6358
2019-09-27,31.5,13.3,53.4928,-130.6358
2019-09-28,31.1,12.2,53.4928,-130.6358
2019-09-29,32.3,11.9,53.4928,-130.6358
2019-09-30,32,11.8,53.4928,-130.6358
2019-10-01,32.1,12.1,53.4928,-130.6358
2019-10-02,31.6,12.7,53.4928,-130.6358
2019-10-03,31.4,12.5,53.4928,-130.6358
2019-10-04,31.3,13,53.4928,-130.6358
2019-10-05,32.2,12.6,53.4928,-130.6358
2019-10-06,31.9,12.3,53.4928,-130.6358
2019-10-07,32.1,12,53.4928,-130.6358
2019-10-08,32.3,11.7,53.4928,-130.6358
2019-10-09,32.2,11.8,53.4928,-130.6358
2019-10-10,31.8,12.1,53.4928,-130.6358
2019-10-11,31.2,10.9,53.4928,-130.6358
2019-10-12,31.7,11.8,53.4928,-130.6358
2019-10-13,31.5,11.6,53.4928,-130.6358
2019-10-14,31.8,11.1,53.4928,-130.6358
2019-10-15,31.8,11.4,53.4928,-130.6358
2019-10-16,32,11.4,53.4928,-130.6358
2019-10-17,31.8,11.6,53.4928,-130.6358
2019-10-18,31.5,11.8,53.4928,-130.6358
2019-10-19,31.5,11.4,53.4928,-130.6358
2019-10-20,31.6,11.5,53.4928,-130.6358
2019-10-21,30.9,11.3,53.4928,-130.6358
2019-10-22,31.7,10.9,53.4928,-130.6358
2019-10-23,31.8,10.7,53.4928,-130.6358
2019-10-24,31.5,11.1,53.4928,-130.6358
2019-10-25,31.8,10.8,53.4928,-130.6358
2019-10-26,32.1,10.7,53.4928,-130.6358
2019-10-27,32,10.6,53.4928,-130.6358
2019-10-28,32.1,10.5,53.4928,-130.6358
2019-10-29,32.2,10.3,53.4928,-130.6358
2019-10-30,32.4,10.4,53.4928,-130.6358
2019-10-31,31.8,10.5,53.4928,-130.6358
2019-11-01,32.1,10.7,53.4928,-130.6358
2019-11-02,31.4,10.8,53.4928,-130.6358
2019-11-03,31.5,10.6,53.4928,-130.6358
2019-11-04,31.4,10.5,53.4928,-130.6358
2019-11-05,31.5,10.6,53.4928,-130.6358
2019-11-06,31.3,10.6,53.4928,-130.6358
2019-11-07,31.1,10,53.4928,-130.6358
2019-11-08,30.6,10.2,53.4928,-130.6358
2019-11-09,31,10.3,53.4928,-130.6358
2019-11-10,31.2,10.7,53.4928,-130.6358
2019-11-11,31.3,10,53.4928,-130.6358
2019-11-12,31.2,10.4,53.4928,-130.6358
2019-11-13,31.5,10.2,53.4928,-130.6358
2019-11-14,31.5,10.5,53.4928,-130.6358
2019-11-15,31.8,10.3,53.4928,-130.6358
2019-11-16,31.6,10.4,53.4928,-130.6358
2019-11-17,31.7,10.4,53.4928,-130.6358
2019-11-18,31.7,10.4,53.4928,-130.6358
2019-11-19,31.8,10,53.4928,-130.6358
2019-11-20,31.8,9.9,53.4928,-130.6358
2019-11-21,31.7,9.1,53.4928,-130.6358
2019-11-22,30.8,10,53.4928,-130.6358
2019-11-23,31.8,10.1,53.4928,-130.6358
2019-11-24,31.9,9.8,53.4928,-130.6358
2019-11-25,31.9,9.5,53.4928,-130.6358
2019-11-26,32,9.6,53.4928,-130.6358
2019-11-27,32.1,9.3,53.4928,-130.6358
2019-11-28,32,9.1,53.4928,-130.6358
2019-11-29,32.2,8.8,53.4928,-130.6358
2019-11-30,32.2,8.6,53.4928,-130.6358
2019-12-01,32,8.7,53.4928,-130.6358
2019-12-02,32.3,9.3,53.4928,-130.6358
2019-12-03,32.1,9,53.4928,-130.6358
2019-12-04,31.5,8.1,53.4928,-130.6358
2019-12-05,31.2,8.1,53.4928,-130.6358
2019-12-06,31,7.6,53.4928,-130.6358
2019-12-07,31.4,7.6,53.4928,-130.6358
2019-12-08,31.2,8.2,53.4928,-130.6358
2019-12-09,31.1,8,53.4928,-130.6358
2019-12-10,30.9,8.3,53.4928,-130.6358
2019-12-11,30.9,8.2,53.4928,-130.6358
2019-12-12,31,8.3,53.4928,-130.6358
2019-12-13,30.9,8.2,53.4928,-130.6358
2019-12-14,31.1,8.1,53.4928,-130.6358
2019-12-15,31.2,7.3,53.4928,-130.6358
2019-12-16,31.2,8.1,53.4928,-130.6358
2019-12-17,30.9,8.6,53.4928,-130.6358
2019-12-18,31.2,8.6,53.4928,-130.6358
2019-12-19,31,8.4,53.4928,-130.6358
2019-12-20,30.9,8.1,53.4928,-130.6358
2019-12-21,31.1,7.8,53.4928,-130.6358
2019-12-22,31.6,8.4,53.4928,-130.6358
2019-12-23,31.5,8.1,53.4928,-130.6358
2019-12-24,31.6,8.2,53.4928,-130.6358
2019-12-25,31.7,8.2,53.4928,-130.6358
2019-12-26,31.1,8.1,53.4928,-130.6358
2019-12-27,31.6,7.7,53.4928,-130.6358
2019-12-28,31.2,8.4,53.4928,-130.6358
2019-12-29,31.5,8.5,53.4928,-130.6358
2019-12-30,30.9,8.8,53.4928,-130.6358
2019-12-31,31.2,8.7,53.4928,-130.6358
2020-01-01,31.7,7.8,53.4928,-130.6358
2020-01-02,31.8,7.6,53.4928,-130.6358
2020-01-03,31.6,7.9,53.4928,-130.6358
2020-01-04,31.4,7,53.4928,-130.6358
2020-01-05,31.3,6.7,53.4928,-130.6358
2020-01-06,31.5,6.7,53.4928,-130.6358
2020-01-07,31.6,7.4,53.4928,-130.6358
2020-01-08,31.7,7.6,53.4928,-130.6358
2020-01-09,31.7,7.7,53.4928,-130.6358
2020-01-10,31.4,7.5,53.4928,-130.6358
2020-01-11,31.7,7.6,53.4928,-130.6358
2020-01-12,31.8,7.2,53.4928,-130.6358
2020-01-13,31.7,6.9,53.4928,-130.6358
2020-01-14,31.8,5.8,53.4928,-130.6358
2020-01-15,31.9,5.9,53.4928,-130.6358
2020-01-16,31.8,5.8,53.4928,-130.6358
2020-01-17,31.8,6,53.4928,-130.6358
2020-01-18,31.4,5.9,53.4928,-130.6358
2020-01-19,31.6,6.4,53.4928,-130.6358
2020-01-20,31.6,6.8,53.4928,-130.6358
2020-01-21,31.3,6.5,53.4928,-130.6358
2020-01-22,30.8,6.9,53.4928,-130.6358
2020-01-23,31.1,7.3,53.4928,-130.6358
2020-01-24,30.9,7.4,53.4928,-130.6358
2020-01-25,31,7.6,53.4928,-130.6358
2020-01-26,31,7.3,53.4928,-130.6358
2020-01-27,31.1,7.2,53.4928,-130.6358
2020-01-28,31.3,7.1,53.4928,-130.6358
2020-01-29,31.1,7.2,53.4928,-130.6358
2020-01-30,31.2,7.5,53.4928,-130.6358
2020-01-31,31.4,7.1,53.4928,-130.6358
2020-02-01,31.3,6.3,53.4928,-130.6358
2020-02-02,31.4,6.2,53.4928,-130.6358
2020-02-03,31.5,6,53.4928,-130.6358
2020-02-04,31.3,6.8,53.4928,-130.6358
2020-02-05,31.2,7.2,53.4928,-130.6358
2020-02-06,31.2,7.4,53.4928,-130.6358
2020-02-07,31.6,7.3,53.4928,-130.6358
2020-02-08,31.7,7.2,53.4928,-130.6358
2020-02-09,31.8,7.1,53.4928,-130.6358
2020-02-10,31.8,7.2,53.4928,-130.6358
2020-02-11,31.6,7.3,53.4928,-130.6358
2020-02-12,31.7,6.9,53.4928,-130.6358
2020-02-13,31.2,7.1,53.4928,-130.6358
2020-02-14,31.3,7.2,53.4928,-130.6358
2020-02-15,30.9,7.4,53.4928,-130.6358
2020-02-16,30.2,7,53.4928,-130.6358
2020-02-17,31.3,6.9,53.4928,-130.6358
2020-02-18,31.5,6.8,53.4928,-130.6358
2020-02-19,31.2,6.3,53.4928,-130.6358
2020-02-20,30.8,7,53.4928,-130.6358
2020-02-21,30.9,7.1,53.4928,-130.6358
2020-02-22,31.4,7.1,53.4928,-130.6358
2020-02-23,31.5,6.7,53.4928,-130.6358
2020-02-24,31.5,6.7,53.4928,-130.6358
2020-02-25,30.4,7.3,53.4928,-130.6358
2020-02-26,31.1,7,53.4928,-130.6358
2020-02-27,31.3,7.8,53.4928,-130.6358
2020-02-28,31.3,7.4,53.4928,-130.6358
2020-02-29,31.4,7.2,53.4928,-130.6358
2020-03-01,31.2,7.1,53.4928,-130.6358
2020-03-02,31.2,6.9,53.4928,-130.6358
2020-03-03,31.3,7,53.4928,-130.6358
2020-03-05,31.4,6.5,53.4928,-130.6358
2020-03-06,31.2,6.4,53.4928,-130.6358
2020-03-07,31.4,7.1,53.4928,-130.6358
2020-03-08,31.6,6.8,53.4928,-130.6358
2020-03-09,31.3,6.6,53.4928,-130.6358
2020-03-10,31.4,6.8,53.4928,-130.6358
2020-03-11,31.3,7,53.4928,-130.6358
2020-03-12,31.7,7,53.4928,-130.6358
2020-03-13,31.4,6.8,53.4928,-130.6358
2020-03-14,31.5,6.5,53.4928,-130.6358
2020-03-15,31.5,7.2,53.4928,-130.6358
2020-03-16,31.6,7,53.4928,-130.6358
2020-03-17,31.4,6.6,53.4928,-130.6358
2020-03-18,31.7,6.8,53.4928,-130.6358
2020-03-19,31.6,7.5,53.4928,-130.6358
2020-03-20,31.6,7.6,53.4928,-130.6358
2020-03-21,31.3,7.5,53.4928,-130.6358
2020-03-22,30.8,7,53.4928,-130.6358
2020-03-23,31.2,7.4,53.4928,-130.6358
2020-03-24,31.4,7.6,53.4928,-130.6358
2020-03-25,31.7,7.5,53.4928,-130.6358
2020-03-26,31.8,7.7,53.4928,-130.6358
2020-03-27,31.1,8.1,53.4928,-130.6358
2020-03-28,31.5,7.3,53.4928,-130.6358
2020-03-29,31.4,7.2,53.4928,-130.6358
2020-03-30,31.3,7.5,53.4928,-130.6358
2020-03-31,31.5,7.3,53.4928,-130.6358
2020-04-01,31.4,6.1,53.4928,-130.6358
2020-04-02,31.4,6.5,53.4928,-130.6358
2020-04-03,31.2,6.3,53.4928,-130.6358
2020-04-04,31.3,6.2,53.4928,-130.6358
2020-04-05,30.9,7.3,53.4928,-130.6358
2020-04-06,31.5,7.3,53.4928,-130.6358
2020-04-07,31.3,7.2,53.4928,-130.6358
2020-04-08,31.7,7.1,53.4928,-130.6358
2020-04-09,31.4,7.4,53.4928,-130.6358
2020-04-10,30.8,7.8,53.4928,-130.6358
2020-04-11,31.7,8,53.4928,-130.6358
2020-04-12,31.6,8.2,53.4928,-130.6358
2020-04-13,31.5,8.1,53.4928,-130.6358
2020-04-14,31.4,8,53.4928,-130.6358
2020-04-15,31.6,7.8,53.4928,-130.6358
2020-04-16,31.8,7.8,53.4928,-130.6358
2020-04-17,31.7,7.8,53.4928,-130.6358
2020-04-18,31.8,8.2,53.4928,-130.6358
2020-04-19,31.6,8.1,53.4928,-130.6358
2020-04-20,31.8,8.5,53.4928,-130.6358
2020-04-21,31.1,8.4,53.4928,-130.6358
2020-04-22,31.4,8.3,53.4928,-130.6358
2020-04-23,31.7,8.7,53.4928,-130.6358
2020-04-24,31.7,8.6,53.4928,-130.6358
2020-04-25,31.6,8.8,53.4928,-130.6358
2020-04-27,31.6,9.4,53.4928,-130.6358
2020-04-28,31.4,8.9,53.4928,-130.6358
2020-04-29,31.6,8.8,53.4928,-130.6358
2020-04-30,32.1,10.1,53.4928,-130.6358
2020-05-01,31.7,8.5,53.4928,-130.6358
2020-05-02,31.6,8.7,53.4928,-130.6358
2020-05-03,31.7,8.6,53.4928,-130.6358
2020-05-04,31.3,9,53.4928,-130.6358
2020-05-05,31.4,8.9,53.4928,-130.6358
2020-05-06,31.8,8.9,53.4928,-130.6358
2020-05-07,31.5,9.1,53.4928,-130.6358
2020-05-08,31.6,9.3,53.4928,-130.6358
2020-05-09,31.7,9.3,53.4928,-130.6358
2020-05-10,31.7,9.8,53.4928,-130.6358
2020-05-11,31.7,10,53.4928,-130.6358
2020-05-12,31.9,9.9,53.4928,-130.6358
2020-05-13,32,11.2,53.4928,-130.6358
2020-05-14,31.8,10.4,53.4928,-130.6358
2020-05-15,31.8,9.8,53.4928,-130.6358
2020-05-16,31.2,10.3,53.4928,-130.6358
2020-05-17,31.3,12,53.4928,-130.6358
2020-05-18,31.6,10.7,53.4928,-130.6358
2020-05-19,31.5,10.6,53.4928,-130.6358
2020-05-20,31.3,10.9,53.4928,-130.6358
2020-05-21,31.5,10.7,53.4928,-130.6358
2020-05-22,31.6,9.9,53.4928,-130.6358
2020-05-23,31.1,10.2,53.4928,-130.6358
2020-05-24,31.4,10.1,53.4928,-130.6358
2020-05-25,31.5,10.9,53.4928,-130.6358
2020-05-26,31.6,11.2,53.4928,-130.6358
2020-05-27,31.6,10.7,53.4928,-130.6358
2020-05-28,31.5,11.2,53.4928,-130.6358
2020-05-29,31.6,11,53.4928,-130.6358
2020-05-30,31.5,11.4,53.4928,-130.6358
2020-05-31,31.7,11,53.4928,-130.6358
2020-06-01,31.6,11.1,53.4928,-130.6358
2020-06-02,31.6,11.3,53.4928,-130.6358
2020-06-03,31.5,11.2,53.4928,-130.6358
2020-06-04,31.5,11.1,53.4928,-130.6358
2020-06-05,31.4,11.2,53.4928,-130.6358
2020-06-06,31.4,11.3,53.4928,-130.6358
2020-06-07,31.4,11,53.4928,-130.6358
2020-06-08,31.4,11.8,53.4928,-130.6358
2020-06-09,31.5,11.4,53.4928,-130.6358
2020-06-10,31.4,11,53.4928,-130.6358
2020-06-11,31.6,11.2,53.4928,-130.6358
2020-06-12,31.6,11.7,53.4928,-130.6358
2020-06-13,31.5,12.1,53.4928,-130.6358
2020-06-14,31.6,11.9,53.4928,-130.6358
2020-06-15,31.6,11.9,53.4928,-130.6358
2020-06-16,31.7,12.4,53.4928,-130.6358
2020-06-17,31.4,12.1,53.4928,-130.6358
2020-06-18,31.4,11.8,53.4928,-130.6358
2020-06-19,31.5,11.7,53.4928,-130.6358
2020-06-20,31.4,12.3,53.4928,-130.6358
2020-06-21,31.4,12.4,53.4928,-130.6358
2020-06-22,31.2,12.2,53.4928,-130.6358
2020-06-23,31,12.6,53.4928,-130.6358
2020-06-24,31.2,12.4,53.4928,-130.6358
2020-06-25,31,11.6,53.4928,-130.6358
2020-06-26,31.4,11.7,53.4928,-130.6358
2020-06-27,31.3,11.8,53.4928,-130.6358
2020-06-28,31.5,11.6,53.4928,-130.6358
2020-06-29,31.4,12.3,53.4928,-130.6358
2020-06-30,30.8,11.7,53.4928,-130.6358
2020-07-01,31.2,11.8,53.4928,-130.6358
2020-07-02,30.7,11.2,53.4928,-130.6358
2020-07-03,30.8,12.3,53.4928,-130.6358
2020-07-04,31.1,12.3,53.4928,-130.6358
2020-07-05,30.8,12.2,53.4928,-130.6358
2020-07-06,31.1,12,53.4928,-130.6358
2020-07-07,31.2,12.6,53.4928,-130.6358
2020-07-08,31,13.4,53.4928,-130.6358
2020-07-09,31.4,13.6,53.4928,-130.6358
2020-07-11,31.2,13,53.4928,-130.6358
2020-07-12,31.4,14.1,53.4928,-130.6358
2020-07-13,31.3,14.7,53.4928,-130.6358
2020-07-14,30.9,13.8,53.4928,-130.6358
2020-07-15,30.8,13.4,53.4928,-130.6358
2020-07-16,31.1,13.2,53.4928,-130.6358
2020-07-17,31.4,13.2,53.4928,-130.6358
2020-07-18,31.1,13.4,53.4928,-130.6358
2020-07-19,31.1,13.8,53.4928,-130.6358
2020-07-20,31.4,13.2,53.4928,-130.6358
2020-07-21,31.3,13.3,53.4928,-130.6358
2020-07-22,31.4,12.6,53.4928,-130.6358
2020-07-23,31.5,12.1,53.4928,-130.6358
2020-07-24,30.9,12.3,53.4928,-130.6358
2020-07-25,31.1,12.2,53.4928,-130.6358
2020-07-26,31.8,12.6,53.4928,-130.6358
2020-07-27,31.4,13.6,53.4928,-130.6358
2020-07-28,31.5,13.2,53.4928,-130.6358
2020-07-29,31.5,12.8,53.4928,-130.6358
2020-07-30,31.2,13.1,53.4928,-130.6358
2020-07-31,31.4,13.1,53.4928,-130.6358
2020-08-01,31.3,13.7,53.4928,-130.6358
2020-08-02,31.1,13.5,53.4928,-130.6358
2020-08-03,31,13.8,53.4928,-130.6358
2020-08-04,31.1,13.6,53.4928,-130.6358
2020-08-05,31,13.4,53.4928,-130.6358
2020-08-06,31,13.1,53.4928,-130.6358
2020-08-07,30.7,13.8,53.4928,-130.6358
2020-08-08,31.1,14.3,53.4928,-130.6358
2020-08-09,30.9,13.3,53.4928,-130.6358
2020-08-10,30.8,12.9,53.4928,-130.6358
2020-08-11,30.9,13.8,53.4928,-130.6358
2020-08-12,30.9,14.5,53.4928,-130.6358
2020-08-13,31,12.8,53.4928,-130.6358
2020-08-14,30.9,13,53.4928,-130.6358
2020-08-15,30.2,13.8,53.4928,-130.6358
2020-08-16,30.9,13.8,53.4928,-130.6358
2020-08-17,30.9,13.6,53.4928,-130.6358
2020-08-18,30.7,13.7,53.4928,-130.6358
2020-08-19,30.9,12.5,53.4928,-130.6358
2020-08-20,31,13.9,53.4928,-130.6358
2020-08-21,31,12.7,53.4928,-130.6358
2020-08-22,30.9,13.2,53.4928,-130.6358
2020-08-23,31.1,13.1,53.4928,-130.6358
2020-08-24,31.1,12.9,53.4928,-130.6358
2020-08-25,31,13,53.4928,-130.6358
2020-08-26,30.7,13.7,53.4928,-130.6358
2020-08-27,30.9,13.2,53.4928,-130.6358
2020-08-28,30.7,12.4,53.4928,-130.6358
2020-08-29,31.1,13.7,53.4928,-130.6358
2020-08-30,30.9,13.1,53.4928,-130.6358
2020-08-31,31.2,13.4,53.4928,-130.6358
2020-09-01,31.2,13.2,53.4928,-130.6358
2020-09-02,30.9,13.2,53.4928,-130.6358
2020-09-03,31.1,13.1,53.4928,-130.6358
2020-09-04,31.2,12.8,53.4928,-130.6358
2020-09-05,31,13.4,53.4928,-130.6358
2020-09-06,31.1,14,53.4928,-130.6358
2020-09-07,31.2,13.5,53.4928,-130.6358
2020-09-08,31.3,13.5,53.4928,-130.6358
2020-09-09,31.2,13,53.4928,-130.6358
2020-09-10,31.1,12.8,53.4928,-130.6358
2020-09-11,31.2,12.4,53.4928,-130.6358
2020-09-12,31.1,12.2,53.4928,-130.6358
2020-09-13,30.4,12.6,53.4928,-130.6358
2020-09-14,30.9,12.2,53.4928,-130.6358
2020-09-15,31.2,12.5,53.4928,-130.6358
2020-09-16,30.9,12.5,53.4928,-130.6358
2020-09-17,31.2,12.1,53.4928,-130.6358
2020-09-18,31.1,12.5,53.4928,-130.6358
2020-09-19,31.1,12.7,53.4928,-130.6358
2020-09-20,31.1,13,53.4928,-130.6358
2020-09-21,30.8,13.5,53.4928,-130.6358
2020-09-22,30.9,12.8,53.4928,-130.6358
2020-09-23,30.7,12.5,53.4928,-130.6358
2020-09-24,31,13.2,53.4928,-130.6358
2020-09-25,30.7,12.4,53.4928,-130.6358
2020-09-26,30.5,12.6,53.4928,-130.6358
2020-09-27,30.2,12.2,53.4928,-130.6358
2020-09-28,30.6,12.4,53.4928,-130.6358
2020-09-29,30.6,13.5,53.4928,-130.6358
2020-09-30,31.2,13.5,53.4928,-130.6358
2020-10-01,31.4,13.5,53.4928,-130.6358
2020-10-02,31.3,13.3,53.4928,-130.6358
2020-10-03,31.3,13,53.4928,-130.6358
2020-10-04,31.5,12.9,53.4928,-130.6358
2020-10-05,30.9,13.3,53.4928,-130.6358
2020-10-06,31.2,13.3,53.4928,-130.6358
2020-10-07,31.4,12.7,53.4928,-130.6358
2020-10-08,31.5,13,53.4928,-130.6358
2020-10-09,31.2,12.6,53.4928,-130.6358
2020-10-10,31.4,13.3,53.4928,-130.6358
2020-10-11,31.2,12.4,53.4928,-130.6358
2020-10-12,31.4,12.4,53.4928,-130.6358
2020-10-13,31.1,12.5,53.4928,-130.6358
2020-10-14,30.8,12.6,53.4928,-130.6358
2020-10-15,31,12.2,53.4928,-130.6358
2020-10-16,31.2,11.9,53.4928,-130.6358
2020-10-17,31.4,11.6,53.4928,-130.6358
2020-10-18,31,11.7,53.4928,-130.6358
2020-10-19,30.9,11.7,53.4928,-130.6358
2020-10-20,31.1,11.6,53.4928,-130.6358
2020-10-21,31.2,11.3,53.4928,-130.6358
2020-10-22,31,11.2,53.4928,-130.6358
2020-10-23,31.2,10.9,53.4928,-130.6358
2020-10-24,31.3,10.2,53.4928,-130.6358
2020-10-25,31.2,10.2,53.4928,-130.6358
2020-10-26,30.9,10.8,53.4928,-130.6358
2020-10-27,30.8,11,53.4928,-130.6358
2020-10-29,31,10.8,53.4928,-130.6358
2020-10-30,31,10.6,53.4928,-130.6358
2020-10-31,30.9,10.4,53.4928,-130.6358
2020-11-01,31,10.7,53.4928,-130.6358
2020-11-02,30.9,10.9,53.4928,-130.6358
2020-11-03,31,10.6,53.4928,-130.6358
2020-11-04,30.1,10.4,53.4928,-130.6358
2020-11-05,30.5,10.2,53.4928,-130.6358
2020-11-06,31,9.6,53.4928,-130.6358
2020-11-07,31.1,9.5,53.4928,-130.6358
2020-11-08,30.9,9.6,53.4928,-130.6358
2020-11-09,30,9.4,53.4928,-130.6358
2020-11-10,31,9.4,53.4928,-130.6358
2020-11-11,31.2,9.3,53.4928,-130.6358
2020-11-12,30.8,9.2,53.4928,-130.6358
2020-11-13,30.8,9.4,53.4928,-130.6358
2020-11-14,30.8,9.2,53.4928,-130.6358
2020-11-15,30.9,9.1,53.4928,-130.6358
2020-11-16,31.3,9.1,53.4928,-130.6358
2020-11-17,31.3,8.9,53.4928,-130.6358
2020-11-18,31.2,8.9,53.4928,-130.6358
2020-11-19,31.1,8.7,53.4928,-130.6358
2020-11-20,31.1,8.6,53.4928,-130.6358
2020-11-21,31,8.6,53.4928,-130.6358
2020-11-22,31.1,8.7,53.4928,-130.6358
2020-11-23,31,8.6,53.4928,-130.6358
2020-11-24,30.5,7.9,53.4928,-130.6358
2020-11-25,30.7,8.7,53.4928,-130.6358
2020-11-26,30.6,8.7,53.4928,-130.6358
2020-11-27,30.9,8.6,53.4928,-130.6358
2020-11-28,30.8,8.1,53.4928,-130.6358
2020-11-29,30.7,8.6,53.4928,-130.6358
2020-11-30,31.2,8.6,53.4928,-130.6358
2020-12-01,31,8.5,53.4928,-130.6358
2020-12-02,31.2,8.3,53.4928,-130.6358
2020-12-03,30.9,8.5,53.4928,-130.6358
2020-12-04,30.8,8.8,53.4928,-130.6358
2020-12-05,30.6,8.8,53.4928,-130.6358
2020-12-06,30.3,8.9,53.4928,-130.6358
2020-12-07,30.2,8.8,53.4928,-130.6358
2020-12-08,31.1,8.7,53.4928,-130.6358
2020-12-09,31.2,8.6,53.4928,-130.6358
2020-12-10,31.2,8.2,53.4928,-130.6358
2020-12-11,31.4,8.4,53.4928,-130.6358
2020-12-12,31.4,8.3,53.4928,-130.6358
2020-12-13,31.2,8.1,53.4928,-130.6358
2020-12-14,31.3,8.1,53.4928,-130.6358
2020-12-15,30.8,8.1,53.4928,-130.6358
2020-12-16,30.9,8.2,53.4928,-130.6358
2020-12-17,30.6,8,53.4928,-130.6358
2020-12-18,30.4,8.1,53.4928,-130.6358
2020-12-19,30.5,8,53.4928,-130.6358
2020-12-20,30.6,8.2,53.4928,-130.6358
2020-12-21,30.6,8.1,53.4928,-130.6358
2020-12-22,31,7.8,53.4928,-130.6358
2020-12-23,30.8,8,53.4928,-130.6358
2020-12-24,30.4,7.5,53.4928,-130.6358
2020-12-25,30.8,7.7,53.4928,-130.6358
2020-12-26,30.9,7.8,53.4928,-130.6358
2020-12-27,30.8,7.9,53.4928,-130.6358
2020-12-28,30.6,8,53.4928,-130.6358
2020-12-29,30.5,7.4,53.4928,-130.6358
2020-12-30,30.4,7.7,53.4928,-130.6358
2020-12-31,30.4,7.6,53.4928,-130.6358
2021-01-01,30.5,8,53.4928,-130.6358
2021-01-02,30.2,7.9,53.4928,-130.6358
2021-01-03,30.8,7.5,53.4928,-130.6358
2021-01-04,30.7,7.3,53.4928,-130.6358
2021-01-05,30.5,7.7,53.4928,-130.6358
2021-01-06,30.9,7.3,53.4928,-130.6358
2021-01-07,30.8,7.6,53.4928,-130.6358
2021-01-09,31.2,7.8,53.4928,-130.6358
2021-01-10,31.4,8.1,53.4928,-130.6358
2021-01-11,31,8,53.4928,-130.6358
2021-01-12,31,7.9,53.4928,-130.6358
2021-01-13,31.1,7.8,53.4928,-130.6358
2021-01-14,31.4,7.6,53.4928,-130.6358
2021-01-15,30.8,8.2,53.4928,-130.6358
2021-01-16,31.4,8,53.4928,-130.6358
2021-01-17,31.2,8.2,53.4928,-130.6358
2021-01-18,31.3,7.9,53.4928,-130.6358
2021-01-19,31.2,7.9,53.4928,-130.6358
2021-01-20,31.1,7.8,53.4928,-130.6358
2021-01-21,31.3,7.1,53.4928,-130.6358
2021-01-22,31.1,7,53.4928,-130.6358
2021-01-23,31,6.9,53.4928,-130.6358
2021-01-24,31.1,7,53.4928,-130.6358
2021-01-25,30.9,6.8,53.4928,-130.6358
2021-01-26,30.5,6.6,53.4928,-130.6358
2021-01-27,30.6,6.9,53.4928,-130.6358
2021-01-28,30.1,6.3,53.4928,-130.6358
2021-01-29,30,6.1,53.4928,-130.6358
2021-01-30,30.2,6.7,53.4928,-130.6358
2021-01-31,30.6,7,53.4928,-130.6358
2021-02-01,30.5,6.9,53.4928,-130.6358
2021-02-02,30.6,6.9,53.4928,-130.6358
2021-02-03,30.5,6.8,53.4928,-130.6358
2021-02-04,30.4,7,53.4928,-130.6358
2021-02-05,30.6,6.9,53.4928,-130.6358
2021-02-06,30.4,6.9,53.4928,-130.6358
2021-02-07,30.5,6.6,53.4928,-130.6358
2021-02-08,30.4,6.2,53.4928,-130.6358
2021-02-09,29.5,6.5,53.4928,-130.6358
2021-02-10,31.1,6.3,53.4928,-130.6358
2021-02-11,31,6.3,53.4928,-130.6358
2021-02-12,31.2,6,53.4928,-130.6358
2021-02-13,31.2,5.9,53.4928,-130.6358
2021-02-14,30.7,5.9,53.4928,-130.6358
2021-02-15,30.8,6.2,53.4928,-130.6358
2021-02-16,31.2,6.5,53.4928,-130.6358
2021-02-17,31.3,6.7,53.4928,-130.6358
2021-02-18,31.3,6.6,53.4928,-130.6358
2021-02-19,31,6.5,53.4928,-130.6358
2021-02-20,31.2,6.6,53.4928,-130.6358
2021-02-21,30.8,6.9,53.4928,-130.6358
2021-02-22,31.1,6.2,53.4928,-130.6358
2021-02-23,31.4,6.3,53.4928,-130.6358
2021-02-24,31.2,5.7,53.4928,-130.6358
2021-02-25,31.4,6.5,53.4928,-130.6358
2021-02-26,31.3,6.7,53.4928,-130.6358
2021-02-27,31.6,6.8,53.4928,-130.6358
2021-02-28,31.4,6.6,53.4928,-130.6358
2021-03-01,31.3,6.8,53.4928,-130.6358
2021-03-02,31.2,6.8,53.4928,-130.6358
2021-03-03,30.7,6.3,53.4928,-130.6358
2021-03-04,31,6.4,53.4928,-130.6358
2021-03-05,31.1,6.7,53.4928,-130.6358
2021-03-06,30.9,5.9,53.4928,-130.6358
2021-03-07,30.7,6.4,53.4928,-130.6358
2021-03-08,30.9,6.7,53.4928,-130.6358
2021-03-09,30.5,6.8,53.4928,-130.6358
2021-03-10,30.9,7,53.4928,-130.6358
2021-03-11,31,6.6,53.4928,-130.6358
2021-03-12,30.8,6.8,53.4928,-130.6358
2021-03-13,30.8,6.6,53.4928,-130.6358
2021-03-14,31.3,6.7,53.4928,-130.6358
2021-03-15,31.2,6.3,53.4928,-130.6358
2021-03-16,30.7,7,53.4928,-130.6358
2021-03-17,31,7.1,53.4928,-130.6358
2021-03-18,31.1,7,53.4928,-130.6358
2021-03-19,31.3,7.2,53.4928,-130.6358
2021-03-20,31.2,7,53.4928,-130.6358
2021-03-21,31.1,7.1,53.4928,-130.6358
2021-03-22,31,6.6,53.4928,-130.6358
2021-03-23,30.7,7,53.4928,-130.6358
2021-03-24,30.9,6.9,53.4928,-130.6358
2021-03-25,30.9,6.8,53.4928,-130.6358
2021-03-26,30.7,7.2,53.4928,-130.6358
2021-03-27,31.2,7,53.4928,-130.6358
2021-03-28,31.3,6.9,53.4928,-130.6358
2021-03-29,31.3,7.1,53.4928,-130.6358
2021-03-30,31.2,7,53.4928,-130.6358
2021-03-31,31.3,6.8,53.4928,-130.6358
2021-04-01,31.2,6.9,53.4928,-130.6358
2021-04-02,31.1,7.6,53.4928,-130.6358
2021-04-03,31.3,7.3,53.4928,-130.6358
2021-04-04,31.3,7.6,53.4928,-130.6358
2021-04-05,31.2,7.5,53.4928,-130.6358
2021-04-06,31,7.3,53.4928,-130.6358
2021-04-07,31.1,6.9,53.4928,-130.6358
2021-04-08,31.1,7,53.4928,-130.6358
2021-04-09,30.9,7,53.4928,-130.6358
2021-04-10,30.7,7.1,53.4928,-130.6358
2021-04-11,30.8,7.5,53.4928,-130.6358
2021-04-12,31,7.6,53.4928,-130.6358
2021-04-13,31,8.6,53.4928,-130.6358
2021-04-14,31.1,8.1,53.4928,-130.6358
2021-04-15,31.2,8.1,53.4928,-130.6358
2021-04-16,31.1,8,53.4928,-130.6358
2021-04-17,31.1,8.5,53.4928,-130.6358
2021-04-18,31.2,8.5,53.4928,-130.6358
2021-04-19,31.2,8.9,53.4928,-130.6358
2021-04-20,31.1,8.6,53.4928,-130.6358
2021-04-21,31.2,7.7,53.4928,-130.6358
2021-04-22,31.1,7.8,53.4928,-130.6358
2021-04-23,31.3,8,53.4928,-130.6358
2021-04-24,30.8,8.5,53.4928,-130.6358
2021-04-25,31.3,8.3,53.4928,-130.6358
2021-04-26,30.8,8.2,53.4928,-130.6358
2021-04-27,31.1,8.1,53.4928,-130.6358
2021-04-28,31.3,7.9,53.4928,-130.6358
2021-04-29,30.9,8,53.4928,-130.6358
2021-04-30,31,8.3,53.4928,-130.6358
2021-05-01,31.1,8.2,53.4928,-130.6358
2021-05-02,31.1,8.8,53.4928,-130.6358
2021-05-03,30.7,9.9,53.4928,-130.6358
2021-05-04,30.8,8.9,53.4928,-130.6358
2021-05-05,30.9,8.8,53.4928,-130.6358
2021-05-06,30.8,9.4,53.4928,-130.6358
2021-05-07,30.3,8.8,53.4928,-130.6358
2021-05-08,30.4,8.6,53.4928,-130.6358
2021-05-09,30.7,9.2,53.4928,-130.6358
2021-05-10,31,9.2,53.4928,-130.6358
2021-05-11,31.1,9.1,53.4928,-130.6358
2021-05-12,31,9.9,53.4928,-130.6358
2021-05-13,30.9,9.9,53.4928,-130.6358
2021-05-14,31.1,9.5,53.4928,-130.6358
2021-05-15,31.1,9.1,53.4928,-130.6358
2021-05-16,31.1,10.1,53.4928,-130.6358
2021-05-17,31,10,53.4928,-130.6358
2021-05-18,30.8,9.8,53.4928,-130.6358
2021-05-19,31.2,10.1,53.4928,-130.6358
2021-05-20,31.3,9.6,53.4928,-130.6358
2021-05-21,31.3,9.2,53.4928,-130.6358
2021-05-22,30.9,9.7,53.4928,-130.6358
2021-05-23,31,9.5,53.4928,-130.6358
2021-05-24,30.7,10.2,53.4928,-130.6358
2021-05-25,31.3,9.6,53.4928,-130.6358
2021-05-26,30.8,9,53.4928,-130.6358
2021-05-27,30.9,9.4,53.4928,-130.6358
2021-05-28,31.1,9.1,53.4928,-130.6358
2021-05-29,31.2,10.3,53.4928,-130.6358
2021-05-30,31.1,10.1,53.4928,-130.6358
2021-05-31,31,9.9,53.4928,-130.6358
2021-06-01,31.1,9.8,53.4928,-130.6358
2021-06-02,30.9,10.2,53.4928,-130.6358
2021-06-03,31.1,9.9,53.4928,-130.6358
2021-06-04,30.7,9.8,53.4928,-130.6358
2021-06-05,30.7,10.5,53.4928,-130.6358
2021-06-06,30.8,10.3,53.4928,-130.6358
2021-06-07,30.9,10.9,53.4928,-130.6358
2021-06-08,30.8,10.8,53.4928,-130.6358
2021-06-09,30.9,11.2,53.4928,-130.6358
2021-06-10,30.6,11.4,53.4928,-130.6358
2021-06-11,30.9,11.3,53.4928,-130.6358
2021-06-12,30.9,12,53.4928,-130.6358
2021-06-13,30.8,10.9,53.4928,-130.6358
2021-06-14,30.8,11.9,53.4928,-130.6358
2021-06-15,30.7,11.8,53.4928,-130.6358
2021-06-16,30.6,12.9,53.4928,-130.6358
2021-06-17,30.3,11.9,53.4928,-130.6358
2021-06-18,30.5,11.8,53.4928,-130.6358
2021-06-19,30.5,11.9,53.4928,-130.6358
2021-06-20,30.2,12.1,53.4928,-130.6358
2021-06-21,30.2,12.2,53.4928,-130.6358
2021-06-22,30.7,11.5,53.4928,-130.6358
2021-06-23,30.9,11.3,53.4928,-130.6358
2021-06-24,30.7,12.2,53.4928,-130.6358
2021-06-25,30.7,12,53.4928,-130.6358
2021-06-26,30.6,11.1,53.4928,-130.6358
2021-06-27,31.1,11.7,53.4928,-130.6358
2021-06-28,31,12.1,53.4928,-130.6358
2021-06-29,30.9,11.9,53.4928,-130.6358
2021-06-30,31.3,10.4,53.4928,-130.6358
2021-07-01,31.2,10.5,53.4928,-130.6358
2021-07-02,30.5,10.4,53.4928,-130.6358
2021-07-03,30.4,10.3,53.4928,-130.6358
2021-07-04,30.5,10.3,53.4928,-130.6358
2021-07-05,30.2,10.8,53.4928,-130.6358
2021-07-06,30.3,10.8,53.4928,-130.6358
2021-07-07,30.5,10.7,53.4928,-130.6358
2021-07-08,28.9,13.7,53.4928,-130.6358
2021-07-09,29.6,12,53.4928,-130.6358
2021-07-10,30,13.1,53.4928,-130.6358
2021-07-11,29.7,13.2,53.4928,-130.6358
2021-07-12,29.4,14.4,53.4928,-130.6358
2021-07-14,29.6,14.6,53.4928,-130.6358
2021-07-15,30,14.2,53.4928,-130.6358
2021-07-16,29.5,13.7,53.4928,-130.6358
2021-07-17,29.6,14.2,53.4928,-130.6358
2021-07-18,30.1,13.3,53.4928,-130.6358
2021-07-19,29.9,13.1,53.4928,-130.6358
2021-07-20,30.5,13.2,53.4928,-130.6358
2021-07-21,30.4,14.8,53.4928,-130.6358
2021-07-22,30.6,12.9,53.4928,-130.6358
2021-07-23,30.1,14.2,53.4928,-130.6358
2021-07-24,30.5,12.8,53.4928,-130.6358
2021-07-25,30.6,12.9,53.4928,-130.6358
2021-07-26,30.7,13,53.4928,-130.6358
2021-07-27,31.1,12.4,53.4928,-130.6358
2021-07-28,30.4,13.6,53.4928,-130.6358
2021-07-29,30.9,12.9,53.4928,-130.6358
2021-07-30,30.8,13.4,53.4928,-130.6358
2021-07-31,30.9,12.6,53.4928,-130.6358
2021-08-01,31,12.7,53.4928,-130.6358
2021-08-02,31.1,12.8,53.4928,-130.6358
2021-08-03,29.9,12.6,53.4928,-130.6358
2021-08-04,31,12.7,53.4928,-130.6358
2021-08-05,30.8,14.2,53.4928,-130.6358
2021-08-08,30.8,14.4,53.4928,-130.6358
2021-08-09,30.8,14.3,53.4928,-130.6358
2021-08-10,31.3,12.4,53.4928,-130.6358
2021-08-12,31.1,12.4,53.4928,-130.6358
2021-08-13,30.8,12.1,53.4928,-130.6358
2021-08-14,31.3,11.8,53.4928,-130.6358
2021-08-15,30.9,12.6,53.4928,-130.6358
2021-08-16,30.8,12.6,53.4928,-130.6358
2021-08-17,30.3,12.7,53.4928,-130.6358
2021-08-18,30.8,13.1,53.4928,-130.6358
2021-08-19,30.6,13.3,53.4928,-130.6358
2021-08-20,30.4,11.9,53.4928,-130.6358
2021-08-21,30.8,11.6,53.4928,-130.6358
2021-08-22,30.6,11.1,53.4928,-130.6358
2021-08-23,29.4,10.6,53.4928,-130.6358
2021-08-24,30.8,10,53.4928,-130.6358
2021-08-25,30.4,9.6,53.4928,-130.6358
2021-08-26,30.1,11.8,53.4928,-130.6358
2021-08-27,30.3,11.2,53.4928,-130.6358
2021-08-28,30.6,10.8,53.4928,-130.6358
2021-08-29,30.8,10.6,53.4928,-130.6358
2021-08-30,31.1,12.4,53.4928,-130.6358
2021-08-31,31.3,12.6,53.4928,-130.6358
2021-09-01,31.2,11.5,53.4928,-130.6358
2021-09-02,31.2,13,53.4928,-130.6358
2021-09-03,31.1,12.8,53.4928,-130.6358
2021-09-04,30.1,12.7,53.4928,-130.6358
2021-09-05,31,12.5,53.4928,-130.6358
2021-09-06,30.9,12,53.4928,-130.6358
2021-09-07,31.1,12.1,53.4928,-130.6358
2021-09-08,31.2,12,53.4928,-130.6358
2021-09-09,30.9,11.9,53.4928,-130.6358
2021-09-10,31.4,11.4,53.4928,-130.6358
2021-09-11,31.3,11.6,53.4928,-130.6358
2021-09-12,31.3,11.9,53.4928,-130.6358
2021-09-13,31.3,12.2,53.4928,-130.6358
2021-09-14,31.4,12.2,53.4928,-130.6358
2021-09-15,31.2,12.1,53.4928,-130.6358
2021-09-16,31.4,11.5,53.4928,-130.6358
2021-09-17,30.8,12.8,53.4928,-130.6358
2021-09-18,31.1,12.1,53.4928,-130.6358
2021-09-19,30.9,12.5,53.4928,-130.6358
2021-09-20,30.4,12.1,53.4928,-130.6358
2021-09-21,31.2,12.3,53.4928,-130.6358
2021-09-22,31.1,12.2,53.4928,-130.6358
2021-09-23,30.9,11.9,53.4928,-130.6358
2021-09-24,31.3,12.1,53.4928,-130.6358
2021-09-25,31.4,12.4,53.4928,-130.6358
2021-09-26,31.1,12.2,53.4928,-130.6358
2021-09-27,30.4,12.2,53.4928,-130.6358
2021-09-28,30.6,11.8,53.4928,-130.6358
2021-09-29,30.5,12,53.4928,-130.6358
2021-09-30,31.1,11.8,53.4928,-130.6358
2021-10-01,31,12.1,53.4928,-130.6358
2021-10-02,31,11.4,53.4928,-130.6358
2021-10-03,31.1,10.9,53.4928,-130.6358
2021-10-04,30.8,11.3,53.4928,-130.6358
2021-10-05,31.3,11.3,53.4928,-130.6358
2021-10-06,31,11.2,53.4928,-130.6358
2021-10-07,31.1,10.9,53.4928,-130.6358
2021-10-08,30.9,11.2,53.4928,-130.6358
2021-10-09,31,11.1,53.4928,-130.6358
2021-10-10,30.6,11.2,53.4928,-130.6358
2021-10-11,30.6,11.1,53.4928,-130.6358
2021-10-12,31,11,53.4928,-130.6358
2021-10-13,30.7,10.8,53.4928,-130.6358
2021-10-14,30.9,11.2,53.4928,-130.6358
2021-10-15,30.9,10.6,53.4928,-130.6358
2021-10-16,30.6,10,53.4928,-130.6358
2021-10-17,30.7,10.2,53.4928,-130.6358
2021-10-18,30.6,10,53.4928,-130.6358
2021-10-19,30.8,10.2,53.4928,-130.6358
2021-10-20,31,10.5,53.4928,-130.6358
2021-10-21,30.5,10.6,53.4928,-130.6358
2021-10-22,30.5,10.6,53.4928,-130.6358
2021-10-23,30.3,10.4,53.4928,-130.6358
2021-10-24,30.7,10.3,53.4928,-130.6358
2021-10-25,30.5,10.6,53.4928,-130.6358
2021-10-26,30.4,10.3,53.4928,-130.6358
2021-10-27,30.4,10.3,53.4928,-130.6358
2021-10-28,30.3,10.1,53.4928,-130.6358
2021-10-29,30.5,10.2,53.4928,-130.6358
2021-10-30,30.6,9.5,53.4928,-130.6358
2021-10-31,30.4,9.7,53.4928,-130.6358
2021-11-01,30.6,9.7,53.4928,-130.6358
2021-11-02,30.5,9.9,53.4928,-130.6358
2021-11-03,30.6,10.1,53.4928,-130.6358
2021-11-04,30.3,10,53.4928,-130.6358
2021-11-05,30.1,9.7,53.4928,-130.6358
2021-11-06,29.9,9.8,53.4928,-130.6358
2021-11-07,30,9.5,53.4928,-130.6358
2021-11-08,30.4,9.4,53.4928,-130.6358
2021-11-09,30.1,9.5,53.4928,-130.6358
2021-11-10,30.2,9.4,53.4928,-130.6358
2021-11-11,30.2,9.2,53.4928,-130.6358
2021-11-12,30.3,9.4,53.4928,-130.6358
2021-11-13,31.2,9.4,53.4928,-130.6358
2021-11-14,30.9,9.3,53.4928,-130.6358
2021-11-15,31,9.1,53.4928,-130.6358
2021-11-16,31.1,8.9,53.4928,-130.6358
2021-11-17,31.2,9.1,53.4928,-130.6358
2021-11-18,30.9,9.4,53.4928,-130.6358
2021-11-19,31.1,8.8,53.4928,-130.6358
2021-11-20,29.9,8.9,53.4928,-130.6358
2021-11-21,30.7,9.2,53.4928,-130.6358
2021-11-22,30.4,9.4,53.4928,-130.6358
2021-11-23,30.9,8.9,53.4928,-130.6358
2021-11-24,30.7,9,53.4928,-130.6358
2021-11-25,30.7,9.3,53.4928,-130.6358
2021-11-26,30.6,9.2,53.4928,-130.6358
2021-11-27,31,9,53.4928,-130.6358
2021-11-28,31.1,9.1,53.4928,-130.6358
2021-11-29,31.3,8.9,53.4928,-130.6358
2021-11-30,31.2,9,53.4928,-130.6358
2021-12-01,30.7,9.1,53.4928,-130.6358
2021-12-02,30.8,8.8,53.4928,-130.6358
2021-12-03,30.9,8.8,53.4928,-130.6358
2021-12-04,30.4,8.8,53.4928,-130.6358
2021-12-05,30.6,8.9,53.4928,-130.6358
2021-12-06,31.4,8.4,53.4928,-130.6358
2021-12-07,31.4,8.6,53.4928,-130.6358
2021-12-08,31.2,8,53.4928,-130.6358
2021-12-09,31.3,7.5,53.4928,-130.6358
2021-12-10,31.1,7.6,53.4928,-130.6358
2021-12-11,30.7,6.9,53.4928,-130.6358
2021-12-12,30.5,6.8,53.4928,-130.6358
2021-12-13,30.3,7.4,53.4928,-130.6358
2021-12-14,30.6,7.4,53.4928,-130.6358
2021-12-15,30.6,7,53.4928,-130.6358
2021-12-16,30.8,7.6,53.4928,-130.6358
2021-12-17,30.5,7.1,53.4928,-130.6358
2021-12-18,30.1,7.1,53.4928,-130.6358
2021-12-19,30.2,7.5,53.4928,-130.6358
2021-12-20,30.4,7.1,53.4928,-130.6358
2021-12-21,30.3,6.8,53.4928,-130.6358
2021-12-22,29.9,7.1,53.4928,-130.6358
2021-12-23,30.7,7,53.4928,-130.6358
2021-12-24,30.4,6.2,53.4928,-130.6358
2021-12-25,30.3,6.1,53.4928,-130.6358
2021-12-26,31.4,6.2,53.4928,-130.6358
2021-12-27,30.6,6.3,53.4928,-130.6358
2021-12-28,30.5,6,53.4928,-130.6358
2021-12-29,30.4,6,53.4928,-130.6358
2021-12-30,30.8,6.4,53.4928,-130.6358
2021-12-31,30.8,6.3,53.4928,-130.6358
2022-01-01,30.7,6.9,53.4928,-130.6358
2022-01-02,30.8,6.2,53.4928,-130.6358
2022-01-03,30.9,6.5,53.4928,-130.6358
2022-01-04,30.9,6.1,53.4928,-130.6358
2022-01-05,31.1,5.9,53.4928,-130.6358
2022-01-06,30.5,5.8,53.4928,-130.6358
2022-01-10,30.7,6.6,53.4928,-130.6358
2022-01-11,30.6,7.3,53.4928,-130.6358
2022-01-12,30.8,7.1,53.4928,-130.6358
2022-01-13,30.9,6.5,53.4928,-130.6358
2022-01-14,30.3,7.1,53.4928,-130.6358
2022-01-15,30.9,6.6,53.4928,-130.6358
2022-01-16,30.9,7.1,53.4928,-130.6358
2022-01-17,30.8,7,53.4928,-130.6358
2022-01-18,31.1,6.7,53.4928,-130.6358
2022-01-19,30.3,6.8,53.4928,-130.6358
2022-01-20,30.8,7.2,53.4928,-130.6358
2022-01-21,31,6.9,53.4928,-130.6358
2022-01-22,30.9,6.9,53.4928,-130.6358
2022-01-23,30.9,7.5,53.4928,-130.6358
2022-01-24,30.8,7.5,53.4928,-130.6358
2022-01-25,30.8,7.1,53.4928,-130.6358
2022-01-26,30.9,6.9,53.4928,-130.6358
2022-01-27,30.8,6.4,53.4928,-130.6358
2022-01-28,30.5,6.9,53.4928,-130.6358
2022-01-29,30,7.3,53.4928,-130.6358
2022-01-30,30.8,7,53.4928,-130.6358
2022-01-31,31,7,53.4928,-130.6358
2022-02-01,31.1,7,53.4928,-130.6358
2022-02-02,31.1,6.9,53.4928,-130.6358
2022-02-03,30.5,7.2,53.4928,-130.6358
2022-02-04,30.6,7.2,53.4928,-130.6358
2022-02-05,30.6,6.7,53.4928,-130.6358
2022-02-06,30.4,6.8,53.4928,-130.6358
2022-02-07,30.8,6.9,53.4928,-130.6358
2022-02-08,30.6,7.2,53.4928,-130.6358
2022-02-09,30.4,7.3,53.4928,-130.6358
2022-02-10,30.7,7,53.4928,-130.6358
2022-02-11,30.6,6.9,53.4928,-130.6358
2022-02-12,31,7.2,53.4928,-130.6358
2022-02-13,30.8,7.3,53.4928,-130.6358
2022-02-14,30.7,7.4,53.4928,-130.6358
2022-02-15,31,7.1,53.4928,-130.6358
2022-02-16,30.9,7.5,53.4928,-130.6358
2022-02-17,30.9,7.3,53.4928,-130.6358
2022-02-18,30.8,7.5,53.4928,-130.6358
2022-02-19,30.9,7.4,53.4928,-130.6358
2022-02-20,30.4,7.3,53.4928,-130.6358
2022-02-21,31.1,7.1,53.4928,-130.6358
2022-02-22,30.6,7.1,53.4928,-130.6358
2022-02-23,30.8,7.2,53.4928,-130.6358
2022-02-24,30.6,7,53.4928,-130.6358
2022-02-25,30.4,6.9,53.4928,-130.6358
2022-02-26,30.9,6.7,53.4928,-130.6358
2022-02-27,30.2,7.2,53.4928,-130.6358
2022-02-28,30.8,7,53.4928,-130.6358
2022-03-01,30.6,7.3,53.4928,-130.6358
2022-03-03,30.7,6.9,53.4928,-130.6358
2022-03-04,30.4,7.2,53.4928,-130.6358
2022-03-05,30.2,7.5,53.4928,-130.6358
2022-03-06,30,7.4,53.4928,-130.6358
2022-03-07,30.1,7.2,53.4928,-130.6358
2022-03-08,30,7,53.4928,-130.6358
2022-03-09,30.9,7.2,53.4928,-130.6358
2022-03-10,31.1,7,53.4928,-130.6358
2022-03-11,30.6,7.1,53.4928,-130.6358
2022-03-12,30.5,7.4,53.4928,-130.6358
2022-03-13,30.7,7.2,53.4928,-130.6358
2022-03-14,30.6,7.6,53.4928,-130.6358
2022-03-15,30.3,7.4,53.4928,-130.6358
2022-03-16,30.7,7.1,53.4928,-130.6358
2022-03-17,30.6,7.5,53.4928,-130.6358
2022-03-18,30.5,7.1,53.4928,-130.6358
2022-03-19,30.6,7.1,53.4928,-130.6358
2022-03-20,30.6,6.8,53.4928,-130.6358
2022-03-21,30.7,7.5,53.4928,-130.6358
2022-03-22,30.7,7.6,53.4928,-130.6358
2022-03-23,30.8,7.9,53.4928,-130.6358
2022-03-24,30.9,8,53.4928,-130.6358
2022-03-25,30.6,7.8,53.4928,-130.6358
2022-03-26,30.9,7.7,53.4928,-130.6358
2022-03-27,30.9,7.8,53.4928,-130.6358
2022-03-28,30.8,7.7,53.4928,-130.6358
2022-03-29,31,7.6,53.4928,-130.6358
2022-03-30,30.7,7.8,53.4928,-130.6358
2022-03-31,30.4,7.9,53.4928,-130.6358
2022-04-01,30.8,7.8,53.4928,-130.6358
2022-04-02,30.9,7.3,53.4928,-130.6358
2022-04-03,30.5,7.7,53.4928,-130.6358
2022-04-04,30.4,7.6,53.4928,-130.6358
2022-04-05,30.9,8.1,53.4928,-130.6358
2022-04-06,30.8,7.8,53.4928,-130.6358
2022-04-07,30.6,7.5,53.4928,-130.6358
2022-04-08,30.7,7.7,53.4928,-130.6358
2022-04-09,30.8,7.6,53.4928,-130.6358
2022-04-10,30.9,7,53.4928,-130.6358
2022-04-11,30.7,7.4,53.4928,-130.6358
2022-04-12,30.9,7.4,53.4928,-130.6358
2022-04-13,30.8,7.8,53.4928,-130.6358
2022-04-14,30.8,7.9,53.4928,-130.6358
2022-04-15,30.6,7.9,53.4928,-130.6358
2022-04-16,30.8,7.8,53.4928,-130.6358
2022-04-17,30.8,7.9,53.4928,-130.6358
2022-04-18,30.8,7.5,53.4928,-130.6358
2022-04-19,29.8,8.2,53.4928,-130.6358
2022-04-20,30.8,8.2,53.4928,-130.6358
2022-04-21,30.9,8.1,53.4928,-130.6358
2022-04-22,30.6,9.1,53.4928,-130.6358
2022-04-23,30.7,8.7,53.4928,-130.6358
2022-04-24,30.4,8.6,53.4928,-130.6358
2022-04-25,29.9,8.4,53.4928,-130.6358
2022-04-26,30.3,8.3,53.4928,-130.6358
2022-04-27,30.4,8.2,53.4928,-130.6358
2022-04-28,30.4,8.8,53.4928,-130.6358
2022-04-29,30.4,8.4,53.4928,-130.6358
2022-04-30,30.6,8.8,53.4928,-130.6358
