DATE,SALINITY,TEMPERATURE,LATITUDE,LONGITUDE
2018-01-01,30.2,8.3,48.9528,-125.5423
2018-01-04,30.3,8.3,48.9528,-125.5423
2018-01-05,28.2,8.1,48.9528,-125.5423
2018-01-06,30.1,8.4,48.9528,-125.5423
2018-01-07,29.1,8.3,48.9528,-125.5423
2018-01-08,29.2,8.4,48.9528,-125.5423
2018-01-09,29.8,8.3,48.9528,-125.5423
2018-01-12,30.1,8.4,48.9528,-125.5423
2018-01-13,28.8,8.4,48.9528,-125.5423
2018-01-14,29.6,8.4,48.9528,-125.5423
2018-01-15,30,8.8,48.9528,-125.5423
2018-01-16,29.9,8.7,48.9528,-125.5423
2018-01-20,29.5,9,48.9528,-125.5423
2018-01-22,29.3,8.9,48.9528,-125.5423
2018-01-23,27.4,8.9,48.9528,-125.5423
2018-01-24,29.3,9.2,48.9528,-125.5423
2018-01-25,27.5,8.6,48.9528,-125.5423
2018-01-26,27.2,8.2,48.9528,-125.5423
2018-01-27,28,8.2,48.9528,-125.5423
2018-01-28,25.2,8.5,48.9528,-125.5423
2018-01-29,29.3,9.3,48.9528,-125.5423
2018-01-31,25.8,8.1,48.9528,-125.5423
2018-02-01,23.8,7.8,48.9528,-125.5423
2018-02-02,26,8.8,48.9528,-125.5423
2018-02-03,27,9,48.9528,-125.5423
2018-02-04,27.9,9.1,48.9528,-125.5423
2018-02-05,29.5,9.5,48.9528,-125.5423
2018-02-06,29.2,9.2,48.9528,-125.5423
2018-02-07,27.1,9.2,48.9528,-125.5423
2018-02-08,28.9,9.2,48.9528,-125.5423
2018-02-09,26.9,8.4,48.9528,-125.5423
2018-02-10,25.9,7.6,48.9528,-125.5423
2018-02-11,26.9,7.9,48.9528,-125.5423
2018-02-12,24.6,7.3,48.9528,-125.5423
2018-02-13,26.5,7.7,48.9528,-125.5423
2018-02-14,27.4,8.7,48.9528,-125.5423
2018-02-15,25.9,7.4,48.9528,-125.5423
2018-02-16,28.8,8.8,48.9528,-125.5423
2018-02-17,29.7,9.3,48.9528,-125.5423
2018-02-19,28.8,8.3,48.9528,-125.5423
2018-02-20,29.1,8.3,48.9528,-125.5423
2018-02-21,29.4,7.3,48.9528,-125.5423
2018-02-22,29.6,7.8,48.9528,-125.5423
2018-02-23,28.9,7.6,48.9528,-125.5423
2018-03-02,30.2,8.7,48.9528,-125.5423
2018-03-04,30.1,8.7,48.9528,-125.5423
2018-03-05,30.3,8.5,48.9528,-125.5423
2018-03-06,29,8.3,48.9528,-125.5423
2018-03-08,30,8.2,48.9528,-125.5423
2018-03-09,29.3,8.1,48.9528,-125.5423
2018-03-10,29.4,7.4,48.9528,-125.5423
2018-03-11,28.8,7.8,48.9528,-125.5423
2018-03-12,28.8,8.1,48.9528,-125.5423
2018-03-13,28.4,8.4,48.9528,-125.5423
2018-03-14,28.7,8.4,48.9528,-125.5423
2018-03-15,28.4,8.7,48.9528,-125.5423
2018-03-16,28.4,8.7,48.9528,-125.5423
2018-03-17,27.8,8.6,48.9528,-125.5423
2018-03-18,28.3,9.1,48.9528,-125.5423
2018-03-19,27.7,9,48.9528,-125.5423
2018-03-20,28.6,9.1,48.9528,-125.5423
2018-03-21,28.7,9,48.9528,-125.5423
2018-03-22,28.2,8.8,48.9528,-125.5423
2018-03-23,27.4,8.4,48.9528,-125.5423
2018-03-24,27.5,8.7,48.9528,-125.5423
2018-03-25,28.7,7.8,48.9528,-125.5423
2018-03-26,28.3,8.2,48.9528,-125.5423
2018-03-27,27.3,8.5,48.9528,-125.5423
2018-03-28,29.3,8.6,48.9528,-125.5423
2018-03-29,28.5,8.7,48.9528,-125.5423
2018-03-30,29.6,9.5,48.9528,-125.5423
2018-03-31,27,9.5,48.9528,-125.5423
2018-04-02,30,9.4,48.9528,-125.5423
2018-04-03,29.6,9,48.9528,-125.5423
2018-04-04,28.7,8.6,48.9528,-125.5423
2018-04-05,27.2,8.8,48.9528,-125.5423
2018-04-06,28.6,9.7,48.9528,-125.5423
2018-04-07,26.4,9.5,48.9528,-125.5423
2018-04-08,29.7,8.8,48.9528,-125.5423
2018-04-09,29.1,9,48.9528,-125.5423
2018-04-10,27,9.5,48.9528,-125.5423
2018-04-11,29.1,9,48.9528,-125.5423
2018-04-12,29.1,9.6,48.9528,-125.5423
2018-04-13,29.4,9.7,48.9528,-125.5423
2018-04-14,29.3,9.8,48.9528,-125.5423
2018-04-15,29.2,10.1,48.9528,-125.5423
2018-04-16,28.5,9.9,48.9528,-125.5423
2018-04-17,29.2,10.3,48.9528,-125.5423
2018-04-18,24,10.5,48.9528,-125.5423
2018-04-19,26.8,11.1,48.9528,-125.5423
2018-04-20,27.5,10.2,48.9528,-125.5423
2018-04-21,28.8,10.5,48.9528,-125.5423
2018-04-22,28.2,9.6,48.9528,-125.5423
2018-04-23,28.1,11.3,48.9528,-125.5423
2018-04-24,29.1,10.1,48.9528,-125.5423
2018-04-25,28.3,11,48.9528,-125.5423
2018-04-26,27.4,12.4,48.9528,-125.5423
2018-04-27,28.4,11.5,48.9528,-125.5423
2018-04-28,28.7,11,48.9528,-125.5423
2018-04-29,28.4,11.1,48.9528,-125.5423
2018-04-30,27.3,12.1,48.9528,-125.5423
2018-05-01,28.1,12.6,48.9528,-125.5423
2018-05-02,28.7,11.7,48.9528,-125.5423
2018-05-03,27.5,12,48.9528,-125.5423
2018-05-04,29,11.8,48.9528,-125.5423
2018-05-05,29.5,11.2,48.9528,-125.5423
2018-05-07,28.5,12,48.9528,-125.5423
2018-05-08,29.9,11.9,48.9528,-125.5423
2018-05-09,28.7,12.2,48.9528,-125.5423
2018-05-10,26.8,11.8,48.9528,-125.5423
2018-05-12,29.8,12.7,48.9528,-125.5423
2018-05-13,30.2,12,48.9528,-125.5423
2018-05-14,29.6,11.8,48.9528,-125.5423
2018-05-19,30.2,11.5,48.9528,-125.5423
2018-05-20,30.2,11.4,48.9528,-125.5423
2018-06-08,28.5,11.4,48.9528,-125.5423
2018-06-09,29.7,11.7,48.9528,-125.5423
2018-06-10,29.9,12.5,48.9528,-125.5423
2018-06-11,30.2,12.1,48.9528,-125.5423
2018-06-12,30.3,12.1,48.9528,-125.5423
2018-06-14,29.8,13.2,48.9528,-125.5423
2018-06-15,30,13.7,48.9528,-125.5423
2018-06-16,30.3,13.1,48.9528,-125.5423
2018-06-18,30,14.3,48.9528,-125.5423
2018-06-19,30.3,13.6,48.9528,-125.5423
2018-07-04,30.2,14.6,48.9528,-125.5423
2018-07-06,30,13.9,48.9528,-125.5423
2018-07-07,30,13.4,48.9528,-125.5423
2018-07-16,30.2,15.8,48.9528,-125.5423
2018-07-17,30.3,15.9,48.9528,-125.5423
2018-08-31,30.2,14,48.9528,-125.5423
2018-09-08,30.1,13.3,48.9528,-125.5423
2018-09-09,29,13.2,48.9528,-125.5423
2018-09-11,30.2,13.8,48.9528,-125.5423
2018-09-12,30,13.6,48.9528,-125.5423
2018-09-13,29.9,13.7,48.9528,-125.5423
2018-09-14,28.5,13.2,48.9528,-125.5423
2018-09-15,30.3,12.9,48.9528,-125.5423
2018-09-16,29.1,12.2,48.9528,-125.5423
2018-09-19,30.2,11.9,48.9528,-125.5423
2018-09-20,25.1,12.6,48.9528,-125.5423
2018-09-21,27.1,12.3,48.9528,-125.5423
2018-09-22,30.1,12.2,48.9528,-125.5423
2018-09-24,29.1,12.6,48.9528,-125.5423
2018-09-25,27.4,14.1,48.9528,-125.5423
2018-09-26,28.5,13.9,48.9528,-125.5423
2018-09-27,28.4,14.1,48.9528,-125.5423
2018-09-28,29.4,14.1,48.9528,-125.5423
2018-09-29,29.1,13.8,48.9528,-125.5423
2018-09-30,29.2,13.4,48.9528,-125.5423
2018-10-01,28.4,13.5,48.9528,-125.5423
2018-10-03,28.6,12.6,48.9528,-125.5423
2018-10-04,29.5,12.1,48.9528,-125.5423
2018-10-05,29.3,11.6,48.9528,-125.5423
2018-10-07,29.9,12.2,48.9528,-125.5423
2018-10-08,30.2,12.6,48.9528,-125.5423
2018-10-10,29.8,12.7,48.9528,-125.5423
2018-10-11,29.5,13.1,48.9528,-125.5423
2018-10-12,30.1,12.9,48.9528,-125.5423
2018-10-20,30.3,12,48.9528,-125.5423
2018-10-29,29.8,11.1,48.9528,-125.5423
2018-10-30,29.8,11.1,48.9528,-125.5423
2018-10-31,29.9,11.8,48.9528,-125.5423
2018-11-01,25.8,11.9,48.9528,-125.5423
2018-11-02,30.2,11.6,48.9528,-125.5423
2018-11-03,28.7,11.7,48.9528,-125.5423
2018-11-07,26.8,11.1,48.9528,-125.5423
2018-11-08,24.2,10.4,48.9528,-125.5423
2018-11-09,25.2,10.4,48.9528,-125.5423
2018-11-10,26.5,10.6,48.9528,-125.5423
2018-11-12,26.1,10.1,48.9528,-125.5423
2018-11-13,25.4,10.3,48.9528,-125.5423
2018-11-14,27.3,10.9,48.9528,-125.5423
2018-11-15,25.9,11,48.9528,-125.5423
2018-11-16,28.7,10.9,48.9528,-125.5423
2018-11-17,27.7,10.5,48.9528,-125.5423
2018-11-18,28.2,9.9,48.9528,-125.5423
2018-11-19,26.9,9.3,48.9528,-125.5423
2018-11-20,27.8,9.7,48.9528,-125.5423
2018-11-21,29.6,10.4,48.9528,-125.5423
2018-11-22,28.3,9.8,48.9528,-125.5423
2018-11-24,28.2,9.5,48.9528,-125.5423
2018-11-25,24.4,9.8,48.9528,-125.5423
2018-11-27,30.3,10.8,48.9528,-125.5423
2018-11-28,28.1,11.1,48.9528,-125.5423
2018-11-29,28.4,10.6,48.9528,-125.5423
2018-11-30,27.3,10.2,48.9528,-125.5423
2018-12-01,27,9.8,48.9528,-125.5423
2018-12-02,25.8,8.8,48.9528,-125.5423
2018-12-03,26.9,8.4,48.9528,-125.5423
2018-12-04,27.8,8.9,48.9528,-125.5423
2018-12-05,28.3,8.8,48.9528,-125.5423
2018-12-06,29.3,9.3,48.9528,-125.5423
2018-12-07,28.6,8.7,48.9528,-125.5423
2018-12-08,29.1,9,48.9528,-125.5423
2018-12-09,29.2,9.5,48.9528,-125.5423
2018-12-10,28.8,9.2,48.9528,-125.5423
2018-12-11,28.8,9.6,48.9528,-125.5423
2018-12-12,29.6,9.6,48.9528,-125.5423
2018-12-13,30,10.1,48.9528,-125.5423
2018-12-15,26.2,9.5,48.9528,-125.5423
2018-12-17,29.2,10,48.9528,-125.5423
2018-12-18,28.7,10,48.9528,-125.5423
2018-12-21,27.4,9.2,48.9528,-125.5423
2018-12-22,28.5,9.4,48.9528,-125.5423
2018-12-23,29.4,9.3,48.9528,-125.5423
2018-12-24,27.7,9,48.9528,-125.5423
2018-12-25,26.6,8.4,48.9528,-125.5423
2018-12-26,26.6,8.7,48.9528,-125.5423
2018-12-27,26,8.1,48.9528,-125.5423
2018-12-28,24.7,8.9,48.9528,-125.5423
2018-12-29,24.9,9.4,48.9528,-125.5423
2018-12-31,28.8,7,48.9528,-125.5423
2019-01-01,29.1,7.7,48.9528,-125.5423
2019-01-03,23.4,10.3,48.9528,-125.5423
2019-01-05,26.3,8.6,48.9528,-125.5423
2019-01-06,28.9,8.6,48.9528,-125.5423
2019-01-07,26.2,8.3,48.9528,-125.5423
2019-01-08,25.2,8,48.9528,-125.5423
2019-01-10,27.3,9,48.9528,-125.5423
2019-01-11,28,9.3,48.9528,-125.5423
2019-01-12,25.5,9,48.9528,-125.5423
2019-01-14,26.9,8.8,48.9528,-125.5423
2019-01-15,26.2,7.9,48.9528,-125.5423
2019-01-16,26.7,8,48.9528,-125.5423
2019-01-17,27.2,8.6,48.9528,-125.5423
2019-01-20,28.8,8.7,48.9528,-125.5423
2019-01-22,27.2,8.8,48.9528,-125.5423
2019-01-23,28.6,9.3,48.9528,-125.5423
2019-01-24,27.8,9,48.9528,-125.5423
2019-01-25,27.7,9.2,48.9528,-125.5423
2019-01-26,27.4,8.9,48.9528,-125.5423
2019-01-27,27.4,9,48.9528,-125.5423
2019-01-28,27.7,8.2,48.9528,-125.5423
2019-01-29,27.2,7.7,48.9528,-125.5423
2019-01-30,29,8.5,48.9528,-125.5423
2019-01-31,28,8.4,48.9528,-125.5423
2019-02-01,27.4,8.9,48.9528,-125.5423
2019-02-02,28.9,9.6,48.9528,-125.5423
2019-02-04,29.1,7.8,48.9528,-125.5423
2019-02-05,29.2,8,48.9528,-125.5423
2019-02-06,28.9,7.7,48.9528,-125.5423
2019-02-07,28.9,7.8,48.9528,-125.5423
2019-02-08,29,7.7,48.9528,-125.5423
2019-02-09,28.9,7,48.9528,-125.5423
2019-02-10,29.8,7.3,48.9528,-125.5423
2019-02-11,30,6.8,48.9528,-125.5423
2019-02-12,30.1,7.4,48.9528,-125.5423
2019-02-13,30.1,7.2,48.9528,-125.5423
2019-02-14,29.8,6.4,48.9528,-125.5423
2019-02-16,29.9,7.5,48.9528,-125.5423
2019-02-18,28.6,7.5,48.9528,-125.5423
2019-02-19,30.1,7.8,48.9528,-125.5423
2019-02-21,29.9,8.2,48.9528,-125.5423
2019-02-22,30.2,8.6,48.9528,-125.5423
2019-02-23,28.7,8.1,48.9528,-125.5423
2019-02-24,30,8.1,48.9528,-125.5423
2019-02-25,29.5,7.6,48.9528,-125.5423
2019-02-26,29,7.9,48.9528,-125.5423
2019-03-03,30.2,7.9,48.9528,-125.5423
2019-03-05,29.7,7.4,48.9528,-125.5423
2019-03-06,30.2,7.7,48.9528,-125.5423
2019-03-07,30.1,7.9,48.9528,-125.5423
2019-03-08,30.1,7.9,48.9528,-125.5423
2019-03-09,29.6,8,48.9528,-125.5423
2019-03-11,30.1,7.7,48.9528,-125.5423
2019-03-14,27.2,7.7,48.9528,-125.5423
2019-03-15,29.4,7.8,48.9528,-125.5423
2019-03-16,29.9,7.9,48.9528,-125.5423
2019-03-18,30.3,8.6,48.9528,-125.5423
2019-03-19,30.1,9.4,48.9528,-125.5423
2019-03-20,30.2,9.4,48.9528,-125.5423
2019-03-21,30.3,9.1,48.9528,-125.5423
2019-03-22,30.3,9.1,48.9528,-125.5423
2019-03-23,30.3,9.4,48.9528,-125.5423
2019-03-27,29.8,9.8,48.9528,-125.5423
2019-03-30,29.7,9.6,48.9528,-125.5423
2019-04-02,30.3,10.6,48.9528,-125.5423
2019-04-03,29.8,10.5,48.9528,-125.5423
2019-04-04,30.2,10.5,48.9528,-125.5423
2019-04-05,29.6,10.7,48.9528,-125.5423
2019-04-07,29.4,10.6,48.9528,-125.5423
2019-04-08,29.6,10.3,48.9528,-125.5423
2019-04-09,29.7,10.5,48.9528,-125.5423
2019-04-10,29.1,10.7,48.9528,-125.5423
2019-04-11,29.1,10.7,48.9528,-125.5423
2019-04-12,29.5,10.8,48.9528,-125.5423
2019-04-13,29.4,10.3,48.9528,-125.5423
2019-04-14,30.1,9.7,48.9528,-125.5423
2019-04-15,28.2,10.2,48.9528,-125.5423
2019-04-16,29,10.5,48.9528,-125.5423
2019-04-17,29.3,10.9,48.9528,-125.5423
2019-04-18,26.2,10.6,48.9528,-125.5423
2019-04-19,28.2,11.4,48.9528,-125.5423
2019-04-20,29.1,11.1,48.9528,-125.5423
2019-04-21,28.6,11.1,48.9528,-125.5423
2019-04-22,26.8,10.8,48.9528,-125.5423
2019-04-23,28.8,11.3,48.9528,-125.5423
2019-04-24,28.5,11.4,48.9528,-125.5423
2019-04-25,29,10.9,48.9528,-125.5423
2019-04-27,29.3,9.9,48.9528,-125.5423
2019-04-28,29.9,9.6,48.9528,-125.5423
2019-04-29,29.8,11.1,48.9528,-125.5423
2019-04-30,29.7,11.5,48.9528,-125.5423
2019-05-01,28.7,11.1,48.9528,-125.5423
2019-05-02,29.8,10.7,48.9528,-125.5423
2019-05-03,30.3,10.7,48.9528,-125.5423
2019-05-04,29.2,12,48.9528,-125.5423
2019-05-05,29.7,12,48.9528,-125.5423
2019-05-06,29.2,12.3,48.9528,-125.5423
2019-05-07,29.6,12.5,48.9528,-125.5423
2019-05-08,27.8,11.7,48.9528,-125.5423
2019-05-10,29.7,12,48.9528,-125.5423
2019-05-11,29.8,12.9,48.9528,-125.5423
2019-05-12,29.3,13.4,48.9528,-125.5423
2019-05-13,29.6,12.9,48.9528,-125.5423
2019-05-14,29.5,12.6,48.9528,-125.5423
2019-05-15,29.7,12.8,48.9528,-125.5423
2019-05-16,29.5,12.9,48.9528,-125.5423
2019-05-17,29.9,11.8,48.9528,-125.5423
2019-05-18,29.8,12.3,48.9528,-125.5423
2019-05-19,30.1,11.8,48.9528,-125.5423
2019-05-20,30.2,12.6,48.9528,-125.5423
2019-05-22,30.2,12.4,48.9528,-125.5423
2019-05-26,30.3,12.9,48.9528,-125.5423
2019-05-27,30,13.1,48.9528,-125.5423
2019-05-28,30.2,13.5,48.9528,-125.5423
2019-06-02,30,13.4,48.9528,-125.5423
2019-06-07,29.8,12.7,48.9528,-125.5423
2019-06-08,30.2,12.7,48.9528,-125.5423
2019-06-11,30.3,11.7,48.9528,-125.5423
2019-06-12,30,12.3,48.9528,-125.5423
2019-06-15,29.9,11.5,48.9528,-125.5423
2019-06-29,29.6,13.3,48.9528,-125.5423
2019-06-30,29.9,14.4,48.9528,-125.5423
2019-07-10,30.3,14.3,48.9528,-125.5423
2019-07-12,30,14.6,48.9528,-125.5423
2019-07-13,30.2,14.6,48.9528,-125.5423
2019-07-14,30,14.9,48.9528,-125.5423
2019-07-15,30,14.9,48.9528,-125.5423
2019-07-19,30.3,14,48.9528,-125.5423
2019-07-20,29.4,13.7,48.9528,-125.5423
2019-07-21,30.1,13.2,48.9528,-125.5423
2019-07-22,29.2,15.4,48.9528,-125.5423
2019-07-23,30.1,13.6,48.9528,-125.5423
2019-07-24,29.3,13.7,48.9528,-125.5423
2019-07-25,30,15.4,48.9528,-125.5423
2019-07-28,29.6,13.8,48.9528,-125.5423
2019-07-30,30.3,14.7,48.9528,-125.5423
2019-07-31,29.5,15.7,48.9528,-125.5423
2019-08-01,25.4,15.6,48.9528,-125.5423
2019-08-02,29.1,14.6,48.9528,-125.5423
2019-08-03,29.6,14.8,48.9528,-125.5423
2019-08-04,29.1,15.7,48.9528,-125.5423
2019-08-05,29.9,14.6,48.9528,-125.5423
2019-08-06,28.5,15.6,48.9528,-125.5423
2019-08-07,29.5,15.8,48.9528,-125.5423
2019-08-08,30.3,15,48.9528,-125.5423
2019-08-09,29.6,14.2,48.9528,-125.5423
2019-08-12,30,14.7,48.9528,-125.5423
2019-08-13,30.2,14.7,48.9528,-125.5423
2019-08-14,29.8,15.2,48.9528,-125.5423
2019-08-18,30,14.9,48.9528,-125.5423
2019-08-19,29.7,15.7,48.9528,-125.5423
2019-08-22,29.4,14.5,48.9528,-125.5423
2019-08-23,30.2,14.1,48.9528,-125.5423
2019-08-24,30,14.5,48.9528,-125.5423
2019-08-25,30.3,13.2,48.9528,-125.5423
2019-08-26,29.3,14.8,48.9528,-125.5423
2019-08-27,29.3,15.4,48.9528,-125.5423
2019-08-29,29.7,15.6,48.9528,-125.5423
2019-08-30,29.9,15.9,48.9528,-125.5423
2019-08-31,30,15.4,48.9528,-125.5423
2019-09-01,29.4,14.8,48.9528,-125.5423
2019-09-02,29.9,14.4,48.9528,-125.5423
2019-09-03,29.3,14.6,48.9528,-125.5423
2019-09-04,30,14.5,48.9528,-125.5423
2019-09-05,30.1,14.9,48.9528,-125.5423
2019-09-06,30.2,13.9,48.9528,-125.5423
2019-09-07,30.2,13.5,48.9528,-125.5423
2019-09-08,30.1,14.3,48.9528,-125.5423
2019-09-10,30.2,14,48.9528,-125.5423
2019-09-11,30.1,13.9,48.9528,-125.5423
2019-09-12,26,14.3,48.9528,-125.5423
2019-09-13,29.7,13.4,48.9528,-125.5423
2019-09-14,28.7,13.4,48.9528,-125.5423
2019-09-15,29.1,13.7,48.9528,-125.5423
2019-09-16,28.5,13.9,48.9528,-125.5423
2019-09-17,29.4,14.1,48.9528,-125.5423
2019-09-18,29.7,14.7,48.9528,-125.5423
2019-09-19,29.8,14.7,48.9528,-125.5423
2019-09-20,28.5,15.9,48.9528,-125.5423
2019-09-21,29.3,14.8,48.9528,-125.5423
2019-09-22,28.8,15.4,48.9528,-125.5423
2019-09-23,29.5,14.5,48.9528,-125.5423
2019-09-24,29,15.6,48.9528,-125.5423
2019-09-25,28.4,15.1,48.9528,-125.5423
2019-09-26,29,14,48.9528,-125.5423
2019-09-27,30.2,12.6,48.9528,-125.5423
2019-09-28,29.3,13.5,48.9528,-125.5423
2019-09-29,28.7,14,48.9528,-125.5423
2019-09-30,28.5,14,48.9528,-125.5423
2019-10-01,28.7,13.8,48.9528,-125.5423
2019-10-02,29.3,12.9,48.9528,-125.5423
2019-10-03,28.9,12.8,48.9528,-125.5423
2019-10-04,28.8,13.1,48.9528,-125.5423
2019-10-05,28.4,13.5,48.9528,-125.5423
2019-10-07,26.8,12.9,48.9528,-125.5423
2019-10-09,29.4,11.5,48.9528,-125.5423
2019-10-10,29.5,11.4,48.9528,-125.5423
2019-10-11,29.7,11.8,48.9528,-125.5423
2019-10-12,30.1,11.8,48.9528,-125.5423
2019-10-13,29.3,12.1,48.9528,-125.5423
2019-10-14,29.7,12.1,48.9528,-125.5423
2019-10-15,29,11.9,48.9528,-125.5423
2019-10-16,29.6,11.3,48.9528,-125.5423
2019-10-17,30.2,11.1,48.9528,-125.5423
2019-10-18,30.1,10.9,48.9528,-125.5423
2019-10-20,26.9,11.3,48.9528,-125.5423
2019-10-21,28.6,10.8,48.9528,-125.5423
2019-10-22,30,11.7,48.9528,-125.5423
2019-10-23,28.2,11.6,48.9528,-125.5423
2019-10-24,26.5,11.6,48.9528,-125.5423
2019-10-25,29.6,11.5,48.9528,-125.5423
2019-10-26,28.7,11.4,48.9528,-125.5423
2019-10-27,27.5,10.6,48.9528,-125.5423
2019-10-28,28.3,11,48.9528,-125.5423
2019-10-29,28,10.5,48.9528,-125.5423
2019-10-30,27.8,10.2,48.9528,-125.5423
2019-10-31,28.3,10.2,48.9528,-125.5423
2019-11-01,28.9,10.5,48.9528,-125.5423
2019-11-02,27.3,10.5,48.9528,-125.5423
2019-11-03,28.8,10.4,48.9528,-125.5423
2019-11-04,28.6,10.5,48.9528,-125.5423
2019-11-05,29.2,10.4,48.9528,-125.5423
2019-11-06,30.1,10.3,48.9528,-125.5423
2019-11-07,29.1,10.1,48.9528,-125.5423
2019-11-08,28.8,10.1,48.9528,-125.5423
2019-11-09,28.3,10.4,48.9528,-125.5423
2019-11-10,28.7,10.3,48.9528,-125.5423
2019-11-11,29.4,10.6,48.9528,-125.5423
2019-11-12,28.6,10.3,48.9528,-125.5423
2019-11-13,29.5,10.2,48.9528,-125.5423
2019-11-14,29.7,10.3,48.9528,-125.5423
2019-11-15,29.1,10.5,48.9528,-125.5423
2019-11-17,28.6,10.1,48.9528,-125.5423
2019-11-18,27.5,10,48.9528,-125.5423
2019-11-19,28.1,10.1,48.9528,-125.5423
2019-11-20,29.2,9.4,48.9528,-125.5423
2019-11-21,27.6,9.1,48.9528,-125.5423
2019-11-22,29,9.1,48.9528,-125.5423
2019-11-23,28.8,9.7,48.9528,-125.5423
2019-11-26,29.4,9.2,48.9528,-125.5423
2019-11-27,29.7,8.8,48.9528,-125.5423
2019-11-28,28.8,8.3,48.9528,-125.5423
2019-11-29,29.2,8.3,48.9528,-125.5423
2019-11-30,30,8.4,48.9528,-125.5423
2019-12-01,29.8,8.2,48.9528,-125.5423
2019-12-02,29.8,8.2,48.9528,-125.5423
2019-12-03,29.2,8.5,48.9528,-125.5423
2019-12-04,30.3,8.7,48.9528,-125.5423
2019-12-05,29.1,8.2,48.9528,-125.5423
2019-12-06,29.7,8.7,48.9528,-125.5423
2019-12-07,30,8.7,48.9528,-125.5423
2019-12-08,29.6,8.5,48.9528,-125.5423
2019-12-09,29.1,8.5,48.9528,-125.5423
2019-12-10,29.8,8.6,48.9528,-125.5423
2019-12-14,30.3,9.1,48.9528,-125.5423
2019-12-15,29.5,8.8,48.9528,-125.5423
2019-12-16,28.2,8.6,48.9528,-125.5423
2019-12-19,28,9.1,48.9528,-125.5423
2019-12-20,30.3,9.4,48.9528,-125.5423
2019-12-21,30.2,9.3,48.9528,-125.5423
2019-12-22,28.8,8.8,48.9528,-125.5423
2019-12-23,26.3,7.5,48.9528,-125.5423
2019-12-24,25.8,7.6,48.9528,-125.5423
2019-12-25,28.9,8.5,48.9528,-125.5423
2019-12-26,26.7,7.5,48.9528,-125.5423
2019-12-27,28.1,8.2,48.9528,-125.5423
2019-12-28,26.3,7.6,48.9528,-125.5423
2019-12-29,27.4,8.3,48.9528,-125.5423
2019-12-30,28.4,8.5,48.9528,-125.5423
2019-12-31,26.7,8.7,48.9528,-125.5423
2020-01-01,29.7,9.1,48.9528,-125.5423
2020-01-02,30.3,8.6,48.9528,-125.5423
2020-01-04,29.9,8.9,48.9528,-125.5423
2020-01-05,27.7,8.3,48.9528,-125.5423
2020-01-06,27.3,8.3,48.9528,-125.5423
2020-01-07,27,8.5,48.9528,-125.5423
2020-01-08,29,8.3,48.9528,-125.5423
2020-01-09,25.9,7.5,48.9528,-125.5423
2020-01-10,26.5,8.3,48.9528,-125.5423
2020-01-13,28.3,7.8,48.9528,-125.5423
2020-01-14,29.8,8.1,48.9528,-125.5423
2020-01-15,27.3,6.9,48.9528,-125.5423
2020-01-16,30,8.6,48.9528,-125.5423
2020-01-17,28,7,48.9528,-125.5423
2020-01-19,29.6,8.3,48.9528,-125.5423
2020-01-20,28.1,8.1,48.9528,-125.5423
2020-01-21,28.2,8,48.9528,-125.5423
2020-01-22,29,8.4,48.9528,-125.5423
2020-01-23,28.9,8.4,48.9528,-125.5423
2020-01-24,28.9,8.7,48.9528,-125.5423
2020-01-25,27.2,8.7,48.9528,-125.5423
2020-01-26,27.2,8.8,48.9528,-125.5423
2020-01-27,26.1,8.6,48.9528,-125.5423
2020-01-28,28.3,9.3,48.9528,-125.5423
2020-01-30,25.6,8.6,48.9528,-125.5423
2020-01-31,23,9,48.9528,-125.5423
2020-02-01,29.3,9.1,48.9528,-125.5423
2020-02-02,25.3,8.5,48.9528,-125.5423
2020-02-03,26.2,8,48.9528,-125.5423
2020-02-04,29.3,6.9,48.9528,-125.5423
2020-02-05,26.4,8.6,48.9528,-125.5423
2020-02-06,24.9,8.5,48.9528,-125.5423
2020-02-07,24,8.2,48.9528,-125.5423
2020-02-08,27,8.9,48.9528,-125.5423
2020-02-09,27,8.7,48.9528,-125.5423
2020-02-10,27,8.7,48.9528,-125.5423
2020-02-11,26.9,8.7,48.9528,-125.5423
2020-02-12,26.7,8.7,48.9528,-125.5423
2020-02-13,27,8.9,48.9528,-125.5423
2020-02-14,29.1,9,48.9528,-125.5423
2020-02-16,29,8.9,48.9528,-125.5423
2020-02-17,29.9,8.1,48.9528,-125.5423
2020-02-18,27.6,7.7,48.9528,-125.5423
2020-02-19,26.9,7.6,48.9528,-125.5423
2020-02-20,27.4,7.8,48.9528,-125.5423
2020-02-21,27.9,7.9,48.9528,-125.5423
2020-02-22,28.7,8.6,48.9528,-125.5423
2020-02-23,29.5,8.6,48.9528,-125.5423
2020-02-24,29,8.9,48.9528,-125.5423
2020-02-25,28.4,8.2,48.9528,-125.5423
2020-02-26,29.3,8.7,48.9528,-125.5423
2020-02-27,26.8,8.7,48.9528,-125.5423
2020-02-29,29.3,9.2,48.9528,-125.5423
2020-03-01,28.8,8.6,48.9528,-125.5423
2020-03-02,28.1,8.7,48.9528,-125.5423
2020-03-03,30,8.6,48.9528,-125.5423
2020-03-04,30.3,8.7,48.9528,-125.5423
2020-03-05,29.1,8.4,48.9528,-125.5423
2020-03-06,29.9,8,48.9528,-125.5423
2020-03-07,27.9,7.6,48.9528,-125.5423
2020-03-08,28.7,8.1,48.9528,-125.5423
2020-03-09,28.3,8.1,48.9528,-125.5423
2020-03-10,27.6,8.1,48.9528,-125.5423
2020-03-11,29.3,9.1,48.9528,-125.5423
2020-03-12,28.2,9.2,48.9528,-125.5423
2020-03-13,27.7,9.2,48.9528,-125.5423
2020-03-14,27.5,8.6,48.9528,-125.5423
2020-03-15,28.5,8.6,48.9528,-125.5423
2020-03-16,27.9,8.6,48.9528,-125.5423
2020-03-17,28.2,7.5,48.9528,-125.5423
2020-03-18,28.5,7.7,48.9528,-125.5423
2020-03-19,27.8,8.5,48.9528,-125.5423
2020-03-20,29,9.1,48.9528,-125.5423
2020-03-21,29.1,8.9,48.9528,-125.5423
2020-03-22,28.5,8.8,48.9528,-125.5423
2020-03-23,29.9,8.5,48.9528,-125.5423
2020-03-24,28.9,9.2,48.9528,-125.5423
2020-03-25,29.3,9.5,48.9528,-125.5423
2020-03-26,29.4,8.9,48.9528,-125.5423
2020-03-27,28.9,8.8,48.9528,-125.5423
2020-03-28,28.6,8.9,48.9528,-125.5423
2020-03-29,29.6,9.1,48.9528,-125.5423
2020-03-30,29.6,9.1,48.9528,-125.5423
2020-04-01,27.5,8.1,48.9528,-125.5423
2020-04-02,29.2,8.3,48.9528,-125.5423
2020-04-03,29.8,8.4,48.9528,-125.5423
2020-04-04,30.2,8.4,48.9528,-125.5423
2020-04-05,28.7,9.4,48.9528,-125.5423
2020-04-06,28.6,9.1,48.9528,-125.5423
2020-04-07,29,9.5,48.9528,-125.5423
2020-04-08,29.6,9.7,48.9528,-125.5423
2020-04-09,29.7,9.6,48.9528,-125.5423
2020-04-10,29.6,9.4,48.9528,-125.5423
2020-04-11,28.8,10,48.9528,-125.5423
2020-04-12,29,10.1,48.9528,-125.5423
2020-04-13,29.6,9.9,48.9528,-125.5423
2020-04-14,28.9,10,48.9528,-125.5423
2020-04-15,29,9.8,48.9528,-125.5423
2020-04-16,29.9,9.1,48.9528,-125.5423
2020-04-17,29.8,9.6,48.9528,-125.5423
2020-04-18,29.3,10.2,48.9528,-125.5423
2020-04-19,29.7,10.3,48.9528,-125.5423
2020-04-20,29.2,10.3,48.9528,-125.5423
2020-04-21,29.5,10.1,48.9528,-125.5423
2020-04-22,29.1,10.3,48.9528,-125.5423
2020-04-23,30.1,9.7,48.9528,-125.5423
2020-04-24,29.9,10.1,48.9528,-125.5423
2020-04-25,29.2,10.4,48.9528,-125.5423
2020-04-26,28.6,10.5,48.9528,-125.5423
2020-04-27,29.9,9.8,48.9528,-125.5423
2020-04-28,27.9,10.3,48.9528,-125.5423
2020-04-29,29.1,10.3,48.9528,-125.5423
2020-04-30,29.1,10.1,48.9528,-125.5423
2020-05-01,28.5,10.6,48.9528,-125.5423
2020-05-02,27.5,10.7,48.9528,-125.5423
2020-05-03,28.6,10.4,48.9528,-125.5423
2020-05-04,27.7,10.7,48.9528,-125.5423
2020-05-05,29.4,10.9,48.9528,-125.5423
2020-05-06,28.9,11.7,48.9528,-125.5423
2020-05-07,28.1,12.3,48.9528,-125.5423
2020-05-08,28.6,12.5,48.9528,-125.5423
2020-05-09,28.6,13.1,48.9528,-125.5423
2020-05-10,28.1,13.9,48.9528,-125.5423
2020-05-11,28,13.1,48.9528,-125.5423
2020-05-12,28.6,12.9,48.9528,-125.5423
2020-05-13,28.5,13.2,48.9528,-125.5423
2020-05-14,28.7,12.8,48.9528,-125.5423
2020-05-15,28.6,12.7,48.9528,-125.5423
2020-05-16,27.8,13.7,48.9528,-125.5423
2020-05-17,27.5,12.8,48.9528,-125.5423
2020-05-18,28.2,12.8,48.9528,-125.5423
2020-05-19,28.5,13.5,48.9528,-125.5423
2020-05-20,28.6,12.8,48.9528,-125.5423
2020-05-21,29,12,48.9528,-125.5423
2020-05-22,29,12.7,48.9528,-125.5423
2020-05-23,29.4,12.2,48.9528,-125.5423
2020-05-24,29.4,12.4,48.9528,-125.5423
2020-05-25,29.1,11.7,48.9528,-125.5423
2020-05-26,29.8,11.5,48.9528,-125.5423
2020-05-27,29.7,12,48.9528,-125.5423
2020-05-28,28.7,12.2,48.9528,-125.5423
2020-05-30,29.7,10.5,48.9528,-125.5423
2020-06-01,30.1,10.3,48.9528,-125.5423
2020-06-02,30.1,10.4,48.9528,-125.5423
2020-06-03,29.4,11.8,48.9528,-125.5423
2020-06-04,29.8,11.3,48.9528,-125.5423
2020-06-05,29.5,12,48.9528,-125.5423
2020-06-06,29.8,12.2,48.9528,-125.5423
2020-06-07,30.2,11.3,48.9528,-125.5423
2020-06-09,29.6,11.6,48.9528,-125.5423
2020-06-10,29.8,11.7,48.9528,-125.5423
2020-06-11,29.2,12.7,48.9528,-125.5423
2020-06-12,29,12.5,48.9528,-125.5423
2020-06-13,28.9,12.5,48.9528,-125.5423
2020-06-14,29.7,12.4,48.9528,-125.5423
2020-06-15,28.2,13.4,48.9528,-125.5423
2020-06-16,29.1,13.4,48.9528,-125.5423
2020-06-17,29.4,12.5,48.9528,-125.5423
2020-06-18,29.7,12.6,48.9528,-125.5423
2020-06-19,29.9,12.5,48.9528,-125.5423
2020-06-20,26,12.7,48.9528,-125.5423
2020-06-21,29.5,11.5,48.9528,-125.5423
2020-06-22,29.6,11.8,48.9528,-125.5423
2020-06-23,29.3,12.1,48.9528,-125.5423
2020-06-24,29.6,11.5,48.9528,-125.5423
2020-06-25,30,11.3,48.9528,-125.5423
2020-06-26,28.9,11.3,48.9528,-125.5423
2020-06-27,29.7,11.5,48.9528,-125.5423
2020-06-28,29.9,10.9,48.9528,-125.5423
2020-06-29,28.8,11.8,48.9528,-125.5423
2020-06-30,29.6,12,48.9528,-125.5423
2020-07-01,29.9,12.3,48.9528,-125.5423
2020-07-02,30,11.2,48.9528,-125.5423
2020-07-03,29.2,12.1,48.9528,-125.5423
2020-07-04,29.7,12,48.9528,-125.5423
2020-07-05,29.8,12.4,48.9528,-125.5423
2020-07-06,28.7,13.5,48.9528,-125.5423
2020-07-07,29.4,13.9,48.9528,-125.5423
2020-07-08,28.6,13.7,48.9528,-125.5423
2020-07-09,28.8,13,48.9528,-125.5423
2020-07-10,28.8,14.7,48.9528,-125.5423
2020-07-11,28,14.7,48.9528,-125.5423
2020-07-12,29.1,13.7,48.9528,-125.5423
2020-07-13,28.3,13.6,48.9528,-125.5423
2020-07-14,29.8,12.5,48.9528,-125.5423
2020-07-15,29.7,12.7,48.9528,-125.5423
2020-07-16,29,12.6,48.9528,-125.5423
2020-07-17,29.8,12.2,48.9528,-125.5423
2020-07-18,29,13.1,48.9528,-125.5423
2020-07-19,29.7,12.7,48.9528,-125.5423
2020-07-20,29.7,13,48.9528,-125.5423
2020-07-21,29.8,12.8,48.9528,-125.5423
2020-07-22,29.5,13.9,48.9528,-125.5423
2020-07-23,30,11.9,48.9528,-125.5423
2020-07-24,30.1,11.8,48.9528,-125.5423
2020-07-26,28.6,13.5,48.9528,-125.5423
2020-07-27,28.9,12.8,48.9528,-125.5423
2020-07-28,29.7,14.3,48.9528,-125.5423
2020-07-29,29.5,14.3,48.9528,-125.5423
2020-07-30,29.2,13.2,48.9528,-125.5423
2020-07-31,29.2,12.8,48.9528,-125.5423
2020-08-01,28.6,15.5,48.9528,-125.5423
2020-08-03,28.5,14.4,48.9528,-125.5423
2020-08-04,29,13.4,48.9528,-125.5423
2020-08-05,28.2,15.4,48.9528,-125.5423
2020-08-06,29,12.1,48.9528,-125.5423
2020-08-07,29.6,12.3,48.9528,-125.5423
2020-08-08,28.7,12.9,48.9528,-125.5423
2020-08-09,29.5,13.3,48.9528,-125.5423
2020-08-10,27.9,14.1,48.9528,-125.5423
2020-08-11,28.5,13.5,48.9528,-125.5423
2020-08-12,29.7,14.2,48.9528,-125.5423
2020-08-13,29.7,14,48.9528,-125.5423
2020-08-14,29.6,13.9,48.9528,-125.5423
2020-08-15,29.6,13.9,48.9528,-125.5423
2020-08-18,29.7,15.7,48.9528,-125.5423
2020-08-21,26.3,15.3,48.9528,-125.5423
2020-08-22,27.8,15.3,48.9528,-125.5423
2020-08-23,28,15.4,48.9528,-125.5423
2020-08-25,28.3,14.4,48.9528,-125.5423
2020-08-26,28.9,13.4,48.9528,-125.5423
2020-08-27,28.8,13.2,48.9528,-125.5423
2020-08-28,29.1,13.7,48.9528,-125.5423
2020-08-29,29.9,12.5,48.9528,-125.5423
2020-08-30,29.3,13.2,48.9528,-125.5423
2020-08-31,29.8,12.6,48.9528,-125.5423
2020-09-01,28.9,14.4,48.9528,-125.5423
2020-09-02,29.2,12.4,48.9528,-125.5423
2020-09-03,29.4,13.8,48.9528,-125.5423
2020-09-04,28.5,15,48.9528,-125.5423
2020-09-05,29.3,13.7,48.9528,-125.5423
2020-09-06,29.2,14.2,48.9528,-125.5423
2020-09-07,29.4,14.3,48.9528,-125.5423
2020-09-08,29.1,15,48.9528,-125.5423
2020-09-09,29.3,14.9,48.9528,-125.5423
2020-09-11,28.4,15.6,48.9528,-125.5423
2020-09-12,29.3,14.6,48.9528,-125.5423
2020-09-13,29.2,15.3,48.9528,-125.5423
2020-09-14,29,15,48.9528,-125.5423
2020-09-15,29.4,14.2,48.9528,-125.5423
2020-09-16,29.2,14.7,48.9528,-125.5423
2020-09-17,28.9,15,48.9528,-125.5423
2020-09-18,29.3,13.9,48.9528,-125.5423
2020-09-19,29.5,14.3,48.9528,-125.5423
2020-09-20,29.2,14.6,48.9528,-125.5423
2020-09-21,29.1,14.4,48.9528,-125.5423
2020-09-22,28.6,13.9,48.9528,-125.5423
2020-09-23,29.4,13,48.9528,-125.5423
2020-09-24,29.4,12.4,48.9528,-125.5423
2020-09-25,28.5,12.6,48.9528,-125.5423
2020-09-26,28,12.8,48.9528,-125.5423
2020-09-27,28.8,12.3,48.9528,-125.5423
2020-09-28,28.9,12.6,48.9528,-125.5423
2020-09-29,29.1,13.3,48.9528,-125.5423
2020-09-30,28.9,14.7,48.9528,-125.5423
2020-10-01,29.5,14.4,48.9528,-125.5423
2020-10-02,29.4,14.1,48.9528,-125.5423
2020-10-03,29.3,14.2,48.9528,-125.5423
2020-10-04,28.5,14.6,48.9528,-125.5423
2020-10-05,29.3,14.6,48.9528,-125.5423
2020-10-06,29.2,14.6,48.9528,-125.5423
2020-10-07,28.6,14.7,48.9528,-125.5423
2020-10-08,28.8,14.3,48.9528,-125.5423
2020-10-09,28.8,14.3,48.9528,-125.5423
2020-10-10,29.4,13.1,48.9528,-125.5423
2020-10-11,25.2,13.2,48.9528,-125.5423
2020-10-12,29.5,12.2,48.9528,-125.5423
2020-10-13,29.7,11.3,48.9528,-125.5423
2020-10-14,29.5,11.6,48.9528,-125.5423
2020-10-15,28.3,12,48.9528,-125.5423
2020-10-16,28,12.4,48.9528,-125.5423
2020-10-17,29.1,12,48.9528,-125.5423
2020-10-18,27.6,12.8,48.9528,-125.5423
2020-10-19,28.9,12.9,48.9528,-125.5423
2020-10-20,28.1,12.7,48.9528,-125.5423
2020-10-21,29.6,12.7,48.9528,-125.5423
2020-10-22,28.2,12,48.9528,-125.5423
2020-10-23,27.7,11.6,48.9528,-125.5423
2020-10-24,28.7,11,48.9528,-125.5423
2020-10-25,27.5,10.2,48.9528,-125.5423
2020-10-26,27.8,10.6,48.9528,-125.5423
2020-10-27,28.1,10.7,48.9528,-125.5423
2020-10-28,27.6,11.3,48.9528,-125.5423
2020-10-29,27.4,11.3,48.9528,-125.5423
2020-10-30,28.4,10.5,48.9528,-125.5423
2020-10-31,28.3,10.8,48.9528,-125.5423
2020-11-01,29.4,10.9,48.9528,-125.5423
2020-11-02,29.2,10.9,48.9528,-125.5423
2020-11-03,28.3,10.7,48.9528,-125.5423
2020-11-04,27.5,10.7,48.9528,-125.5423
2020-11-05,28.2,10.5,48.9528,-125.5423
2020-11-06,28.3,10,48.9528,-125.5423
2020-11-07,26.4,10.3,48.9528,-125.5423
2020-11-08,26.8,9.8,48.9528,-125.5423
2020-11-09,28.2,9.8,48.9528,-125.5423
2020-11-10,29.1,9.8,48.9528,-125.5423
2020-11-11,28.4,9.5,48.9528,-125.5423
2020-11-12,27.6,9.4,48.9528,-125.5423
2020-11-13,29.1,10.5,48.9528,-125.5423
2020-11-14,29.8,10,48.9528,-125.5423
2020-11-16,29.8,9.7,48.9528,-125.5423
2020-11-18,28.5,9.9,48.9528,-125.5423
2020-11-19,28.8,9.9,48.9528,-125.5423
2020-11-20,28.1,9.7,48.9528,-125.5423
2020-11-21,28,9.4,48.9528,-125.5423
2020-11-22,28.6,9.5,48.9528,-125.5423
2020-11-23,24.8,9.4,48.9528,-125.5423
2020-11-24,28.8,9.9,48.9528,-125.5423
2020-11-25,27.7,9.9,48.9528,-125.5423
2020-11-27,28.8,10.1,48.9528,-125.5423
2020-11-28,27.6,9.3,48.9528,-125.5423
2020-11-29,26.5,9,48.9528,-125.5423
2020-11-30,29,9.9,48.9528,-125.5423
2020-12-01,26.6,9,48.9528,-125.5423
2020-12-02,27.1,8.9,48.9528,-125.5423
2020-12-03,27.4,9.1,48.9528,-125.5423
2020-12-04,27,9.3,48.9528,-125.5423
2020-12-05,27.8,9,48.9528,-125.5423
2020-12-06,27.1,9.4,48.9528,-125.5423
2020-12-07,27.2,9.3,48.9528,-125.5423
2020-12-08,28,9.4,48.9528,-125.5423
2020-12-09,27.6,9.4,48.9528,-125.5423
2020-12-10,26.5,8.9,48.9528,-125.5423
2020-12-11,27.4,8.7,48.9528,-125.5423
2020-12-12,26,7.9,48.9528,-125.5423
2020-12-13,26.6,8.2,48.9528,-125.5423
2020-12-14,28.2,8.8,48.9528,-125.5423
2020-12-15,29.6,9.1,48.9528,-125.5423
2020-12-16,28.5,8.8,48.9528,-125.5423
2020-12-17,28.6,8.8,48.9528,-125.5423
2020-12-18,26.1,8.9,48.9528,-125.5423
2020-12-19,28.7,8.9,48.9528,-125.5423
2020-12-20,29.1,9.2,48.9528,-125.5423
2020-12-21,26.6,8.8,48.9528,-125.5423
2020-12-22,28.9,8.8,48.9528,-125.5423
2020-12-23,26,8.1,48.9528,-125.5423
2020-12-24,27,7.8,48.9528,-125.5423
2020-12-25,27.9,8.8,48.9528,-125.5423
2020-12-26,28.7,8.8,48.9528,-125.5423
2020-12-27,26.5,8.6,48.9528,-125.5423
2020-12-28,27.2,8.5,48.9528,-125.5423
2020-12-29,26.7,8,48.9528,-125.5423
2020-12-31,27.3,8.8,48.9528,-125.5423
2021-01-04,26.5,8.9,48.9528,-125.5423
2021-01-06,27.6,9.7,48.9528,-125.5423
2021-01-07,27,9.1,48.9528,-125.5423
2021-01-08,27.4,9.2,48.9528,-125.5423
2021-01-09,24.2,8.3,48.9528,-125.5423
2021-01-11,27.7,9.3,48.9528,-125.5423
2021-01-12,27,9.6,48.9528,-125.5423
2021-01-13,27.9,9.3,48.9528,-125.5423
2021-01-14,25.1,8.8,48.9528,-125.5423
2021-01-15,28,9.3,48.9528,-125.5423
2021-01-16,26.5,9,48.9528,-125.5423
2021-01-17,26.9,9.3,48.9528,-125.5423
2021-01-18,26.3,9.4,48.9528,-125.5423
2021-01-19,25.8,8.7,48.9528,-125.5423
2021-01-20,24.7,8.5,48.9528,-125.5423
2021-01-21,25.7,8.7,48.9528,-125.5423
2021-01-22,26.6,8.2,48.9528,-125.5423
2021-01-23,26,7.7,48.9528,-125.5423
2021-01-24,25.4,7.9,48.9528,-125.5423
2021-01-25,27.3,8.2,48.9528,-125.5423
2021-01-26,26.2,7.5,48.9528,-125.5423
2021-01-27,27.2,8.1,48.9528,-125.5423
2021-01-28,27.2,8.2,48.9528,-125.5423
2021-01-29,26.6,7.4,48.9528,-125.5423
2021-01-30,27.9,8.4,48.9528,-125.5423
2021-01-31,28.2,8.3,48.9528,-125.5423
2021-02-01,27.6,8.3,48.9528,-125.5423
2021-02-02,27.2,8.5,48.9528,-125.5423
2021-02-03,26.2,8.4,48.9528,-125.5423
2021-02-04,28,8.2,48.9528,-125.5423
2021-02-05,28,8.6,48.9528,-125.5423
2021-02-06,27.8,8.6,48.9528,-125.5423
2021-02-07,28.5,8.3,48.9528,-125.5423
2021-02-08,28.6,7.8,48.9528,-125.5423
2021-02-09,28.4,7.7,48.9528,-125.5423
2021-02-10,28.6,7.5,48.9528,-125.5423
2021-02-11,28,6.7,48.9528,-125.5423
2021-02-12,26.8,6.5,48.9528,-125.5423
2021-02-14,27.6,6.9,48.9528,-125.5423
2021-02-15,27.8,7.4,48.9528,-125.5423
2021-02-16,29.2,8.2,48.9528,-125.5423
2021-02-17,28.1,7.7,48.9528,-125.5423
2021-02-18,28.7,7.7,48.9528,-125.5423
2021-02-19,28.8,8.1,48.9528,-125.5423
2021-02-20,29.3,7.6,48.9528,-125.5423
2021-02-21,27.5,8.2,48.9528,-125.5423
2021-02-22,29.2,8.5,48.9528,-125.5423
2021-02-23,28.7,8.7,48.9528,-125.5423
2021-02-24,29.2,7.8,48.9528,-125.5423
2021-02-25,28.3,8.2,48.9528,-125.5423
2021-02-26,28.8,9,48.9528,-125.5423
2021-02-27,29.6,8.3,48.9528,-125.5423
2021-02-28,28.3,8.2,48.9528,-125.5423
2021-03-01,28.8,8.3,48.9528,-125.5423
2021-03-02,28.8,8.3,48.9528,-125.5423
2021-03-03,27.7,8.2,48.9528,-125.5423
2021-03-04,29,8.2,48.9528,-125.5423
2021-03-05,29,8.3,48.9528,-125.5423
2021-03-06,28.7,8.2,48.9528,-125.5423
2021-03-07,28.8,7.9,48.9528,-125.5423
2021-03-08,28.1,7.8,48.9528,-125.5423
2021-03-09,27.4,7.9,48.9528,-125.5423
2021-03-10,27.3,8.2,48.9528,-125.5423
2021-03-11,26.5,7.8,48.9528,-125.5423
2021-03-12,26,7.9,48.9528,-125.5423
2021-03-13,26.3,8.1,48.9528,-125.5423
2021-03-14,28.6,8.4,48.9528,-125.5423
2021-03-15,27.4,8.5,48.9528,-125.5423
2021-03-16,26.7,8.5,48.9528,-125.5423
2021-03-17,26.2,8.7,48.9528,-125.5423
2021-03-18,28.2,8.6,48.9528,-125.5423
2021-03-19,28.2,8.4,48.9528,-125.5423
2021-03-20,28.1,8.6,48.9528,-125.5423
2021-03-21,26.3,8.4,48.9528,-125.5423
2021-03-22,27.9,8.7,48.9528,-125.5423
2021-03-23,27.7,8,48.9528,-125.5423
2021-03-24,26.4,8.5,48.9528,-125.5423
2021-03-25,27.7,8.9,48.9528,-125.5423
2021-03-26,27.4,8.7,48.9528,-125.5423
2021-03-27,28,8.9,48.9528,-125.5423
2021-03-28,27.5,8.7,48.9528,-125.5423
2021-03-29,29,9,48.9528,-125.5423
2021-03-30,28,9.1,48.9528,-125.5423
2021-03-31,28.7,9.2,48.9528,-125.5423
2021-04-01,27.7,9.2,48.9528,-125.5423
2021-04-02,28.8,8.9,48.9528,-125.5423
2021-04-03,29,8.6,48.9528,-125.5423
2021-04-04,28.6,8.7,48.9528,-125.5423
2021-04-05,28.8,9.1,48.9528,-125.5423
2021-04-06,28.8,8.7,48.9528,-125.5423
2021-04-07,28.9,8.7,48.9528,-125.5423
2021-04-08,29,9,48.9528,-125.5423
2021-04-09,29.1,8.2,48.9528,-125.5423
2021-04-10,30.1,8.9,48.9528,-125.5423
2021-04-11,28.7,9.2,48.9528,-125.5423
2021-04-12,29,9.6,48.9528,-125.5423
2021-04-13,29.3,9.6,48.9528,-125.5423
2021-04-14,28.5,10.1,48.9528,-125.5423
2021-04-15,28.9,10.2,48.9528,-125.5423
2021-04-16,28.8,10.5,48.9528,-125.5423
2021-04-17,29,10.3,48.9528,-125.5423
2021-04-18,28.9,10.2,48.9528,-125.5423
2021-04-19,29,10.5,48.9528,-125.5423
2021-04-20,29.3,9.8,48.9528,-125.5423
2021-04-21,28.8,10.4,48.9528,-125.5423
2021-04-22,28.9,10.4,48.9528,-125.5423
2021-04-23,28.3,11.7,48.9528,-125.5423
2021-04-24,28.9,10.9,48.9528,-125.5423
2021-04-25,29.2,10.7,48.9528,-125.5423
2021-04-26,27.8,11.4,48.9528,-125.5423
2021-04-27,29.1,11,48.9528,-125.5423
2021-04-28,29,11.1,48.9528,-125.5423
2021-04-29,29.5,11.2,48.9528,-125.5423
2021-04-30,27.7,10.1,48.9528,-125.5423
2021-05-01,29.5,10,48.9528,-125.5423
2021-05-03,29,11.2,48.9528,-125.5423
2021-05-04,29.6,10.3,48.9528,-125.5423
2021-05-05,29.5,10.2,48.9528,-125.5423
2021-05-06,28.9,11,48.9528,-125.5423
2021-05-07,29.6,10.7,48.9528,-125.5423
2021-05-08,28.6,10.4,48.9528,-125.5423
2021-05-09,29.1,11.2,48.9528,-125.5423
2021-05-10,28.8,11.3,48.9528,-125.5423
2021-05-11,29,11.1,48.9528,-125.5423
2021-05-12,28.9,10.5,48.9528,-125.5423
2021-05-13,29.8,10.5,48.9528,-125.5423
2021-05-14,29.5,9.9,48.9528,-125.5423
2021-05-15,29.4,10.8,48.9528,-125.5423
2021-05-16,28.7,10.6,48.9528,-125.5423
2021-05-17,29.4,10.3,48.9528,-125.5423
2021-05-18,29.5,9.8,48.9528,-125.5423
2021-05-19,29.9,9.6,48.9528,-125.5423
2021-05-20,29.3,9.5,48.9528,-125.5423
2021-05-21,28,10.4,48.9528,-125.5423
2021-05-22,29.8,10.7,48.9528,-125.5423
2021-05-23,29.2,11.3,48.9528,-125.5423
2021-05-24,29.3,10.9,48.9528,-125.5423
2021-05-25,29.4,10.9,48.9528,-125.5423
2021-05-26,29.3,10.9,48.9528,-125.5423
2021-05-27,28.5,10.8,48.9528,-125.5423
2021-05-28,29.8,10.8,48.9528,-125.5423
2021-05-29,29.6,11.2,48.9528,-125.5423
2021-05-30,29,11.6,48.9528,-125.5423
2021-05-31,29.3,11.5,48.9528,-125.5423
2021-06-01,29.3,11,48.9528,-125.5423
2021-06-02,29.7,11.1,48.9528,-125.5423
2021-06-03,30,10.5,48.9528,-125.5423
2021-06-04,29.9,10.1,48.9528,-125.5423
2021-06-05,30.1,10.3,48.9528,-125.5423
2021-06-06,29.6,9.8,48.9528,-125.5423
2021-06-07,29.4,10.8,48.9528,-125.5423
2021-06-08,28.3,12.1,48.9528,-125.5423
2021-06-09,29.1,11.9,48.9528,-125.5423
2021-06-10,29,12.1,48.9528,-125.5423
2021-06-11,29.3,10.9,48.9528,-125.5423
2021-06-12,29.5,11.7,48.9528,-125.5423
2021-06-13,29.6,11.5,48.9528,-125.5423
2021-06-14,27.9,13.3,48.9528,-125.5423
2021-06-15,28.7,13,48.9528,-125.5423
2021-06-16,28.1,13.8,48.9528,-125.5423
2021-06-17,29.1,11.9,48.9528,-125.5423
2021-06-18,29.3,11.2,48.9528,-125.5423
2021-06-19,29,12.5,48.9528,-125.5423
2021-06-20,29.6,11.9,48.9528,-125.5423
2021-06-21,29,12.8,48.9528,-125.5423
2021-06-22,29.3,12.8,48.9528,-125.5423
2021-06-23,28.5,13.5,48.9528,-125.5423
2021-06-24,29.1,13,48.9528,-125.5423
2021-06-25,29.4,12.8,48.9528,-125.5423
2021-06-26,29.7,13.2,48.9528,-125.5423
2021-06-27,29.4,13.8,48.9528,-125.5423
2021-06-28,29.1,13.7,48.9528,-125.5423
2021-06-29,28.8,14.9,48.9528,-125.5423
2021-06-30,28.9,14.8,48.9528,-125.5423
2021-07-01,29.5,14.8,48.9528,-125.5423
2021-07-02,29.2,14.1,48.9528,-125.5423
2021-07-03,29.5,14.4,48.9528,-125.5423
2021-07-04,29.3,15.6,48.9528,-125.5423
2021-07-05,29.3,15.1,48.9528,-125.5423
2021-07-06,29.4,14.3,48.9528,-125.5423
2021-07-07,29.4,14.3,48.9528,-125.5423
2021-07-08,29.6,13.8,48.9528,-125.5423
2021-07-09,30,12,48.9528,-125.5423
2021-07-10,29.9,12.1,48.9528,-125.5423
2021-07-11,29.9,12.6,48.9528,-125.5423
2021-07-12,28.5,13.9,48.9528,-125.5423
2021-07-13,28.9,13.9,48.9528,-125.5423
2021-07-14,29.4,13.3,48.9528,-125.5423
2021-07-15,30,12.1,48.9528,-125.5423
2021-07-17,29.1,14.4,48.9528,-125.5423
2021-07-18,28.8,13.7,48.9528,-125.5423
2021-07-19,29.2,13.7,48.9528,-125.5423
2021-07-20,29.3,12.8,48.9528,-125.5423
2021-07-21,29.7,12.2,48.9528,-125.5423
2021-07-22,30,12.5,48.9528,-125.5423
2021-07-23,29.8,13.3,48.9528,-125.5423
2021-07-24,29.3,12.2,48.9528,-125.5423
2021-07-25,29.6,11.8,48.9528,-125.5423
2021-07-26,30,12.3,48.9528,-125.5423
2021-07-28,30.2,12.2,48.9528,-125.5423
2021-07-29,29.4,12.1,48.9528,-125.5423
2021-07-30,29.4,11.3,48.9528,-125.5423
2021-07-31,29.3,11.1,48.9528,-125.5423
2021-08-01,29.1,10.9,48.9528,-125.5423
2021-08-02,27.1,11,48.9528,-125.5423
2021-08-03,29.8,11.4,48.9528,-125.5423
2021-08-04,29.8,12.6,48.9528,-125.5423
2021-08-05,29.9,11.7,48.9528,-125.5423
2021-08-06,29.8,11.9,48.9528,-125.5423
2021-08-07,29.2,12.6,48.9528,-125.5423
2021-08-08,29.4,13,48.9528,-125.5423
2021-08-09,29.9,12.1,48.9528,-125.5423
2021-08-10,29.5,15.1,48.9528,-125.5423
2021-08-11,29.3,15.7,48.9528,-125.5423
2021-08-12,28.7,14.2,48.9528,-125.5423
2021-08-14,29.3,15,48.9528,-125.5423
2021-08-15,29.5,14.8,48.9528,-125.5423
2021-08-16,29.5,14.4,48.9528,-125.5423
2021-08-17,29.1,14.9,48.9528,-125.5423
2021-08-18,29.3,14.7,48.9528,-125.5423
2021-08-19,29.4,14.7,48.9528,-125.5423
2021-08-20,29.4,14.2,48.9528,-125.5423
2021-08-21,29.6,13.7,48.9528,-125.5423
2021-08-22,30,12.7,48.9528,-125.5423
2021-08-23,29.6,14.1,48.9528,-125.5423
2021-08-24,29.4,13.5,48.9528,-125.5423
2021-08-25,29.7,14.2,48.9528,-125.5423
2021-08-26,28.9,14.1,48.9528,-125.5423
2021-08-27,28.8,13.4,48.9528,-125.5423
2021-08-28,29.2,14.5,48.9528,-125.5423
2021-08-29,29.2,13.3,48.9528,-125.5423
2021-08-30,27.4,12.3,48.9528,-125.5423
2021-08-31,28.6,11.6,48.9528,-125.5423
2021-09-01,29.4,12.6,48.9528,-125.5423
2021-09-02,29.4,13.2,48.9528,-125.5423
2021-09-03,29.9,13.4,48.9528,-125.5423
2021-09-04,24.3,13.6,48.9528,-125.5423
2021-09-05,29.5,12.5,48.9528,-125.5423
2021-09-06,29.4,13.8,48.9528,-125.5423
2021-09-07,29.7,13.1,48.9528,-125.5423
2021-09-08,28.9,14.2,48.9528,-125.5423
2021-09-09,29.2,13.6,48.9528,-125.5423
2021-09-10,29.3,13.6,48.9528,-125.5423
2021-09-11,28.8,13.7,48.9528,-125.5423
2021-09-12,29.1,13.8,48.9528,-125.5423
2021-09-13,29.1,13.6,48.9528,-125.5423
2021-09-14,28.4,13.7,48.9528,-125.5423
2021-09-15,29,12,48.9528,-125.5423
2021-09-16,29.2,13.1,48.9528,-125.5423
2021-09-17,28.2,12.4,48.9528,-125.5423
2021-09-18,29.5,11.9,48.9528,-125.5423
2021-09-19,29.8,11.6,48.9528,-125.5423
2021-09-20,27.9,12.6,48.9528,-125.5423
2021-09-21,28.1,12.7,48.9528,-125.5423
2021-09-22,29.6,12.2,48.9528,-125.5423
2021-09-23,28.6,13,48.9528,-125.5423
2021-09-24,29.2,12.4,48.9528,-125.5423
2021-09-25,29.5,12.4,48.9528,-125.5423
2021-09-26,26.7,13,48.9528,-125.5423
2021-09-27,29.4,11.6,48.9528,-125.5423
2021-09-28,29.6,11.2,48.9528,-125.5423
2021-09-29,28,12.1,48.9528,-125.5423
2021-09-30,28.3,11.3,48.9528,-125.5423
2021-10-01,29,11.6,48.9528,-125.5423
2021-10-02,27.2,11.9,48.9528,-125.5423
2021-10-03,29.6,11.5,48.9528,-125.5423
2021-10-04,28.6,11.5,48.9528,-125.5423
2021-10-05,26.7,11.8,48.9528,-125.5423
2021-10-06,27.5,11.8,48.9528,-125.5423
2021-10-07,26.8,11.9,48.9528,-125.5423
2021-10-08,24.2,11.9,48.9528,-125.5423
2021-10-09,26.3,11.9,48.9528,-125.5423
2021-10-10,29,12,48.9528,-125.5423
2021-10-11,27.7,11.7,48.9528,-125.5423
2021-10-13,28.3,11.2,48.9528,-125.5423
2021-10-14,27.1,11.3,48.9528,-125.5423
2021-10-16,25.2,11.3,48.9528,-125.5423
2021-10-17,27.9,11.5,48.9528,-125.5423
2021-10-18,26,11.1,48.9528,-125.5423
2021-10-19,24.2,10.9,48.9528,-125.5423
2021-10-20,28.1,11.5,48.9528,-125.5423
2021-10-22,27.7,11.9,48.9528,-125.5423
2021-10-23,28,12.1,48.9528,-125.5423
2021-10-24,25.3,11.2,48.9528,-125.5423
2021-10-26,27.7,11.8,48.9528,-125.5423
2021-10-27,28.1,12,48.9528,-125.5423
2021-10-28,26.7,11.5,48.9528,-125.5423
2021-10-29,27.9,11.2,48.9528,-125.5423
2021-10-30,25.8,10.6,48.9528,-125.5423
2021-10-31,25.6,10.5,48.9528,-125.5423
2021-11-01,26.2,10.9,48.9528,-125.5423
2021-11-02,27.8,10.8,48.9528,-125.5423
2021-11-03,27,11.5,48.9528,-125.5423
2021-11-04,26.4,11.6,48.9528,-125.5423
2021-11-05,26.4,11.3,48.9528,-125.5423
2021-11-06,24.3,10.7,48.9528,-125.5423
2021-11-07,25.6,10.4,48.9528,-125.5423
2021-11-08,26.5,10.6,48.9528,-125.5423
2021-11-09,27.4,10.9,48.9528,-125.5423
2021-11-10,28.3,11.2,48.9528,-125.5423
2021-11-11,25.1,10.5,48.9528,-125.5423
2021-11-12,26.7,11.1,48.9528,-125.5423
2021-11-13,26,10.4,48.9528,-125.5423
2021-11-14,27.1,11.3,48.9528,-125.5423
2021-11-15,27.5,11.3,48.9528,-125.5423
2021-11-16,29,11,48.9528,-125.5423
2021-11-17,24.9,9.7,48.9528,-125.5423
2021-11-18,23.8,9.4,48.9528,-125.5423
2021-11-19,24.4,9.7,48.9528,-125.5423
2021-11-20,22.6,8.9,48.9528,-125.5423
2021-11-21,23.9,9.4,48.9528,-125.5423
2021-11-22,27.3,10.5,48.9528,-125.5423
2021-11-23,28.7,11.1,48.9528,-125.5423
2021-11-24,24.6,9.5,48.9528,-125.5423
2021-11-25,26.8,10.7,48.9528,-125.5423
2021-11-26,27.8,10.8,48.9528,-125.5423
2021-11-28,24.7,10.6,48.9528,-125.5423
2021-11-29,26.4,10.6,48.9528,-125.5423
2021-12-01,25.2,10.6,48.9528,-125.5423
2021-12-02,27.4,10.4,48.9528,-125.5423
2021-12-03,24.5,9.4,48.9528,-125.5423
2021-12-06,23.1,8.6,48.9528,-125.5423
2021-12-07,24,9.2,48.9528,-125.5423
2021-12-08,27.4,10,48.9528,-125.5423
2021-12-09,26.8,9.9,48.9528,-125.5423
2021-12-10,26,9.4,48.9528,-125.5423
2021-12-11,28.3,10,48.9528,-125.5423
2021-12-12,29,9.9,48.9528,-125.5423
2021-12-13,27.6,9.3,48.9528,-125.5423
2021-12-14,26.2,8.5,48.9528,-125.5423
2021-12-15,26.6,8.5,48.9528,-125.5423
2021-12-17,26.3,8.4,48.9528,-125.5423
2021-12-18,27.2,9.4,48.9528,-125.5423
2021-12-19,26.7,8.9,48.9528,-125.5423
2021-12-20,26.5,8.3,48.9528,-125.5423
2021-12-21,26.8,8.4,48.9528,-125.5423
2021-12-22,27.7,9.3,48.9528,-125.5423
2021-12-23,27,9,48.9528,-125.5423
2021-12-24,26.6,8.6,48.9528,-125.5423
2021-12-25,27.4,8.5,48.9528,-125.5423
2021-12-26,26.9,6.7,48.9528,-125.5423
2021-12-27,27.4,6.8,48.9528,-125.5423
2021-12-31,27.4,6.5,48.9528,-125.5423
2022-01-03,27.5,7.6,48.9528,-125.5423
2022-01-04,27.4,7.7,48.9528,-125.5423
2022-01-05,26.8,6.9,48.9528,-125.5423
2022-01-06,26.9,7.3,48.9528,-125.5423
2022-01-07,28.4,7.9,48.9528,-125.5423
2022-01-08,26.4,7.5,48.9528,-125.5423
2022-01-09,25.8,7.5,48.9528,-125.5423
2022-01-10,27.2,8,48.9528,-125.5423
2022-01-11,27.5,8.5,48.9528,-125.5423
2022-01-12,27.9,8.5,48.9528,-125.5423
2022-01-13,25.4,8.3,48.9528,-125.5423
2022-01-14,25,8.2,48.9528,-125.5423
2022-01-15,25.9,8.4,48.9528,-125.5423
2022-01-16,25,8.2,48.9528,-125.5423
2022-01-17,24.5,8.4,48.9528,-125.5423
2022-01-19,23.1,8.4,48.9528,-125.5423
2022-01-20,25.7,8.6,48.9528,-125.5423
2022-01-21,24.9,8.3,48.9528,-125.5423
2022-01-22,25.1,8.3,48.9528,-125.5423
2022-01-23,26.1,8.3,48.9528,-125.5423
2022-01-24,25.7,8.2,48.9528,-125.5423
2022-01-25,26.5,8.4,48.9528,-125.5423
2022-01-26,25.5,7.9,48.9528,-125.5423
2022-01-27,26.3,7.8,48.9528,-125.5423
2022-01-28,25.7,7.1,48.9528,-125.5423
2022-01-29,26.6,7.5,48.9528,-125.5423
2022-01-30,23.9,7.7,48.9528,-125.5423
2022-01-31,26.9,7.7,48.9528,-125.5423
2022-02-01,26.3,7.8,48.9528,-125.5423
2022-02-02,26.4,7.6,48.9528,-125.5423
2022-02-03,25.6,7.8,48.9528,-125.5423
2022-02-04,27.1,8,48.9528,-125.5423
2022-02-05,27.1,8.3,48.9528,-125.5423
2022-02-06,26.4,8,48.9528,-125.5423
2022-02-07,27,8.4,48.9528,-125.5423
2022-02-08,27.2,8.3,48.9528,-125.5423
2022-02-09,26.9,8.3,48.9528,-125.5423
2022-02-10,27.5,8.4,48.9528,-125.5423
2022-02-11,27.6,8.2,48.9528,-125.5423
2022-02-12,26.6,8.1,48.9528,-125.5423
2022-02-13,26,7.7,48.9528,-125.5423
2022-02-14,26.8,8.3,48.9528,-125.5423
2022-02-15,27.3,8.2,48.9528,-125.5423
2022-02-16,26.9,8.2,48.9528,-125.5423
2022-02-17,27,8.7,48.9528,-125.5423
2022-02-18,27.7,8.5,48.9528,-125.5423
2022-02-19,28.1,8.5,48.9528,-125.5423
2022-02-20,29,8.9,48.9528,-125.5423
2022-02-21,28.4,8.6,48.9528,-125.5423
2022-02-22,28.3,7.8,48.9528,-125.5423
2022-02-23,28.2,7.9,48.9528,-125.5423
2022-02-24,28.5,7.9,48.9528,-125.5423
2022-02-25,28.6,7.5,48.9528,-125.5423
2022-02-26,28.5,7.5,48.9528,-125.5423
2022-03-01,27.8,8.2,48.9528,-125.5423
2022-03-02,28.2,8.3,48.9528,-125.5423
2022-03-03,28.7,8.5,48.9528,-125.5423
2022-03-04,28.9,8.6,48.9528,-125.5423
2022-03-05,28.3,8.5,48.9528,-125.5423
2022-03-06,28,8.2,48.9528,-125.5423
2022-03-07,27.1,8.6,48.9528,-125.5423
2022-03-08,27.8,9.1,48.9528,-125.5423
2022-03-09,27.6,8.7,48.9528,-125.5423
2022-03-11,26.3,7.9,48.9528,-125.5423
2022-03-12,24.4,7.8,48.9528,-125.5423
2022-03-13,28.4,8.3,48.9528,-125.5423
2022-03-14,27.3,8.2,48.9528,-125.5423
2022-03-15,28.4,8.3,48.9528,-125.5423
2022-03-16,26.7,8.5,48.9528,-125.5423
2022-03-17,25.5,8.2,48.9528,-125.5423
2022-03-18,26.6,8.2,48.9528,-125.5423
2022-03-19,27.2,8.7,48.9528,-125.5423
2022-03-20,25.8,8.1,48.9528,-125.5423
2022-03-21,25.6,8.4,48.9528,-125.5423
2022-03-22,25.1,8.6,48.9528,-125.5423
2022-03-23,26.6,8.9,48.9528,-125.5423
2022-03-24,25.2,8.9,48.9528,-125.5423
2022-03-25,25.9,8.7,48.9528,-125.5423
2022-03-26,25.3,8.4,48.9528,-125.5423
2022-03-27,24.5,8.8,48.9528,-125.5423
2022-03-28,24.9,8.7,48.9528,-125.5423
2022-03-29,24.8,9.4,48.9528,-125.5423
2022-03-30,26.8,8.9,48.9528,-125.5423
2022-03-31,27.5,9.1,48.9528,-125.5423
2022-04-01,27.9,8.6,48.9528,-125.5423
2022-04-02,27.6,8.5,48.9528,-125.5423
2022-04-03,27.8,8.6,48.9528,-125.5423
2022-04-06,27.8,8.7,48.9528,-125.5423
2022-04-07,28.3,8.3,48.9528,-125.5423
2022-04-08,29.9,8.4,48.9528,-125.5423
2022-04-10,27.9,8,48.9528,-125.5423
2022-04-11,28,8.2,48.9528,-125.5423
2022-04-12,29.7,8.1,48.9528,-125.5423
2022-04-13,28.4,8.7,48.9528,-125.5423
2022-04-14,28.2,9.2,48.9528,-125.5423
2022-04-15,27.3,8.8,48.9528,-125.5423
2022-04-16,27.6,9.3,48.9528,-125.5423
2022-04-17,27,9.4,48.9528,-125.5423
2022-04-18,28.1,8.5,48.9528,-125.5423
2022-04-19,27.8,9.4,48.9528,-125.5423
2022-04-20,28.9,9.1,48.9528,-125.5423
2022-04-21,28.6,9,48.9528,-125.5423
2022-04-22,28.7,9.5,48.9528,-125.5423
2022-04-23,28.1,9.6,48.9528,-125.5423
2022-04-24,28.5,9.3,48.9528,-125.5423
2022-04-25,28.2,9.1,48.9528,-125.5423
2022-04-26,28.5,9.7,48.9528,-125.5423
2022-04-27,29,9,48.9528,-125.5423
2022-04-28,28.8,9.9,48.9528,-125.5423
2022-04-29,28.6,9.9,48.9528,-125.5423
2022-04-30,28.8,10.2,48.9528,-125.5423
