alabaster==0.7.12
attrs==21.4.0
Babel==2.9.1
certifi==2022.6.15
charset-normalizer==2.0.12
docutils==0.17.1
idna==3.3
imagesize==1.3.0
importlib-metadata==4.11.4
Jinja2==3.1.2
markdown-it-py==2.1.0
MarkupSafe==2.1.1
mdit-py-plugins==0.3.0
mdurl==0.1.1
myst-parser==0.17.0
packaging==22
pip==22.1.2
Pygments==2.12.0
pyparsing==3.0.9
pytz==2022.1
PyYAML==6.0
requests==2.28.0
setuptools==62.6.0
snowballstemmer==2.2.0
Sphinx==4.4.0
sphinx-rtd-theme==1.0.0
sphinxcontrib-applehelp==1.0.2
sphinxcontrib-devhelp==1.0.2
sphinxcontrib-htmlhelp==2.0.0
sphinxcontrib-jsmath==1.0.1
sphinxcontrib-qthelp==1.0.3
sphinxcontrib-serializinghtml==1.1.5
typing_extensions==4.2.0
urllib3==1.26.9
wheel==0.37.1
zipp==3.8.0
