{
  "project_info": {
    "project_number": "143910273665",
    "firebase_url": "https://ms3-lab-806a9.firebaseio.com",
    "project_id": "ms3-lab-806a9",
    "storage_bucket": "ms3-lab-806a9.appspot.com"
  },
  "client": [
    {
      "client_info": {
        "mobilesdk_app_id": "1:143910273665:android:96c134c509ebc1b9",
        "android_client_info": {
          "package_name": "com.example.bono3"
        }
      },
      "oauth_client": [
        {
          "client_id": "143910273665-aaeq8btsq6sdnmsud055qoc4mm6r5os0.apps.googleusercontent.com",
          "client_type": 1,
          "android_info": {
            "package_name": "com.example.bono3",
            "certificate_hash": "cf7cd7dc7009e3dcd5841c2dc0818de70a08bc48"
          }
        },
        {
          "client_id": "143910273665-plq3vav5dvjf9komcsm5102hgnjf69d3.apps.googleusercontent.com",
          "client_type": 3
        }
      ],
      "api_key": [
        {
          "current_key": "AIzaSyBrBPotqvoXfxdG_8-4hZKvxGHwXqWaeXY"
        }
      ],
      "services": {
        "appinvite_service": {
          "other_platform_oauth_client": [
            {
              "client_id": "143910273665-plq3vav5dvjf9komcsm5102hgnjf69d3.apps.googleusercontent.com",
              "client_type": 3
            }
          ]
        }
      }
    },
    {
      "client_info": {
        "mobilesdk_app_id": "1:143910273665:android:848d89e3afdb9a93",
        "android_client_info": {
          "package_name": "com.example.bono3java"
        }
      },
      "oauth_client": [
        {
          "client_id": "143910273665-ohp7pv21tpersv3355bfco5ocqtdin67.apps.googleusercontent.com",
          "client_type": 1,
          "android_info": {
            "package_name": "com.example.bono3java",
            "certificate_hash": "cf7cd7dc7009e3dcd5841c2dc0818de70a08bc48"
          }
        },
        {
          "client_id": "143910273665-plq3vav5dvjf9komcsm5102hgnjf69d3.apps.googleusercontent.com",
          "client_type": 3
        }
      ],
      "api_key": [
        {
          "current_key": "AIzaSyBrBPotqvoXfxdG_8-4hZKvxGHwXqWaeXY"
        }
      ],
      "services": {
        "appinvite_service": {
          "other_platform_oauth_client": [
            {
              "client_id": "143910273665-plq3vav5dvjf9komcsm5102hgnjf69d3.apps.googleusercontent.com",
              "client_type": 3
            }
          ]
        }
      }
    }
  ],
  "configuration_version": "1"
}