{
  "project_info": {
    "project_number": "521978517960",
    "firebase_url": "https://pruba-f3938.firebaseio.com",
    "project_id": "pruba-f3938",
    "storage_bucket": "pruba-f3938.appspot.com"
  },
  "client": [
    {
      "client_info": {
        "mobilesdk_app_id": "1:521978517960:android:777b049b3dc63410",
        "android_client_info": {
          "package_name": "com.example.bluetooth"
        }
      },
      "oauth_client": [
        {
          "client_id": "521978517960-6e2ti9eu8k57gsbid8g5d62ak6i27o0k.apps.googleusercontent.com",
          "client_type": 3
        }
      ],
      "api_key": [
        {
          "current_key": "AIzaSyBEx7viSUSWjQ6GIfOLGU-kXU_QPPAj12Y"
        }
      ],
      "services": {
        "appinvite_service": {
          "other_platform_oauth_client": [
            {
              "client_id": "521978517960-6e2ti9eu8k57gsbid8g5d62ak6i27o0k.apps.googleusercontent.com",
              "client_type": 3
            }
          ]
        }
      }
    }
  ],
  "configuration_version": "1"
}