<?xml version="1.0" encoding="UTF-8"?>
<urlset
    xmlns="http://www.sitemaps.org/schemas/sitemap/0.9"
    xmlns:xhtml="http://www.w3.org/1999/xhtml"
    xmlns:xsi="http://www.w3.org/2001/XMLSchema-instance"
    xsi:schemaLocation="http://www.sitemaps.org/schemas/sitemap/0.9
                        http://www.sitemaps.org/schemas/sitemap/0.9/sitemap.xsd">
 <url>
  <loc>https://depositos_diarios.gitlab.io/depositos_diarios/WEB/</loc>
  <lastmod>2018-07-27T01:47:00Z</lastmod>
 </url>
 <url>
  <loc>https://depositos_diarios.gitlab.io/depositos_diarios/WEB/2018/</loc>
  <lastmod>2018-07-27T01:47:00Z</lastmod>
 </url>
 <url>
  <loc>https://depositos_diarios.gitlab.io/depositos_diarios/WEB/archive.html</loc>
  <lastmod>2018-07-27T01:47:00Z</lastmod>
 </url>
 <url>
  <loc>https://depositos_diarios.gitlab.io/depositos_diarios/WEB/blog/depositos-totales-diarios/</loc>
  <lastmod>2018-07-27T01:47:00Z</lastmod>
 </url>
 <url>
  <loc>https://depositos_diarios.gitlab.io/depositos_diarios/WEB/categories/</loc>
  <lastmod>2018-07-26T22:37:00Z</lastmod>
 </url>
 <url>
  <loc>https://depositos_diarios.gitlab.io/depositos_diarios/WEB/galleries/</loc>
  <lastmod>2018-07-26T22:37:00Z</lastmod>
 </url>
 <url>
  <loc>https://depositos_diarios.gitlab.io/depositos_diarios/WEB/listings/</loc>
  <lastmod>2018-07-26T22:37:00Z</lastmod>
 </url>
 <url>
  <loc>https://depositos_diarios.gitlab.io/depositos_diarios/WEB/post/</loc>
  <lastmod>2018-07-26T22:57:00Z</lastmod>
 </url>
</urlset>