{
    "type": "object",
    "properties": {
        "jsonapi": {
            "type": "object",
            "properties": {
                "version": {
                    "type": "string"
                }
            },
            "required": [
                "version"
            ]
        },
        "data": {
            "type": "object",
            "properties": {
                "id": {
                    "type": ["integer", "string"]
                },
                "type": {
                    "type": "string"
                },
                "attributes": {
                    "type": "object"
                },
                "links": {
                    "type": "object",
                    "properties": {
                        "self": {
                            "type": "string"
                        }
                    }
                },
                "relationships": {
                    "type": "array",
                    "items": {
                        "type": "object",
                        "properties": {
                            "data": {
                                "properties": {
                                    "id": {
                                        "type": ["integer", "string"]
                                    },
                                    "type": {
                                        "type": "string"
                                    }
                                }
                            }
                        }
                    }
                },
                "meta": {
                    "type": "object",
                    "properties": {
                        "name": {
                            "type": "string"
                        }
                    }
                }
            },
            "required": [
                "type",
                "id",
                "attributes",
                "links"
            ]
        },
        "included": {
            "type": "array",
            "items": {
                "type": "object",
                "properties": {
                    "id": {
                        "type": ["integer", "string"]
                    },
                    "type": {
                        "type": "string"
                    },
                    "attributes": {
                        "type": "object"
                    }
                }

            }
        }
    },
    "required": [
        "jsonapi",
        "data"
    ]
}
