{
    "type": "object",
    "properties": {
        "application": {
            "type": "string"
        },
        "interface": {
            "type": "string"
        },
        "registration": {
            "type": "string"
        },
        "content-types": {
            "type": "array",
            "items": {
                "type": "string"
            }
        }
    },
    "required": [
        "application",
        "interface",
        "registration",
        "content-types"
    ]
}
