<?xml version="1.0" encoding="UTF-8"?>
<svg width="1945px" height="985px" viewBox="0 0 1945 985" version="1.1" xmlns="http://www.w3.org/2000/svg" xmlns:xlink="http://www.w3.org/1999/xlink">
    <title>DexesWaveOnderSegment Copy</title>
    <defs>
        <rect id="path-1" x="0" y="0" width="1945" height="985"></rect>
        <rect id="path-3" x="-6.82121026e-13" y="0" width="2840" height="996"></rect>
    </defs>
    <g id="Light-Header-schetsen" stroke="none" stroke-width="1" fill="none" fill-rule="evenodd">
        <g id="05-Home-Dataspace" transform="translate(0.000000, -770.000000)">
            <g id="Group" transform="translate(0.000000, 770.000000)">
                <g id="Footer" transform="translate(0.000000, 797.000000)">
                    <g id="DexesWaveOnderSegment-Copy" transform="translate(0.000000, -797.000000)">
                        <mask id="mask-2" fill="white">
                            <use xlink:href="#path-1"></use>
                        </mask>
                        <g id="Segmentmasker1945"></g>
                        <g id="DexesWaveOnder" mask="url(#mask-2)">
                            <g transform="translate(639.000000, 527.000000) rotate(-360.000000) translate(-639.000000, -527.000000) translate(-781.000000, 29.000000)">
                                <mask id="mask-4" fill="white">
                                    <use xlink:href="#path-3"></use>
                                </mask>
                                <g id="Rectangle" stroke="none" fill="none"></g>
                                <path d="M1245,338.25 C1299.22768,338.25 1342.09062,368.887784 1378.38137,417.136417 C1424.57897,478.556242 1460.12729,568.510035 1494.85979,660.264625 L1497.09957,666.186508 C1498.96526,671.12305 1500.82921,676.063136 1502.69295,681.00261 C1538.90577,776.977982 1575.03586,872.722996 1622.26823,937.799816 C1656.91428,985.535181 1697.53472,1016.77059 1748.52459,1019.55847 L1748.52459,1019.55847 L1755.75871,1019.75495 L1755.75871,1707.75 L-290.75,1707.75 L-290.75,1019.76143 C-236.671265,1019.66782 -193.977053,989.200037 -157.874284,941.160942 C-112.979212,881.422625 -78.2780023,794.507927 -44.5045284,705.165154 L-42.278952,699.271165 C-41.9082139,698.288335 -41.5375632,697.305277 -41.1669876,696.322025 L-38.9443377,690.420437 C-38.2036893,688.452637 -37.4632432,686.484322 -36.7229009,684.515753 L-34.5020872,678.609549 C-33.3933824,675.660705 -32.28469,672.711882 -31.1756785,669.763963 L-28.9571321,663.869596 C6.17969667,570.569512 41.8578998,478.767956 88.5971777,416.532971 C124.570985,368.632586 167.097881,338.25 221,338.25 C274.902119,338.25 317.429015,368.632586 353.402822,416.532971 C400.1421,478.767956 435.820303,570.569512 470.957132,663.869596 L473.175679,669.763963 C474.28469,672.711882 475.393382,675.660705 476.502087,678.609549 L476.502087,678.609549 L478.722901,684.515753 C479.463243,686.484322 480.203689,688.452637 480.944338,690.420437 L483.166988,696.322025 C483.537563,697.305277 483.908214,698.288335 484.278952,699.271165 L486.504528,705.165154 C520.278002,794.507927 554.979212,881.422625 599.874284,941.160942 C636.032668,989.274039 678.802819,1019.76165 733,1019.76165 C782.851224,1019.76165 823.016357,993.968116 857.253348,952.389988 C881.682253,922.723008 903.093158,885.018939 922.855925,842.9297 C943.29245,799.405545 961.967408,751.191368 980.399219,702.330217 L982.609966,696.464032 C983.346557,694.507774 984.082857,692.55074 984.818962,690.593188 L987.02679,684.719239 L987.02679,684.719239 L989.234033,678.843736 L989.234033,678.843736 L991.440778,672.969556 C1012.03886,618.148694 1032.7129,563.530555 1055.59667,514.794461 C1075.34007,472.746459 1096.72752,435.077583 1121.13263,405.439495 C1155.26327,363.990526 1195.29567,338.25 1245,338.25 Z M3293,338.25 C3347.2278,338.25 3390.13539,368.887857 3426.4964,417.136602 C3471.29023,476.575168 3506.14962,562.736503 3539.95153,651.391952 L3542.20352,657.305744 C3542.57862,658.291904 3542.95362,659.278304 3543.32852,660.264913 L3545.57691,666.186799 C3545.95148,667.174108 3546.32599,668.161559 3546.70044,669.149118 L3548.94654,675.075508 C3549.69507,677.051229 3550.44347,679.027117 3551.19184,681.002908 C3552.28241,683.882167 3553.37291,686.76122 3554.46363,689.639244 L3556.64547,695.393675 C3591.19883,786.476066 3626.17993,875.977055 3671.14059,937.800009 C3705.85598,985.535254 3746.52177,1016.7706 3797.51558,1019.55847 L3797.51558,1019.55847 L3804.75,1019.75495 L3804.75,1707.74981 L1756.26129,1706.22133 C1756.90063,1264.41992 1757.2299,1035.79102 1757.24911,1020.3346 C1811.3255,1019.77664 1854.01808,989.28926 1890.11964,941.2366 C1939.4536,875.571073 1976.47826,777.098586 2013.48819,678.652594 C2013.85778,677.6695 2014.22736,676.68641 2014.59696,675.703354 L2016.81475,669.805708 C2052.67441,574.475762 2088.86662,480.094795 2136.59114,416.542309 C2172.56623,368.635986 2215.09487,338.25 2269,338.25 C2322.90212,338.25 2365.42902,368.632586 2401.40282,416.532971 C2448.1421,478.767956 2483.8203,570.569512 2518.95713,663.869596 L2521.17568,669.763963 C2522.28469,672.711882 2523.39338,675.660705 2524.50209,678.609549 L2524.50209,678.609549 L2526.7229,684.515753 C2527.46324,686.484322 2528.20369,688.452637 2528.94434,690.420437 L2531.16699,696.322025 C2531.53756,697.305277 2531.90821,698.288335 2532.27895,699.271165 L2534.50453,705.165154 C2568.278,794.507927 2602.97921,881.422625 2647.87428,941.160942 C2684.03267,989.274039 2726.80282,1019.76165 2781,1019.76165 C2830.85122,1019.76165 2871.01636,993.968116 2905.25335,952.389988 C2929.68225,922.723008 2951.09316,885.018939 2970.85593,842.9297 C2991.29245,799.405545 3009.96741,751.191368 3028.39922,702.330217 L3030.60997,696.464032 C3031.34656,694.507774 3032.08286,692.55074 3032.81896,690.593188 L3035.02679,684.719239 L3035.02679,684.719239 L3037.23403,678.843736 L3037.23403,678.843736 L3039.44078,672.969556 C3060.03886,618.148694 3080.7129,563.530555 3103.59667,514.794461 C3123.34007,472.746459 3144.72752,435.077583 3169.13263,405.439495 C3203.26327,363.990526 3243.29567,338.25 3293,338.25 Z" id="rood" stroke="#4081C3" stroke-width="0.5" fill="none" mask="url(#mask-4)"></path>
                                <path d="M3293,91.25 C3347.26152,91.25 3390.19293,112.650916 3426.56209,146.368051 C3473.34114,189.735989 3509.26816,253.469615 3544.47139,318.281771 L3546.71752,322.419996 C3547.46596,323.799769 3548.21418,325.179844 3548.96226,326.560036 L3551.20622,330.700777 C3614.19876,446.950066 3676.95628,562.65238 3797.51408,567.255233 L3797.51408,567.255233 L3804.75,567.392473 L3804.75,1003.75 L-290.75,1003.75 L-290.75,567.397019 C-236.652545,567.331625 -193.962852,546.040257 -157.868107,512.48457 C-111.980654,469.825035 -76.7564956,407.333617 -42.2899872,343.465665 L-40.0672942,339.343426 C-38.2157618,335.906941 -36.3658036,332.467624 -34.5158803,329.028344 L-34.5158803,329.028344 L-32.2997434,324.90857 C-31.5609712,323.53544 -30.8221062,322.162499 -30.0830502,320.789929 L-27.8652108,316.673519 C6.89299728,252.206301 42.2903023,188.964534 88.5318592,145.946254 C124.513721,112.472516 167.064332,91.25 221,91.25 C274.935668,91.25 317.486279,112.472516 353.468141,145.946254 C399.709698,188.964534 435.107003,252.206301 469.865211,316.673519 L472.08305,320.789929 C472.822106,322.162499 473.560971,323.53544 474.299743,324.90857 L476.51588,329.028344 C478.365804,332.467624 480.215762,335.906941 482.067294,339.343426 L484.289987,343.465665 C518.756496,407.333617 553.980654,469.825035 599.868107,512.48457 C636.018436,546.091931 678.784039,567.39717 733,567.39717 C818.459736,567.39717 875.419203,514.458532 922.864692,443.841029 C945.598512,410.004184 966.148285,372.110573 986.608588,334.051174 L989.220216,329.191927 C990.090381,327.57268 990.960545,325.953433 991.83087,324.334485 L994.442489,319.478839 C1014.03567,283.072727 1033.79199,246.969933 1055.55033,214.584984 C1102.89211,144.121844 1159.71042,91.25 1245,91.25 C1299.26152,91.25 1342.19293,112.650916 1378.56209,146.368051 C1425.34114,189.735989 1461.26816,253.469615 1496.47139,318.281771 L1498.71752,322.419996 C1499.46596,323.799769 1500.21418,325.179844 1500.96226,326.560036 L1503.20622,330.700777 C1540.2908,399.138344 1577.28942,467.406229 1626.05978,512.905313 C1661.82329,546.269991 1703.9143,567.39717 1757,567.39717 C1811.21596,567.39717 1853.98156,546.091931 1890.13189,512.48457 C1936.01935,469.825035 1971.2435,407.333617 2005.71001,343.465665 L2007.93271,339.343426 C2009.78424,335.906941 2011.6342,332.467624 2013.48412,329.028344 L2013.48412,329.028344 L2015.70026,324.90857 C2016.43903,323.53544 2017.17789,322.162499 2017.91695,320.789929 L2020.13479,316.673519 C2054.893,252.206301 2090.2903,188.964534 2136.53186,145.946254 C2172.51372,112.472516 2215.06433,91.25 2269,91.25 C2322.93567,91.25 2365.48628,112.472516 2401.46814,145.946254 C2447.7097,188.964534 2483.107,252.206301 2517.86521,316.673519 L2520.08305,320.789929 C2520.82211,322.162499 2521.56097,323.53544 2522.29974,324.90857 L2524.51588,329.028344 C2526.3658,332.467624 2528.21576,335.906941 2530.06729,339.343426 L2532.28999,343.465665 C2566.7565,407.333617 2601.98065,469.825035 2647.86811,512.48457 C2684.01844,546.091931 2726.78404,567.39717 2781,567.39717 C2866.45974,567.39717 2923.4192,514.458532 2970.86469,443.841029 C2993.59851,410.004184 3014.14829,372.110573 3034.60859,334.051174 L3037.22022,329.191927 C3038.09038,327.57268 3038.96055,325.953433 3039.83087,324.334485 L3042.44249,319.478839 C3062.03567,283.072727 3081.79199,246.969933 3103.55033,214.584984 C3150.89211,144.121844 3207.71042,91.25 3293,91.25 Z" id="blauw" stroke="#4081C3" stroke-width="0.5" fill="none" mask="url(#mask-4)"></path>
                                <path d="M3221,638.25 C3275.2278,638.25 3318.13539,668.887857 3354.4964,717.136602 C3399.29023,776.575168 3434.14962,862.736503 3467.95153,951.391952 L3470.20352,957.305744 C3470.57862,958.291904 3470.95362,959.278304 3471.32852,960.264913 L3473.57691,966.186799 C3473.95148,967.174108 3474.32599,968.161559 3474.70044,969.149118 L3476.94654,975.075508 C3477.69507,977.051229 3478.44347,979.027117 3479.19184,981.002908 C3480.28241,983.882167 3481.37291,986.76122 3482.46363,989.639244 L3484.64547,995.393675 C3519.19883,1086.47607 3554.17993,1175.97706 3599.14059,1237.80001 C3633.85598,1285.53525 3674.52177,1316.7706 3725.51558,1319.55847 L3725.51558,1319.55847 L3732.75,1319.75495 L3732.75,2007.75 L-362.75,2007.75 L-362.75,1319.76143 C-308.671265,1319.66782 -265.977053,1289.20004 -229.874284,1241.16094 C-184.979212,1181.42263 -150.278002,1094.50793 -116.504528,1005.16515 L-114.278952,999.271165 C-113.908214,998.288335 -113.537563,997.305277 -113.166988,996.322025 L-110.944338,990.420437 C-110.203689,988.452637 -109.463243,986.484322 -108.722901,984.515753 L-106.502087,978.609549 C-105.393382,975.660705 -104.28469,972.711882 -103.175679,969.763963 L-100.957132,963.869596 C-65.8203033,870.569512 -30.1421002,778.767956 16.5971777,716.532971 C52.570985,668.632586 95.0978808,638.25 149,638.25 C202.902119,638.25 245.429015,668.632586 281.402822,716.532971 C328.1421,778.767956 363.820303,870.569512 398.957132,963.869596 L401.175679,969.763963 C402.28469,972.711882 403.393382,975.660705 404.502087,978.609549 L404.502087,978.609549 L406.722901,984.515753 C407.463243,986.484322 408.203689,988.452637 408.944338,990.420437 L411.166988,996.322025 C411.537563,997.305277 411.908214,998.288335 412.278952,999.271165 L414.504528,1005.16515 C448.278002,1094.50793 482.979212,1181.42263 527.874284,1241.16094 C564.032668,1289.27404 606.802819,1319.76165 661,1319.76165 C710.851224,1319.76165 751.016357,1293.96812 785.253348,1252.38999 C809.682253,1222.72301 831.093158,1185.01894 850.855925,1142.9297 C871.29245,1099.40554 889.967408,1051.19137 908.399219,1002.33022 L910.609966,996.464032 C911.346557,994.507774 912.082857,992.55074 912.818962,990.593188 L915.02679,984.719239 L915.02679,984.719239 L917.234033,978.843736 L917.234033,978.843736 L919.440778,972.969556 C940.038864,918.148694 960.712905,863.530555 983.596666,814.794461 C1003.34007,772.746459 1024.72752,735.077583 1049.13263,705.439495 C1083.26327,663.990526 1123.29567,638.25 1173,638.25 C1227.2278,638.25 1270.13539,668.887857 1306.4964,717.136602 C1351.29023,776.575168 1386.14962,862.736503 1419.95153,951.391952 L1422.20352,957.305744 C1422.57862,958.291904 1422.95362,959.278304 1423.32852,960.264913 L1425.57691,966.186799 C1425.95148,967.174108 1426.32599,968.161559 1426.70044,969.149118 L1428.94654,975.075508 C1429.69507,977.051229 1430.44347,979.027117 1431.19184,981.002908 C1468.28942,1078.94558 1505.30071,1176.64816 1554.06518,1241.76324 C1589.83684,1289.52906 1631.93272,1319.76165 1685,1319.76165 C1739.19718,1319.76165 1781.96733,1289.27404 1818.12572,1241.16094 C1863.02079,1181.42263 1897.722,1094.50793 1931.49547,1005.16515 L1933.72105,999.271165 C1934.09179,998.288335 1934.46244,997.305277 1934.83301,996.322025 L1937.05566,990.420437 C1937.79631,988.452637 1938.53676,986.484322 1939.2771,984.515753 L1941.49791,978.609549 C1942.60662,975.660705 1943.71531,972.711882 1944.82432,969.763963 L1947.04287,963.869596 C1982.1797,870.569512 2017.8579,778.767956 2064.59718,716.532971 C2100.57098,668.632586 2143.09788,638.25 2197,638.25 C2250.90212,638.25 2293.42902,668.632586 2329.40282,716.532971 C2376.1421,778.767956 2411.8203,870.569512 2446.95713,963.869596 L2449.17568,969.763963 C2450.28469,972.711882 2451.39338,975.660705 2452.50209,978.609549 L2452.50209,978.609549 L2454.7229,984.515753 C2455.46324,986.484322 2456.20369,988.452637 2456.94434,990.420437 L2459.16699,996.322025 C2459.53756,997.305277 2459.90821,998.288335 2460.27895,999.271165 L2462.50453,1005.16515 C2496.278,1094.50793 2530.97921,1181.42263 2575.87428,1241.16094 C2612.03267,1289.27404 2654.80282,1319.76165 2709,1319.76165 C2758.85122,1319.76165 2799.01636,1293.96812 2833.25335,1252.38999 C2857.68225,1222.72301 2879.09316,1185.01894 2898.85593,1142.9297 C2919.29245,1099.40554 2937.96741,1051.19137 2956.39922,1002.33022 L2958.60997,996.464032 C2959.34656,994.507774 2960.08286,992.55074 2960.81896,990.593188 L2963.02679,984.719239 L2963.02679,984.719239 L2965.23403,978.843736 L2965.23403,978.843736 L2967.44078,972.969556 C2988.03886,918.148694 3008.7129,863.530555 3031.59667,814.794461 C3051.34007,772.746459 3072.72752,735.077583 3097.13263,705.439495 C3131.26327,663.990526 3171.29567,638.25 3221,638.25 Z" id="rood" stroke="#4081C3" stroke-width="0.5" fill="none" mask="url(#mask-4)"></path>
                                <path d="M3198,505.25 C3326.45439,505.25 3391.47824,581.215602 3456.23574,656.836439 C3519.25206,730.423994 3582.01718,803.684357 3702.51937,806.59834 L3702.51937,806.59834 L3709.75,806.685201 L3709.75,1082.75 L-385.75,1082.75 L-385.75,806.688091 C-260.387907,806.592016 -196.288262,734.23152 -133.477808,660.402005 L-133.477808,660.402005 L-125.789793,651.360111 C-63.0370915,577.593084 0.876568867,505.25 126,505.25 C251.123431,505.25 315.037092,577.593084 377.789753,651.360065 L377.789753,651.360065 L385.477853,660.402058 C448.330001,734.280581 512.473099,806.688187 638,806.688187 C766.086926,806.688187 830.142916,731.296564 894.190554,655.880924 C894.830078,655.127889 895.469601,654.374852 896.109187,653.621888 L899.947972,649.105583 C962.037128,576.125618 1025.92432,505.25 1150,505.25 C1278.45439,505.25 1343.47824,581.215602 1408.23574,656.836439 C1472.54394,731.932594 1536.59016,806.688187 1662,806.688187 C1787.5269,806.688187 1851.67,734.280581 1914.52219,660.402005 L1914.52219,660.402005 L1922.21021,651.360111 C1984.96291,577.593084 2048.87657,505.25 2174,505.25 C2299.12343,505.25 2363.03709,577.593084 2425.78975,651.360065 L2425.78975,651.360065 L2433.47785,660.402058 C2496.33,734.280581 2560.4731,806.688187 2686,806.688187 C2814.08693,806.688187 2878.14292,731.296564 2942.19055,655.880924 C2942.83008,655.127889 2943.4696,654.374852 2944.10919,653.621888 L2947.94797,649.105583 C3010.03713,576.125618 3073.92432,505.25 3198,505.25 Z" id="blauw" stroke="#4081C3" stroke-width="0.5" fill="none" mask="url(#mask-4)"></path>
                                <path d="M3581,358.25 C3709.45289,358.25 3774.46621,452.780469 3839.21969,546.869778 C3902.23957,638.440097 3965.01461,729.592408 4085.51863,733.218333 L4085.51863,733.218333 L4092.75,733.326426 L4092.75,1111.75 L-2.75,1111.75 L-2.75,733.330015 C125.230427,733.207983 189.372505,639.379645 253.470335,545.552161 C317.447862,451.900779 381.381163,358.25 509,358.25 C636.618837,358.25 700.552138,451.900779 764.529665,545.552161 C828.669218,639.44072 892.853077,733.330135 1021,733.330135 C1145.24568,733.330135 1209.25326,645.070454 1271.44007,554.124465 L1275.28487,548.496264 L1275.28487,548.496264 L1277.20649,545.681001 C1341.15487,451.986602 1405.08833,358.25 1533,358.25 C1661.45289,358.25 1726.46621,452.780469 1791.21969,546.869778 C1855.53195,640.317984 1919.58873,733.330135 2045,733.330135 C2173.14692,733.330135 2237.33078,639.44072 2301.47034,545.552161 C2365.44786,451.900779 2429.38116,358.25 2557,358.25 C2684.61884,358.25 2748.55214,451.900779 2812.52966,545.552161 C2876.66922,639.44072 2940.85308,733.330135 3069,733.330135 C3193.24568,733.330135 3257.25326,645.070454 3319.44007,554.124465 L3323.28487,548.496264 L3323.28487,548.496264 L3325.20649,545.681001 C3389.15487,451.986602 3453.08833,358.25 3581,358.25 Z" id="rood" stroke="#4081C3" stroke-width="0.5" fill="none" mask="url(#mask-4)"></path>
                                <path d="M3584,643.25 C3712.45289,643.25 3777.46621,737.780469 3842.21969,831.869778 C3905.23957,923.440097 3968.01461,1014.59241 4088.51863,1018.21833 L4088.51863,1018.21833 L4095.75,1018.32643 L4095.75,1396.75 L0.25,1396.75 L0.25,1018.33002 C128.230427,1018.20798 192.372505,924.379645 256.470335,830.552161 C320.447862,736.900779 384.381163,643.25 512,643.25 C639.618837,643.25 703.552138,736.900779 767.529665,830.552161 C831.669218,924.44072 895.853077,1018.33013 1024,1018.33013 C1148.24568,1018.33013 1212.25326,930.070454 1274.44007,839.124465 L1278.28487,833.496264 L1278.28487,833.496264 L1280.20649,830.681001 C1344.15487,736.986602 1408.08833,643.25 1536,643.25 C1664.45289,643.25 1729.46621,737.780469 1794.21969,831.869778 C1858.53195,925.317984 1922.58873,1018.33013 2048,1018.33013 C2176.14692,1018.33013 2240.33078,924.44072 2304.47034,830.552161 C2368.44786,736.900779 2432.38116,643.25 2560,643.25 C2687.61884,643.25 2751.55214,736.900779 2815.52966,830.552161 C2879.66922,924.44072 2943.85308,1018.33013 3072,1018.33013 C3196.24568,1018.33013 3260.25326,930.070454 3322.44007,839.124465 L3326.28487,833.496264 L3326.28487,833.496264 L3328.20649,830.681001 C3392.15487,736.986602 3456.08833,643.25 3584,643.25 Z" id="blauw" stroke="#4081C3" stroke-width="0.5" fill="none" mask="url(#mask-4)"></path>
                            </g>
                        </g>
                    </g>
                </g>
            </g>
        </g>
    </g>
</svg>