<?xml version="1.0" encoding="UTF-8"?>
<svg width="207px" height="75px" viewBox="0 0 207 75" version="1.1" xmlns="http://www.w3.org/2000/svg" xmlns:xlink="http://www.w3.org/1999/xlink">
    <title>logo-klein-wit</title>
    <g id="Typografie" stroke="none" stroke-width="1" fill="none" fill-rule="evenodd">
        <g id="dexes-logo" transform="translate(-34.000000, -416.000000)" fill="#FFFFFF" fill-rule="nonzero">
            <g id="logo-klein-wit" transform="translate(34.000000, 416.000000)">
                <path d="M25.8995379,42.8545885 L25.8995379,2.46478873 L18.3896347,2.46478873 L18.3896347,13.0075374 L18.4618453,15.4145577 C17.0978672,14.90106 15.5974912,14.6443112 13.9607174,14.6443112 C11.2006675,14.6443112 8.7655654,15.262113 6.65541098,16.4977168 C4.54525657,17.7333205 2.9084828,19.4824219 1.74508968,21.7450209 C0.58169656,24.0076199 0,26.6392954 0,29.6400473 C0,32.496378 0.493439151,34.9194451 1.48031745,36.9092485 C2.46719575,38.8990519 3.78704519,40.3873927 5.43986576,41.374271 C7.09268633,42.3611493 8.92202171,42.8545885 10.9278719,42.8545885 C12.9016285,42.8545885 14.5183438,42.5376641 15.7780177,41.9038155 C17.0376916,41.2699668 18.1088157,40.503732 18.9913897,39.6051111 L18.9913897,39.6051111 L18.9913897,41.4585167 C18.9913897,42.0201548 19.1398227,42.3932429 19.4366885,42.5777811 C19.7335543,42.7623194 20.1868765,42.8545885 20.7966549,42.8545885 L20.7966549,42.8545885 L25.8995379,42.8545885 Z M13.2386114,37.0055293 C11.5055568,37.0055293 10.1776839,36.4117976 9.25499285,35.2243343 C8.33230175,34.036871 7.87095621,32.0310208 7.87095621,29.2067837 C7.87095621,27.2009335 8.13974013,25.5079959 8.67730799,24.127971 C9.21487584,22.747946 9.95704042,21.7129273 10.9038017,21.0229148 C11.850563,20.3329024 12.9417455,19.9878961 14.1773493,19.9878961 C15.1562042,19.9878961 15.9906378,20.0400482 16.6806503,20.1443524 C17.3706628,20.2486567 17.9403242,20.4532534 18.3896347,20.7581426 L18.3896347,20.7581426 L18.3896347,35.5613171 C17.7798562,35.978534 17.0136214,36.3235402 16.0909303,36.5963358 C15.1682393,36.8691315 14.2174663,37.0055293 13.2386114,37.0055293 Z M45.17977,42.8545885 C47.2337606,42.8545885 49.2075172,42.5898162 51.1010398,42.0602718 C52.9945624,41.5307273 54.4147044,40.8808319 55.3614657,40.1105854 L55.3614657,40.1105854 L54.1338853,35.8501596 C53.4438729,36.2352828 52.3567021,36.5682539 50.8723729,36.849073 C49.3880438,37.129892 48.1243581,37.2703015 47.081316,37.2703015 C44.898951,37.2703015 43.1699081,36.7166868 41.8941874,35.6094575 C40.6184667,34.5022282 39.9083957,32.817314 39.7639745,30.554715 L39.7639745,30.554715 L55.9872909,30.554715 C56.1638058,29.4314389 56.2520632,27.7144311 56.2520632,25.4036917 C56.2199696,22.8843438 55.718507,20.8223298 54.7476755,19.2176496 C53.776844,17.6129695 52.4890882,16.4495764 50.884408,15.7274703 C49.2797278,15.0053642 47.4824861,14.6443112 45.4926827,14.6443112 C42.7326328,14.6443112 40.3536944,15.2460662 38.3558676,16.4495764 C36.3580408,17.6530865 34.8376064,19.3139305 33.7945643,21.4321083 C32.7515222,23.5502861 32.2300011,25.9573063 32.2300011,28.653169 C32.2300011,31.6218273 32.727452,34.1692571 33.7223537,36.2954583 C34.7172554,38.4216595 36.1855377,40.0463982 38.1272007,41.1696743 C40.0688637,42.2929504 42.4197201,42.8545885 45.17977,42.8545885 Z M49.2717044,26.39057 L39.8843255,26.39057 C40.1410743,24.0637837 40.7067241,22.4149749 41.5812748,21.4441434 C42.4558254,20.4733119 43.6312537,19.9878961 45.1075594,19.9878961 C46.5838652,19.9878961 47.6509775,20.4412183 48.3088963,21.3478626 C48.9668152,22.2545069 49.2957746,23.5823797 49.2957746,25.3314811 C49.2957746,25.7968383 49.2877512,26.149868 49.2717044,26.39057 L49.2717044,26.39057 Z" id="de"></path>
                <path d="M103.188958,42.8545885 C105.242949,42.8545885 107.216705,42.5898162 109.110228,42.0602718 C111.00375,41.5307273 112.423892,40.8808319 113.370654,40.1105854 L113.370654,40.1105854 L112.143073,35.8501596 C111.453061,36.2352828 110.36589,36.5682539 108.881561,36.849073 C107.397232,37.129892 106.133546,37.2703015 105.090504,37.2703015 C102.908139,37.2703015 101.179096,36.7166868 99.9033753,35.6094575 C98.6276546,34.5022282 97.9175836,32.817314 97.7731624,30.554715 L97.7731624,30.554715 L113.996479,30.554715 C114.172994,29.4314389 114.261251,27.7144311 114.261251,25.4036917 C114.229157,22.8843438 113.727695,20.8223298 112.756863,19.2176496 C111.786032,17.6129695 110.498276,16.4495764 108.893596,15.7274703 C107.288916,15.0053642 105.491674,14.6443112 103.501871,14.6443112 C100.741821,14.6443112 98.3628824,15.2460662 96.3650556,16.4495764 C94.3672288,17.6530865 92.8467943,19.3139305 91.8037522,21.4321083 C90.7607101,23.5502861 90.239189,25.9573063 90.239189,28.653169 C90.239189,31.6218273 90.7366399,34.1692571 91.7315416,36.2954583 C92.7264433,38.4216595 94.1947256,40.0463982 96.1363886,41.1696743 C98.0780516,42.2929504 100.428908,42.8545885 103.188958,42.8545885 Z M107.280892,26.39057 L97.8935134,26.39057 C98.1502623,24.0637837 98.715912,22.4149749 99.5904627,21.4441434 C100.465013,20.4733119 101.640442,19.9878961 103.116747,19.9878961 C104.593053,19.9878961 105.660165,20.4412183 106.318084,21.3478626 C106.976003,22.2545069 107.304963,23.5823797 107.304963,25.3314811 C107.304963,25.7968383 107.296939,26.149868 107.280892,26.39057 L107.280892,26.39057 Z M128.944075,42.8545885 C132.313903,42.8545885 134.94959,42.1445175 136.851136,40.7243756 C138.752682,39.3042336 139.703455,37.2061143 139.703455,34.4300176 C139.703455,33.0660395 139.446706,31.8906112 138.933209,30.9037329 C138.419711,29.9168546 137.605336,29.042304 136.490083,28.2800809 C135.37483,27.5178578 133.878466,26.8158102 132.00099,26.1739382 C130.588872,25.6925341 129.509724,25.2713056 128.763548,24.9102525 C128.017372,24.5491995 127.475792,24.1720997 127.138809,23.778953 C126.801827,23.3858064 126.633335,22.908414 126.633335,22.346776 C126.633335,21.5604827 126.9984,20.9948329 127.728529,20.6498267 C128.458659,20.3048205 129.64211,20.1323173 131.278884,20.1323173 C132.418207,20.1323173 133.593635,20.3168556 134.805169,20.685932 C136.016702,21.0550084 136.895265,21.4882721 137.440856,21.9857229 L137.440856,21.9857229 L138.259243,16.2088743 C137.617371,15.8397979 136.606422,15.4867683 135.226397,15.1497854 C133.846373,14.8128026 132.281809,14.6443112 130.532708,14.6443112 C128.36639,14.6443112 126.448797,14.9492004 124.77993,15.5589789 C123.111062,16.1687573 121.80726,17.0713899 120.868522,18.2668767 C119.929784,19.4623634 119.460415,20.9105872 119.460415,22.6115482 C119.460415,24.6334452 120.001994,26.3344062 121.085153,27.7144311 C122.168313,29.0944561 123.929449,30.1856386 126.368563,30.9879787 C128.422554,31.6619443 129.926941,32.3118398 130.881726,32.9376651 C131.836511,33.5634903 132.313903,34.2615262 132.313903,35.0317727 C132.313903,35.8662064 131.968897,36.459938 131.278884,36.8129676 C130.588872,37.1659973 129.497689,37.3344887 128.005337,37.3184419 C126.930201,37.3184419 125.84303,37.1900675 124.743824,36.9333187 C123.644618,36.6765698 122.677799,36.3756923 121.843365,36.0306861 C121.008931,35.6856798 120.43927,35.3928257 120.134381,35.1521237 L120.134381,35.1521237 L119.364134,40.7364107 C119.877632,41.0733935 120.643866,41.4063646 121.662838,41.7353241 C122.68181,42.0642835 123.833168,42.3330674 125.116912,42.5416758 C126.400657,42.7502843 127.676377,42.8545885 128.944075,42.8545885 Z" id="es"></path>
                <path d="M54.1598277,3.30943116 C55.0463949,3.44981804 56.0007419,3.59219203 57.2135029,3.77809009 L57.9017827,3.88405512 C58.3792488,3.95790897 58.8954686,4.03851671 59.4596087,4.1278756 C60.3081142,4.26221686 61.2620096,4.52720561 61.7119198,5.7536138 C63.4850931,10.5232634 65.5762188,15.5890907 67.9098825,20.8268581 C72.3856953,16.2827374 77.4115405,12.1764307 83.1952777,8.51331832 C83.6381687,8.17583576 84.3859357,8.09045563 85.4385788,8.25717791 C86.4345747,8.41492816 87.4201853,8.57735427 89.7242545,8.94228299 C90.5218199,9.06860494 91.2083379,10.2376391 90.0335709,11.0846776 C83.1459041,16.0009462 76.8382348,21.7666151 71.2650698,28.1259469 C74.6803494,35.3459872 78.4723724,42.7744005 82.4570914,50.1086406 C82.9315921,50.9286786 82.4614471,51.6920313 81.5580379,51.5489453 C79.0079517,51.1450514 76.9359812,50.8250069 75.6467918,50.6208194 C74.7814656,50.4837652 74.1799486,50.0624746 73.8422409,49.3569476 C71.270412,44.0118022 68.8074516,38.9272107 66.4430134,34.0131282 C63.3701274,38.0329371 60.5787433,42.2381931 58.1023783,46.5744148 C57.5084473,47.7479878 56.7240367,47.6237494 55.5863784,47.443562 C53.9174535,47.1792303 51.906176,46.8606752 50.5527394,46.6463119 C50.1364538,46.5803788 49.7188612,46.0072076 50.1373274,45.3128747 C53.9541082,38.4384714 58.0713727,32.1467641 62.8207263,26.4465636 C59.2958888,19.03663 55.9968905,11.9258907 52.8844871,4.77484891 C52.4569078,3.68264447 53.6289099,3.22534204 54.1598277,3.30943116 Z" id="Combined-Shape-Copy-9" transform="translate(70.313199, 27.433004) scale(-1, 1) rotate(-9.000000) translate(-70.313199, -27.433004) "></path>
                <path d="M6.12011719,70.7042254 L6.12011719,66.6436785 L9.49023438,60.2999285 L7.890625,60.2999285 L5.62792969,64.8116472 L5.38183594,65.5294207 L5.08789062,64.8116472 L2.77734375,60.2999285 L1.15039062,60.2999285 L4.57519531,66.6436785 L4.57519531,70.7042254 L6.12011719,70.7042254 Z M13.7148438,70.8136004 C14.4029948,70.8136004 15.0159505,70.6620704 15.5537109,70.3590105 C16.0914714,70.0559506 16.5130208,69.6081967 16.8183594,69.0157488 C17.1236979,68.4233009 17.2763672,67.7100847 17.2763672,66.8761004 C17.2763672,66.1104754 17.1578776,65.4223243 16.9208984,64.8116472 C16.6839193,64.2009701 16.3102214,63.7133399 15.7998047,63.3487566 C15.289388,62.9841733 14.639974,62.8018816 13.8515625,62.8018816 C13.1679688,62.8018816 12.5572917,62.9545509 12.0195312,63.2598894 C11.4817708,63.565228 11.0602214,64.0129819 10.7548828,64.6031511 C10.4495443,65.1933204 10.296875,65.9053972 10.296875,66.7393816 C10.296875,67.5050066 10.4153646,68.1931576 10.6523438,68.8038347 C10.8893229,69.4145118 11.2630208,69.902142 11.7734375,70.2667254 C12.2838542,70.6313087 12.9309896,70.8136004 13.7148438,70.8136004 Z M13.8037109,69.7471941 C13.3662109,69.7471941 12.999349,69.6116147 12.703125,69.3404558 C12.406901,69.069297 12.1858724,68.7001563 12.0400391,68.2330339 C11.8942057,67.7659116 11.8212891,67.2429623 11.8212891,66.6641863 C11.8212891,65.7709571 11.9864909,65.0839454 12.3168945,64.6031511 C12.6472982,64.1223569 13.1292318,63.8819597 13.7626953,63.8819597 C14.2093099,63.8819597 14.5807292,64.0129819 14.8769531,64.2750261 C15.1731771,64.5370704 15.3930664,64.8948178 15.5366211,65.3482683 C15.6801758,65.8017188 15.7519531,66.3201108 15.7519531,66.9034441 C15.7519531,67.8057879 15.585612,68.5053321 15.2529297,69.0020769 C14.9202474,69.4988217 14.4371745,69.7471941 13.8037109,69.7471941 Z M25.2675781,70.8136004 L25.2675781,62.9112566 L23.7636719,62.9112566 L23.7636719,69.0294207 C23.5677083,69.1570248 23.2976888,69.2800717 22.9536133,69.3985613 C22.6095378,69.5170509 22.3007812,69.5762957 22.0273438,69.5762957 C21.6490885,69.5762957 21.3631185,69.5307227 21.1694336,69.4395769 C20.9757487,69.3484311 20.832194,69.1536069 20.7387695,68.8551043 C20.6453451,68.5566017 20.5986328,68.0906186 20.5986328,67.457155 L20.5986328,67.457155 L20.5986328,62.9112566 L19.0947266,62.9112566 L19.0947266,67.463991 C19.0947266,68.2068295 19.1539714,68.8163673 19.2724609,69.2926043 C19.3909505,69.7688412 19.6188151,70.1413998 19.9560547,70.41028 C20.2932943,70.6791602 20.7786458,70.8136004 21.4121094,70.8136004 C21.813151,70.8136004 22.2449544,70.7349871 22.7075195,70.5777605 C23.1700846,70.4205339 23.5791016,70.2348243 23.9345703,70.0206316 L23.9345703,70.0206316 L23.9345703,70.2120379 C23.9345703,70.3852149 23.9630534,70.5150977 24.0200195,70.6016863 C24.0769857,70.6882748 24.1578776,70.745241 24.2626953,70.7725847 C24.367513,70.7999285 24.5087891,70.8136004 24.6865234,70.8136004 L24.6865234,70.8136004 L25.2675781,70.8136004 Z M29.1230469,70.7042254 L29.1230469,64.7569597 C29.3235677,64.5792254 29.5708008,64.4276954 29.8647461,64.3023699 C30.1586914,64.1770444 30.4788411,64.1143816 30.8251953,64.1143816 C31.1077474,64.1143816 31.3253581,64.1314714 31.4780273,64.1656511 C31.6306966,64.1998308 31.7548828,64.2442644 31.8505859,64.2989519 L31.8505859,64.2989519 L31.8505859,62.8907488 C31.7093099,62.8269467 31.4563802,62.7950457 31.0917969,62.7950457 C30.8183594,62.7950457 30.5369466,62.8485938 30.2475586,62.9556902 C29.9581706,63.0627866 29.7006836,63.1938087 29.4750977,63.3487566 C29.2495117,63.5037045 29.0865885,63.6495379 28.9863281,63.7862566 L28.9863281,63.7862566 L28.8837891,62.9249285 L27.6191406,62.9249285 L27.6191406,70.7042254 L29.1230469,70.7042254 Z M39.9033203,70.8136004 C40.2815755,70.8136004 40.6791992,70.7486589 41.0961914,70.6187761 C41.5131836,70.4888933 41.8333333,70.3419207 42.0566406,70.1778582 L42.0566406,70.1778582 L41.796875,69.31653 C41.6647135,69.3848894 41.4584961,69.4509701 41.1782227,69.5147722 C40.8979492,69.5785743 40.6598307,69.6104754 40.4638672,69.6104754 C40.194987,69.6104754 40.0047201,69.5785743 39.8930664,69.5147722 C39.7814128,69.4509701 39.7050781,69.3108334 39.6640625,69.0943621 C39.6230469,68.8778907 39.6025391,68.5098894 39.6025391,67.9903582 L39.6025391,67.9903582 L39.6025391,64.0460222 L41.8037109,64.0460222 L41.8037109,62.9112566 L39.6025391,62.9112566 L39.6025391,61.1339129 L38.7001953,61.1339129 L38.5498047,61.6261004 C38.4176432,62.0772722 38.3173828,62.3894467 38.2490234,62.5626238 C38.2034505,62.6856707 38.1430664,62.7825131 38.0678711,62.8531511 C37.9926758,62.9237892 37.9049479,62.9784767 37.8046875,63.0172136 C37.7044271,63.0559506 37.5494792,63.1049415 37.3398438,63.1641863 L37.3398438,63.1641863 L37.09375,63.2325457 L37.09375,64.0460222 L38.1054688,64.0460222 L38.1054688,68.8380144 C38.1054688,69.5854102 38.2626953,70.1015235 38.5771484,70.3863543 C38.8916016,70.671185 39.3336589,70.8136004 39.9033203,70.8136004 Z M45.0097656,70.7042254 L45.0097656,64.7569597 C45.2102865,64.5792254 45.4575195,64.4276954 45.7514648,64.3023699 C46.0454102,64.1770444 46.3655599,64.1143816 46.7119141,64.1143816 C46.9944661,64.1143816 47.2120768,64.1314714 47.3647461,64.1656511 C47.5174154,64.1998308 47.6416016,64.2442644 47.7373047,64.2989519 L47.7373047,64.2989519 L47.7373047,62.8907488 C47.5960286,62.8269467 47.343099,62.7950457 46.9785156,62.7950457 C46.7050781,62.7950457 46.4236654,62.8485938 46.1342773,62.9556902 C45.8448893,63.0627866 45.5874023,63.1938087 45.3618164,63.3487566 C45.1362305,63.5037045 44.9733073,63.6495379 44.8730469,63.7862566 L44.8730469,63.7862566 L44.7705078,62.9249285 L43.5058594,62.9249285 L43.5058594,70.7042254 L45.0097656,70.7042254 Z M55.2910156,70.8136004 L55.2910156,62.9112566 L53.7871094,62.9112566 L53.7871094,69.0294207 C53.5911458,69.1570248 53.3211263,69.2800717 52.9770508,69.3985613 C52.6329753,69.5170509 52.3242188,69.5762957 52.0507812,69.5762957 C51.672526,69.5762957 51.386556,69.5307227 51.1928711,69.4395769 C50.9991862,69.3484311 50.8556315,69.1536069 50.762207,68.8551043 C50.6687826,68.5566017 50.6220703,68.0906186 50.6220703,67.457155 L50.6220703,67.457155 L50.6220703,62.9112566 L49.1181641,62.9112566 L49.1181641,67.463991 C49.1181641,68.2068295 49.1774089,68.8163673 49.2958984,69.2926043 C49.414388,69.7688412 49.6422526,70.1413998 49.9794922,70.41028 C50.3167318,70.6791602 50.8020833,70.8136004 51.4355469,70.8136004 C51.8365885,70.8136004 52.2683919,70.7349871 52.730957,70.5777605 C53.1935221,70.4205339 53.6025391,70.2348243 53.9580078,70.0206316 L53.9580078,70.0206316 L53.9580078,70.2120379 C53.9580078,70.3852149 53.9864909,70.5150977 54.043457,70.6016863 C54.1004232,70.6882748 54.1813151,70.745241 54.2861328,70.7725847 C54.3909505,70.7999285 54.5322266,70.8136004 54.7099609,70.8136004 L54.7099609,70.8136004 L55.2910156,70.8136004 Z M59.7412109,70.8136004 C60.3063151,70.8136004 60.7950846,70.7292905 61.2075195,70.5606707 C61.6199544,70.3920509 61.9366862,70.1448178 62.1577148,69.8189714 C62.3787435,69.4931251 62.4892578,69.09778 62.4892578,68.6329363 C62.4892578,68.0359311 62.2750651,67.5471616 61.8466797,67.1666277 C61.4182943,66.7860938 60.8714193,66.4613868 60.2060547,66.1925066 C59.8597005,66.0512306 59.5794271,65.9190691 59.3652344,65.7960222 C59.1510417,65.6729754 58.9858398,65.5294207 58.8696289,65.3653582 C58.753418,65.2012957 58.6953125,65.0053321 58.6953125,64.7774675 C58.6953125,64.5085873 58.8217773,64.2966733 59.074707,64.1417254 C59.3276367,63.9867774 59.6933594,63.9093035 60.171875,63.9093035 C60.5182292,63.9093035 60.8531901,63.9537371 61.1767578,64.0426043 C61.5003255,64.1314714 61.7259115,64.2305925 61.8535156,64.3399675 L61.8535156,64.3399675 L62.0996094,63.2052019 C61.9401042,63.1186134 61.6757812,63.0297462 61.3066406,62.9386004 C60.9375,62.8474545 60.5432943,62.8018816 60.1240234,62.8018816 C59.5908203,62.8018816 59.1123047,62.8793556 58.6884766,63.0343035 C58.2646484,63.1892514 57.9285482,63.4205339 57.6801758,63.7281511 C57.4318034,64.0357683 57.3076172,64.4106056 57.3076172,64.8526629 C57.3076172,65.4496681 57.4978841,65.9441342 57.878418,66.3360613 C58.2589518,66.7279884 58.7932943,67.0697852 59.4814453,67.3614519 C60.0100911,67.5847592 60.4099935,67.7989519 60.6811523,68.00403 C60.9523112,68.2091082 61.0878906,68.4552019 61.0878906,68.7423113 C61.0878906,69.0430925 60.9682617,69.2777931 60.7290039,69.4464129 C60.4897461,69.6150326 60.1468099,69.6993425 59.7001953,69.6993425 C59.3948568,69.6993425 59.0872396,69.6651629 58.7773438,69.5968035 C58.4674479,69.5284441 58.1962891,69.4498308 57.9638672,69.3609636 C57.7314453,69.2720964 57.5719401,69.1980405 57.4853516,69.1387957 L57.4853516,69.1387957 L57.2597656,70.2598894 C57.4557292,70.4011655 57.7918294,70.5287696 58.2680664,70.6427019 C58.7443034,70.7566342 59.2353516,70.8136004 59.7412109,70.8136004 Z M66.5292969,70.8136004 C66.9075521,70.8136004 67.3051758,70.7486589 67.722168,70.6187761 C68.1391602,70.4888933 68.4593099,70.3419207 68.6826172,70.1778582 L68.6826172,70.1778582 L68.4228516,69.31653 C68.2906901,69.3848894 68.0844727,69.4509701 67.8041992,69.5147722 C67.5239258,69.5785743 67.2858073,69.6104754 67.0898438,69.6104754 C66.8209635,69.6104754 66.6306966,69.5785743 66.519043,69.5147722 C66.4073893,69.4509701 66.3310547,69.3108334 66.2900391,69.0943621 C66.2490234,68.8778907 66.2285156,68.5098894 66.2285156,67.9903582 L66.2285156,67.9903582 L66.2285156,64.0460222 L68.4296875,64.0460222 L68.4296875,62.9112566 L66.2285156,62.9112566 L66.2285156,61.1339129 L65.3261719,61.1339129 L65.1757812,61.6261004 C65.0436198,62.0772722 64.9433594,62.3894467 64.875,62.5626238 C64.8294271,62.6856707 64.769043,62.7825131 64.6938477,62.8531511 C64.6186523,62.9237892 64.5309245,62.9784767 64.4306641,63.0172136 C64.3304036,63.0559506 64.1754557,63.1049415 63.9658203,63.1641863 L63.9658203,63.1641863 L63.7197266,63.2325457 L63.7197266,64.0460222 L64.7314453,64.0460222 L64.7314453,68.8380144 C64.7314453,69.5854102 64.8886719,70.1015235 65.203125,70.3863543 C65.5175781,70.671185 65.9596354,70.8136004 66.5292969,70.8136004 Z M73.0986328,70.8136004 C73.5817057,70.8136004 74.0784505,70.7486589 74.5888672,70.6187761 C75.0992839,70.4888933 75.4798177,70.3214129 75.7304688,70.1163347 L75.7304688,70.1163347 L75.4433594,69.2550066 C75.2610677,69.3643816 74.9602865,69.4623634 74.5410156,69.5489519 C74.1217448,69.6355405 73.7753906,69.6788347 73.5019531,69.6788347 C71.9934896,69.6788347 71.2005208,68.8767514 71.1230469,67.2725847 C71.1230469,67.2133399 71.1207682,67.167767 71.1162109,67.135866 L71.1162109,67.135866 L75.921875,67.135866 C75.953776,66.9809181 75.9742839,66.8020444 75.9833984,66.5992449 C75.992513,66.3964454 75.9970703,66.1104754 75.9970703,65.7413347 C75.9788411,65.1124285 75.8409831,64.5746681 75.5834961,64.1280535 C75.3260091,63.6814389 74.9830729,63.346478 74.5546875,63.1231707 C74.1263021,62.8998634 73.6500651,62.792767 73.1259766,62.8018816 C72.383138,62.8155535 71.7508138,62.9944272 71.2290039,63.3385027 C70.707194,63.6825782 70.3129883,64.1531186 70.0463867,64.7501238 C69.7797852,65.347129 69.6464844,66.0284441 69.6464844,66.7940691 C69.6464844,67.6371681 69.7809245,68.3594988 70.0498047,68.9610613 C70.3186849,69.5626238 70.710612,70.0217709 71.2255859,70.3385027 C71.7405599,70.6552345 72.3649089,70.8136004 73.0986328,70.8136004 Z M74.5888672,66.1378191 L71.1572266,66.1378191 C71.2392578,65.3402931 71.4477539,64.7626563 71.7827148,64.4049089 C72.1176758,64.0471616 72.5380859,63.8682879 73.0439453,63.8682879 C73.6136068,63.8682879 74.0157878,64.0483009 74.2504883,64.4083269 C74.4851888,64.768353 74.6025391,65.237754 74.6025391,65.81653 C74.6025391,65.8848894 74.5979818,65.9919858 74.5888672,66.1378191 L74.5888672,66.1378191 Z M83.9814453,70.8136004 L83.9814453,59.3292254 L82.4775391,59.3292254 L82.4775391,62.5762957 L82.4980469,62.9932879 C82.0878906,62.8656837 81.6640625,62.8018816 81.2265625,62.8018816 C80.4518229,62.8018816 79.7693685,62.9830339 79.1791992,63.3453386 C78.5890299,63.7076433 78.1321615,64.214642 77.8085938,64.8663347 C77.485026,65.5180274 77.3232422,66.260866 77.3232422,67.0948504 C77.3232422,67.9060483 77.4622396,68.5907813 77.7402344,69.1490496 C78.0182292,69.7073178 78.3885091,70.12431 78.8510742,70.4000261 C79.3136393,70.6757423 79.827474,70.8136004 80.3925781,70.8136004 C80.9166667,70.8136004 81.3473307,70.7292905 81.6845703,70.5606707 C82.0218099,70.3920509 82.3134766,70.1824155 82.5595703,69.9317644 L82.5595703,69.9317644 L82.5595703,70.2120379 C82.5595703,70.3852149 82.590332,70.5150977 82.6518555,70.6016863 C82.7133789,70.6882748 82.7976888,70.745241 82.9047852,70.7725847 C83.0118815,70.7999285 83.1542969,70.8136004 83.3320312,70.8136004 L83.3320312,70.8136004 L83.9814453,70.8136004 Z M80.8095703,69.6309832 C80.1761068,69.6309832 79.6918945,69.4110938 79.3569336,68.9713152 C79.0219727,68.5315366 78.8544922,67.862754 78.8544922,66.9649675 C78.8544922,66.3178321 78.9501953,65.7629819 79.1416016,65.3004168 C79.3330078,64.8378517 79.5973307,64.4880795 79.9345703,64.2511004 C80.2718099,64.0141212 80.6523438,63.8956316 81.0761719,63.8956316 C81.4179688,63.8956316 81.7027995,63.9229754 81.9306641,63.9776629 C82.1585286,64.0323504 82.3408203,64.1189389 82.4775391,64.2374285 L82.4775391,64.2374285 L82.4775391,69.0020769 C82.2679036,69.1706967 82.0206706,69.3176694 81.7358398,69.4429949 C81.4510091,69.5683204 81.1422526,69.6309832 80.8095703,69.6309832 Z M96.9150391,70.8136004 L96.9150391,59.3292254 L95.4111328,59.3292254 L95.4111328,62.5762957 L95.4316406,62.9932879 C95.0214844,62.8656837 94.5976562,62.8018816 94.1601562,62.8018816 C93.3854167,62.8018816 92.7029622,62.9830339 92.112793,63.3453386 C91.5226237,63.7076433 91.0657552,64.214642 90.7421875,64.8663347 C90.4186198,65.5180274 90.2568359,66.260866 90.2568359,67.0948504 C90.2568359,67.9060483 90.3958333,68.5907813 90.6738281,69.1490496 C90.9518229,69.7073178 91.3221029,70.12431 91.784668,70.4000261 C92.2472331,70.6757423 92.7610677,70.8136004 93.3261719,70.8136004 C93.8502604,70.8136004 94.2809245,70.7292905 94.6181641,70.5606707 C94.9554036,70.3920509 95.2470703,70.1824155 95.4931641,69.9317644 L95.4931641,69.9317644 L95.4931641,70.2120379 C95.4931641,70.3852149 95.5239258,70.5150977 95.5854492,70.6016863 C95.6469727,70.6882748 95.7312826,70.745241 95.8383789,70.7725847 C95.9454753,70.7999285 96.0878906,70.8136004 96.265625,70.8136004 L96.265625,70.8136004 L96.9150391,70.8136004 Z M93.7431641,69.6309832 C93.1097005,69.6309832 92.6254883,69.4110938 92.2905273,68.9713152 C91.9555664,68.5315366 91.7880859,67.862754 91.7880859,66.9649675 C91.7880859,66.3178321 91.8837891,65.7629819 92.0751953,65.3004168 C92.2666016,64.8378517 92.5309245,64.4880795 92.8681641,64.2511004 C93.2054036,64.0141212 93.5859375,63.8956316 94.0097656,63.8956316 C94.3515625,63.8956316 94.6363932,63.9229754 94.8642578,63.9776629 C95.0921224,64.0323504 95.2744141,64.1189389 95.4111328,64.2374285 L95.4111328,64.2374285 L95.4111328,69.0020769 C95.2014974,69.1706967 94.9542643,69.3176694 94.6694336,69.4429949 C94.3846029,69.5683204 94.0758464,69.6309832 93.7431641,69.6309832 Z M104.680664,70.8136004 L104.680664,65.276491 C104.680664,64.620241 104.56901,64.1109636 104.345703,63.7486589 C104.122396,63.3863543 103.810221,63.1368425 103.40918,63.0001238 C103.008138,62.863405 102.506836,62.7950457 101.905273,62.7950457 C101.536133,62.7950457 101.152181,62.8394793 100.753418,62.9283464 C100.354655,63.0172136 99.9991862,63.1186134 99.6870117,63.2325457 C99.3748372,63.346478 99.1595052,63.4399024 99.0410156,63.5128191 L99.0410156,63.5128191 L99.4101562,64.4971941 C99.5286458,64.4151629 99.7120768,64.3297136 99.9604492,64.2408464 C100.208822,64.1519793 100.475423,64.0779233 100.760254,64.0186785 C101.045085,63.9594337 101.296875,63.9298113 101.515625,63.9298113 C101.925781,63.9298113 102.24707,63.9617123 102.479492,64.0255144 C102.711914,64.0893165 102.88623,64.2123634 103.002441,64.394655 C103.118652,64.5769467 103.176758,64.8503842 103.176758,65.2149675 L103.176758,65.2149675 L103.176758,66.0011004 C102.693685,66.0011004 102.184408,66.0432553 101.648926,66.1275652 C101.113444,66.2118751 100.633789,66.3383399 100.209961,66.5069597 C99.7314453,66.7029233 99.3588867,66.9809181 99.0922852,67.3409441 C98.8256836,67.7009701 98.6923828,68.1270769 98.6923828,68.6192644 C98.6923828,69.065879 98.7937826,69.4543881 98.996582,69.7847918 C99.1993815,70.1151954 99.4819336,70.3692644 99.8442383,70.5469988 C100.206543,70.7247332 100.617839,70.8136004 101.078125,70.8136004 C101.511068,70.8136004 101.926921,70.738405 102.325684,70.5880144 C102.724447,70.4376238 103.03776,70.2576108 103.265625,70.0479754 L103.265625,70.0479754 L103.265625,70.1026629 C103.265625,70.3214129 103.295247,70.4809181 103.354492,70.5811785 C103.413737,70.6814389 103.495768,70.745241 103.600586,70.7725847 C103.705404,70.7999285 103.860352,70.8136004 104.06543,70.8136004 L104.06543,70.8136004 L104.680664,70.8136004 Z M101.522461,69.6925066 C100.624674,69.6925066 100.175781,69.2914649 100.175781,68.4893816 C100.175781,68.2068295 100.250977,67.9766863 100.401367,67.7989519 C100.551758,67.6212175 100.765951,67.4662696 101.043945,67.3341082 C101.299154,67.2110613 101.635254,67.1176368 102.052246,67.0538347 C102.469238,66.9900326 102.844076,66.9581316 103.176758,66.9581316 L103.176758,66.9581316 L103.176758,69.1387957 C103.12207,69.2025977 103.00472,69.2789324 102.824707,69.3677996 C102.644694,69.4566668 102.436198,69.5330014 102.199219,69.5968035 C101.96224,69.6606056 101.736654,69.6925066 101.522461,69.6925066 Z M109.137695,70.8136004 C109.515951,70.8136004 109.913574,70.7486589 110.330566,70.6187761 C110.747559,70.4888933 111.067708,70.3419207 111.291016,70.1778582 L111.291016,70.1778582 L111.03125,69.31653 C110.899089,69.3848894 110.692871,69.4509701 110.412598,69.5147722 C110.132324,69.5785743 109.894206,69.6104754 109.698242,69.6104754 C109.429362,69.6104754 109.239095,69.5785743 109.127441,69.5147722 C109.015788,69.4509701 108.939453,69.3108334 108.898438,69.0943621 C108.857422,68.8778907 108.836914,68.5098894 108.836914,67.9903582 L108.836914,67.9903582 L108.836914,64.0460222 L111.038086,64.0460222 L111.038086,62.9112566 L108.836914,62.9112566 L108.836914,61.1339129 L107.93457,61.1339129 L107.78418,61.6261004 C107.652018,62.0772722 107.551758,62.3894467 107.483398,62.5626238 C107.437826,62.6856707 107.377441,62.7825131 107.302246,62.8531511 C107.227051,62.9237892 107.139323,62.9784767 107.039062,63.0172136 C106.938802,63.0559506 106.783854,63.1049415 106.574219,63.1641863 L106.574219,63.1641863 L106.328125,63.2325457 L106.328125,64.0460222 L107.339844,64.0460222 L107.339844,68.8380144 C107.339844,69.5854102 107.49707,70.1015235 107.811523,70.3863543 C108.125977,70.671185 108.568034,70.8136004 109.137695,70.8136004 Z M118.222656,70.8136004 L118.222656,65.276491 C118.222656,64.620241 118.111003,64.1109636 117.887695,63.7486589 C117.664388,63.3863543 117.352214,63.1368425 116.951172,63.0001238 C116.55013,62.863405 116.048828,62.7950457 115.447266,62.7950457 C115.078125,62.7950457 114.694173,62.8394793 114.29541,62.9283464 C113.896647,63.0172136 113.541178,63.1186134 113.229004,63.2325457 C112.916829,63.346478 112.701497,63.4399024 112.583008,63.5128191 L112.583008,63.5128191 L112.952148,64.4971941 C113.070638,64.4151629 113.254069,64.3297136 113.502441,64.2408464 C113.750814,64.1519793 114.017415,64.0779233 114.302246,64.0186785 C114.587077,63.9594337 114.838867,63.9298113 115.057617,63.9298113 C115.467773,63.9298113 115.789062,63.9617123 116.021484,64.0255144 C116.253906,64.0893165 116.428223,64.2123634 116.544434,64.394655 C116.660645,64.5769467 116.71875,64.8503842 116.71875,65.2149675 L116.71875,65.2149675 L116.71875,66.0011004 C116.235677,66.0011004 115.7264,66.0432553 115.190918,66.1275652 C114.655436,66.2118751 114.175781,66.3383399 113.751953,66.5069597 C113.273438,66.7029233 112.900879,66.9809181 112.634277,67.3409441 C112.367676,67.7009701 112.234375,68.1270769 112.234375,68.6192644 C112.234375,69.065879 112.335775,69.4543881 112.538574,69.7847918 C112.741374,70.1151954 113.023926,70.3692644 113.38623,70.5469988 C113.748535,70.7247332 114.159831,70.8136004 114.620117,70.8136004 C115.05306,70.8136004 115.468913,70.738405 115.867676,70.5880144 C116.266439,70.4376238 116.579753,70.2576108 116.807617,70.0479754 L116.807617,70.0479754 L116.807617,70.1026629 C116.807617,70.3214129 116.83724,70.4809181 116.896484,70.5811785 C116.955729,70.6814389 117.03776,70.745241 117.142578,70.7725847 C117.247396,70.7999285 117.402344,70.8136004 117.607422,70.8136004 L117.607422,70.8136004 L118.222656,70.8136004 Z M115.064453,69.6925066 C114.166667,69.6925066 113.717773,69.2914649 113.717773,68.4893816 C113.717773,68.2068295 113.792969,67.9766863 113.943359,67.7989519 C114.09375,67.6212175 114.307943,67.4662696 114.585938,67.3341082 C114.841146,67.2110613 115.177246,67.1176368 115.594238,67.0538347 C116.01123,66.9900326 116.386068,66.9581316 116.71875,66.9581316 L116.71875,66.9581316 L116.71875,69.1387957 C116.664062,69.2025977 116.546712,69.2789324 116.366699,69.3677996 C116.186686,69.4566668 115.97819,69.5330014 115.741211,69.5968035 C115.504232,69.6606056 115.278646,69.6925066 115.064453,69.6925066 Z M126.507812,70.7042254 L126.507812,64.7637957 C126.799479,64.549603 127.124186,64.3798438 127.481934,64.2545183 C127.839681,64.1291928 128.152995,64.0619727 128.421875,64.0528582 C128.809245,64.034629 129.105469,64.0858985 129.310547,64.2066668 C129.515625,64.327435 129.655762,64.5165626 129.730957,64.7740496 C129.806152,65.0315366 129.84375,65.3881446 129.84375,65.8438738 L129.84375,65.8438738 L129.84375,70.7042254 L131.347656,70.7042254 L131.347656,65.823366 C131.347656,65.4223243 131.327148,65.0645769 131.286133,64.7501238 C131.577799,64.5450457 131.899089,64.3798438 132.25,64.2545183 C132.600911,64.1291928 132.915365,64.0619727 133.193359,64.0528582 C133.585286,64.034629 133.883789,64.0858985 134.088867,64.2066668 C134.293945,64.327435 134.432943,64.5165626 134.505859,64.7740496 C134.578776,65.0315366 134.615234,65.3881446 134.615234,65.8438738 L134.615234,65.8438738 L134.615234,70.7042254 L136.119141,70.7042254 L136.119141,65.823366 C136.119141,65.0759701 136.042806,64.4823829 135.890137,64.0426043 C135.737467,63.6028256 135.499349,63.2849545 135.175781,63.088991 C134.852214,62.8930274 134.419271,62.7950457 133.876953,62.7950457 C133.380208,62.7950457 132.866374,62.8918881 132.335449,63.085573 C131.804525,63.2792579 131.365885,63.5059832 131.019531,63.7657488 C130.850911,63.41028 130.605957,63.156211 130.284668,63.0035418 C129.963379,62.8508725 129.545247,62.7813738 129.030273,62.7950457 C128.56543,62.8087175 128.090332,62.9112566 127.60498,63.1026629 C127.119629,63.2940691 126.701497,63.5082618 126.350586,63.745241 L126.350586,63.745241 L126.34375,62.9249285 L125.003906,62.9249285 L125.003906,70.7042254 L126.507812,70.7042254 Z M143.912109,70.8136004 L143.912109,65.276491 C143.912109,64.620241 143.800456,64.1109636 143.577148,63.7486589 C143.353841,63.3863543 143.041667,63.1368425 142.640625,63.0001238 C142.239583,62.863405 141.738281,62.7950457 141.136719,62.7950457 C140.767578,62.7950457 140.383626,62.8394793 139.984863,62.9283464 C139.5861,63.0172136 139.230632,63.1186134 138.918457,63.2325457 C138.606283,63.346478 138.390951,63.4399024 138.272461,63.5128191 L138.272461,63.5128191 L138.641602,64.4971941 C138.760091,64.4151629 138.943522,64.3297136 139.191895,64.2408464 C139.440267,64.1519793 139.706868,64.0779233 139.991699,64.0186785 C140.27653,63.9594337 140.52832,63.9298113 140.74707,63.9298113 C141.157227,63.9298113 141.478516,63.9617123 141.710938,64.0255144 C141.943359,64.0893165 142.117676,64.2123634 142.233887,64.394655 C142.350098,64.5769467 142.408203,64.8503842 142.408203,65.2149675 L142.408203,65.2149675 L142.408203,66.0011004 C141.92513,66.0011004 141.415853,66.0432553 140.880371,66.1275652 C140.344889,66.2118751 139.865234,66.3383399 139.441406,66.5069597 C138.962891,66.7029233 138.590332,66.9809181 138.32373,67.3409441 C138.057129,67.7009701 137.923828,68.1270769 137.923828,68.6192644 C137.923828,69.065879 138.025228,69.4543881 138.228027,69.7847918 C138.430827,70.1151954 138.713379,70.3692644 139.075684,70.5469988 C139.437988,70.7247332 139.849284,70.8136004 140.30957,70.8136004 C140.742513,70.8136004 141.158366,70.738405 141.557129,70.5880144 C141.955892,70.4376238 142.269206,70.2576108 142.49707,70.0479754 L142.49707,70.0479754 L142.49707,70.1026629 C142.49707,70.3214129 142.526693,70.4809181 142.585938,70.5811785 C142.645182,70.6814389 142.727214,70.745241 142.832031,70.7725847 C142.936849,70.7999285 143.091797,70.8136004 143.296875,70.8136004 L143.296875,70.8136004 L143.912109,70.8136004 Z M140.753906,69.6925066 C139.85612,69.6925066 139.407227,69.2914649 139.407227,68.4893816 C139.407227,68.2068295 139.482422,67.9766863 139.632812,67.7989519 C139.783203,67.6212175 139.997396,67.4662696 140.275391,67.3341082 C140.530599,67.2110613 140.866699,67.1176368 141.283691,67.0538347 C141.700684,66.9900326 142.075521,66.9581316 142.408203,66.9581316 L142.408203,66.9581316 L142.408203,69.1387957 C142.353516,69.2025977 142.236165,69.2789324 142.056152,69.3677996 C141.876139,69.4566668 141.667643,69.5330014 141.430664,69.5968035 C141.193685,69.6606056 140.968099,69.6925066 140.753906,69.6925066 Z M147.665039,70.7042254 L147.665039,64.7569597 C147.86556,64.5792254 148.112793,64.4276954 148.406738,64.3023699 C148.700684,64.1770444 149.020833,64.1143816 149.367188,64.1143816 C149.64974,64.1143816 149.86735,64.1314714 150.02002,64.1656511 C150.172689,64.1998308 150.296875,64.2442644 150.392578,64.2989519 L150.392578,64.2989519 L150.392578,62.8907488 C150.251302,62.8269467 149.998372,62.7950457 149.633789,62.7950457 C149.360352,62.7950457 149.078939,62.8485938 148.789551,62.9556902 C148.500163,63.0627866 148.242676,63.1938087 148.01709,63.3487566 C147.791504,63.5037045 147.628581,63.6495379 147.52832,63.7862566 L147.52832,63.7862566 L147.425781,62.9249285 L146.161133,62.9249285 L146.161133,70.7042254 L147.665039,70.7042254 Z M153.263672,70.7042254 L153.263672,69.1798113 L153.229492,68.010866 L154.193359,66.9991472 L156.770508,70.7042254 L158.479492,70.7042254 L155.177734,65.9805925 L158.117188,62.9112566 L156.34668,62.9112566 L153.236328,66.3360613 L153.263672,65.5704363 L153.263672,59.3497332 L151.759766,59.3497332 L151.759766,70.7042254 L153.263672,70.7042254 Z M162.676758,70.8136004 C163.159831,70.8136004 163.656576,70.7486589 164.166992,70.6187761 C164.677409,70.4888933 165.057943,70.3214129 165.308594,70.1163347 L165.308594,70.1163347 L165.021484,69.2550066 C164.839193,69.3643816 164.538411,69.4623634 164.119141,69.5489519 C163.69987,69.6355405 163.353516,69.6788347 163.080078,69.6788347 C161.571615,69.6788347 160.778646,68.8767514 160.701172,67.2725847 C160.701172,67.2133399 160.698893,67.167767 160.694336,67.135866 L160.694336,67.135866 L165.5,67.135866 C165.531901,66.9809181 165.552409,66.8020444 165.561523,66.5992449 C165.570638,66.3964454 165.575195,66.1104754 165.575195,65.7413347 C165.556966,65.1124285 165.419108,64.5746681 165.161621,64.1280535 C164.904134,63.6814389 164.561198,63.346478 164.132812,63.1231707 C163.704427,62.8998634 163.22819,62.792767 162.704102,62.8018816 C161.961263,62.8155535 161.328939,62.9944272 160.807129,63.3385027 C160.285319,63.6825782 159.891113,64.1531186 159.624512,64.7501238 C159.35791,65.347129 159.224609,66.0284441 159.224609,66.7940691 C159.224609,67.6371681 159.359049,68.3594988 159.62793,68.9610613 C159.89681,69.5626238 160.288737,70.0217709 160.803711,70.3385027 C161.318685,70.6552345 161.943034,70.8136004 162.676758,70.8136004 Z M164.166992,66.1378191 L160.735352,66.1378191 C160.817383,65.3402931 161.025879,64.7626563 161.36084,64.4049089 C161.695801,64.0471616 162.116211,63.8682879 162.62207,63.8682879 C163.191732,63.8682879 163.593913,64.0483009 163.828613,64.4083269 C164.063314,64.768353 164.180664,65.237754 164.180664,65.81653 C164.180664,65.8848894 164.176107,65.9919858 164.166992,66.1378191 L164.166992,66.1378191 Z M169.594727,70.8136004 C169.972982,70.8136004 170.370605,70.7486589 170.787598,70.6187761 C171.20459,70.4888933 171.52474,70.3419207 171.748047,70.1778582 L171.748047,70.1778582 L171.488281,69.31653 C171.35612,69.3848894 171.149902,69.4509701 170.869629,69.5147722 C170.589355,69.5785743 170.351237,69.6104754 170.155273,69.6104754 C169.886393,69.6104754 169.696126,69.5785743 169.584473,69.5147722 C169.472819,69.4509701 169.396484,69.3108334 169.355469,69.0943621 C169.314453,68.8778907 169.293945,68.5098894 169.293945,67.9903582 L169.293945,67.9903582 L169.293945,64.0460222 L171.495117,64.0460222 L171.495117,62.9112566 L169.293945,62.9112566 L169.293945,61.1339129 L168.391602,61.1339129 L168.241211,61.6261004 C168.109049,62.0772722 168.008789,62.3894467 167.94043,62.5626238 C167.894857,62.6856707 167.834473,62.7825131 167.759277,62.8531511 C167.684082,62.9237892 167.596354,62.9784767 167.496094,63.0172136 C167.395833,63.0559506 167.240885,63.1049415 167.03125,63.1641863 L167.03125,63.1641863 L166.785156,63.2325457 L166.785156,64.0460222 L167.796875,64.0460222 L167.796875,68.8380144 C167.796875,69.5854102 167.954102,70.1015235 168.268555,70.3863543 C168.583008,70.671185 169.025065,70.8136004 169.594727,70.8136004 Z M174.6875,74.1632097 L174.6875,71.6544207 L174.666992,70.6153582 C175.054362,70.7475196 175.480469,70.8136004 175.945312,70.8136004 C176.720052,70.8136004 177.402507,70.632448 177.992676,70.2701433 C178.582845,69.9078386 179.039714,69.4008399 179.363281,68.7491472 C179.686849,68.0974545 179.848633,67.354616 179.848633,66.5206316 C179.848633,65.7094337 179.709635,65.0247006 179.431641,64.4664324 C179.153646,63.9081642 178.782227,63.491172 178.317383,63.2154558 C177.852539,62.9397397 177.337565,62.8018816 176.772461,62.8018816 C176.216471,62.8018816 175.769857,62.8930274 175.432617,63.0753191 C175.095378,63.2576108 174.799154,63.4831967 174.543945,63.7520769 L174.543945,63.7520769 L174.543945,62.9112566 L173.183594,62.9112566 L173.183594,74.1632097 L174.6875,74.1632097 Z M176.088867,69.7198504 C175.74707,69.7198504 175.463379,69.6925066 175.237793,69.6378191 C175.012207,69.5831316 174.828776,69.4942644 174.6875,69.3712175 L174.6875,69.3712175 L174.6875,64.620241 C174.90625,64.4470639 175.155762,64.2978126 175.436035,64.1724871 C175.716309,64.0471616 176.022786,63.9844988 176.355469,63.9844988 C176.99349,63.9844988 177.47998,64.2043881 177.814941,64.6441668 C178.149902,65.0839454 178.317383,65.752728 178.317383,66.6505144 C178.317383,67.3022071 178.22168,67.8581967 178.030273,68.3184832 C177.838867,68.7787696 177.574544,69.1274024 177.237305,69.3643816 C176.900065,69.6013608 176.517253,69.7198504 176.088867,69.7198504 Z M183.362305,70.7042254 L183.362305,59.3292254 L181.858398,59.3292254 L181.858398,70.7042254 L183.362305,70.7042254 Z M191.333008,70.8136004 L191.333008,65.276491 C191.333008,64.620241 191.221354,64.1109636 190.998047,63.7486589 C190.77474,63.3863543 190.462565,63.1368425 190.061523,63.0001238 C189.660482,62.863405 189.15918,62.7950457 188.557617,62.7950457 C188.188477,62.7950457 187.804525,62.8394793 187.405762,62.9283464 C187.006999,63.0172136 186.65153,63.1186134 186.339355,63.2325457 C186.027181,63.346478 185.811849,63.4399024 185.693359,63.5128191 L185.693359,63.5128191 L186.0625,64.4971941 C186.18099,64.4151629 186.364421,64.3297136 186.612793,64.2408464 C186.861165,64.1519793 187.127767,64.0779233 187.412598,64.0186785 C187.697428,63.9594337 187.949219,63.9298113 188.167969,63.9298113 C188.578125,63.9298113 188.899414,63.9617123 189.131836,64.0255144 C189.364258,64.0893165 189.538574,64.2123634 189.654785,64.394655 C189.770996,64.5769467 189.829102,64.8503842 189.829102,65.2149675 L189.829102,65.2149675 L189.829102,66.0011004 C189.346029,66.0011004 188.836751,66.0432553 188.30127,66.1275652 C187.765788,66.2118751 187.286133,66.3383399 186.862305,66.5069597 C186.383789,66.7029233 186.01123,66.9809181 185.744629,67.3409441 C185.478027,67.7009701 185.344727,68.1270769 185.344727,68.6192644 C185.344727,69.065879 185.446126,69.4543881 185.648926,69.7847918 C185.851725,70.1151954 186.134277,70.3692644 186.496582,70.5469988 C186.858887,70.7247332 187.270182,70.8136004 187.730469,70.8136004 C188.163411,70.8136004 188.579264,70.738405 188.978027,70.5880144 C189.37679,70.4376238 189.690104,70.2576108 189.917969,70.0479754 L189.917969,70.0479754 L189.917969,70.1026629 C189.917969,70.3214129 189.947591,70.4809181 190.006836,70.5811785 C190.066081,70.6814389 190.148112,70.745241 190.25293,70.7725847 C190.357747,70.7999285 190.512695,70.8136004 190.717773,70.8136004 L190.717773,70.8136004 L191.333008,70.8136004 Z M188.174805,69.6925066 C187.277018,69.6925066 186.828125,69.2914649 186.828125,68.4893816 C186.828125,68.2068295 186.90332,67.9766863 187.053711,67.7989519 C187.204102,67.6212175 187.418294,67.4662696 187.696289,67.3341082 C187.951497,67.2110613 188.287598,67.1176368 188.70459,67.0538347 C189.121582,66.9900326 189.496419,66.9581316 189.829102,66.9581316 L189.829102,66.9581316 L189.829102,69.1387957 C189.774414,69.2025977 189.657064,69.2789324 189.477051,69.3677996 C189.297038,69.4566668 189.088542,69.5330014 188.851562,69.5968035 C188.614583,69.6606056 188.388997,69.6925066 188.174805,69.6925066 Z M196.521484,70.8136004 C197.009115,70.8136004 197.469401,70.7463803 197.902344,70.6119402 C198.335286,70.4775001 198.672526,70.2986264 198.914062,70.0753191 L198.914062,70.0753191 L198.606445,69.2208269 C198.410482,69.3393165 198.141602,69.4452735 197.799805,69.538698 C197.458008,69.6321225 197.107096,69.6788347 196.74707,69.6788347 C196.332357,69.6788347 195.958659,69.5671811 195.625977,69.3438738 C195.293294,69.1205665 195.03125,68.7935808 194.839844,68.3629168 C194.648438,67.9322527 194.552734,67.4161394 194.552734,66.8145769 C194.552734,66.1674415 194.657552,65.6308204 194.867188,65.2047136 C195.076823,64.7786069 195.3514,64.4652931 195.690918,64.2647722 C196.030436,64.0642514 196.396159,63.963991 196.788086,63.963991 C197.180013,63.963991 197.517253,63.99931 197.799805,64.069948 C198.082357,64.140586 198.328451,64.2488217 198.538086,64.394655 L198.538086,64.394655 L198.777344,63.2052019 C198.626953,63.1049415 198.380859,63.0126563 198.039062,62.9283464 C197.697266,62.8440366 197.305339,62.8018816 196.863281,62.8018816 C196.052083,62.8018816 195.363932,62.979616 194.798828,63.3350847 C194.233724,63.6905535 193.808757,64.1770444 193.523926,64.7945574 C193.239095,65.4120704 193.09668,66.1104754 193.09668,66.8897722 C193.09668,67.6417254 193.23112,68.3139259 193.5,68.9063738 C193.76888,69.4988217 194.161947,69.9648048 194.679199,70.304323 C195.196452,70.6438412 195.810547,70.8136004 196.521484,70.8136004 Z M203.398438,70.8136004 C203.88151,70.8136004 204.378255,70.7486589 204.888672,70.6187761 C205.399089,70.4888933 205.779622,70.3214129 206.030273,70.1163347 L206.030273,70.1163347 L205.743164,69.2550066 C205.560872,69.3643816 205.260091,69.4623634 204.84082,69.5489519 C204.421549,69.6355405 204.075195,69.6788347 203.801758,69.6788347 C202.293294,69.6788347 201.500326,68.8767514 201.422852,67.2725847 C201.422852,67.2133399 201.420573,67.167767 201.416016,67.135866 L201.416016,67.135866 L206.22168,67.135866 C206.253581,66.9809181 206.274089,66.8020444 206.283203,66.5992449 C206.292318,66.3964454 206.296875,66.1104754 206.296875,65.7413347 C206.278646,65.1124285 206.140788,64.5746681 205.883301,64.1280535 C205.625814,63.6814389 205.282878,63.346478 204.854492,63.1231707 C204.426107,62.8998634 203.94987,62.792767 203.425781,62.8018816 C202.682943,62.8155535 202.050618,62.9944272 201.528809,63.3385027 C201.006999,63.6825782 200.612793,64.1531186 200.346191,64.7501238 C200.07959,65.347129 199.946289,66.0284441 199.946289,66.7940691 C199.946289,67.6371681 200.080729,68.3594988 200.349609,68.9610613 C200.61849,69.5626238 201.010417,70.0217709 201.525391,70.3385027 C202.040365,70.6552345 202.664714,70.8136004 203.398438,70.8136004 Z M204.888672,66.1378191 L201.457031,66.1378191 C201.539062,65.3402931 201.747559,64.7626563 202.08252,64.4049089 C202.41748,64.0471616 202.837891,63.8682879 203.34375,63.8682879 C203.913411,63.8682879 204.315592,64.0483009 204.550293,64.4083269 C204.784993,64.768353 204.902344,65.237754 204.902344,65.81653 C204.902344,65.8848894 204.897786,65.9919858 204.888672,66.1378191 L204.888672,66.1378191 Z" id="Yourtrusteddatamarketplace"></path>
            </g>
        </g>
    </g>
</svg>