<?xml version="1.0" encoding="UTF-8"?>
<svg width="140px" height="55px" viewBox="0 0 140 55" version="1.1" xmlns="http://www.w3.org/2000/svg" xmlns:xlink="http://www.w3.org/1999/xlink">
    <title>logo-wit no payoff</title>
    <g id="Typografie" stroke="none" stroke-width="1" fill="none" fill-rule="evenodd">
        <g id="dexes-logo" transform="translate(-34.000000, -648.000000)" fill="#FFFFFF" fill-rule="nonzero">
            <g id="logo-wit-no-payoff" transform="translate(34.000000, 648.000000)">
                <path d="M25.8995379,42.8545885 L25.8995379,2.46478873 L18.3896347,2.46478873 L18.3896347,13.0075374 L18.4618453,15.4145577 C17.0978672,14.90106 15.5974912,14.6443112 13.9607174,14.6443112 C11.2006675,14.6443112 8.7655654,15.262113 6.65541098,16.4977168 C4.54525657,17.7333205 2.9084828,19.4824219 1.74508968,21.7450209 C0.58169656,24.0076199 0,26.6392954 0,29.6400473 C0,32.496378 0.493439151,34.9194451 1.48031745,36.9092485 C2.46719575,38.8990519 3.78704519,40.3873927 5.43986576,41.374271 C7.09268633,42.3611493 8.92202171,42.8545885 10.9278719,42.8545885 C12.9016285,42.8545885 14.5183438,42.5376641 15.7780177,41.9038155 C17.0376916,41.2699668 18.1088157,40.503732 18.9913897,39.6051111 L18.9913897,39.6051111 L18.9913897,41.4585167 C18.9913897,42.0201548 19.1398227,42.3932429 19.4366885,42.5777811 C19.7335543,42.7623194 20.1868765,42.8545885 20.7966549,42.8545885 L20.7966549,42.8545885 L25.8995379,42.8545885 Z M13.2386114,37.0055293 C11.5055568,37.0055293 10.1776839,36.4117976 9.25499285,35.2243343 C8.33230175,34.036871 7.87095621,32.0310208 7.87095621,29.2067837 C7.87095621,27.2009335 8.13974013,25.5079959 8.67730799,24.127971 C9.21487584,22.747946 9.95704042,21.7129273 10.9038017,21.0229148 C11.850563,20.3329024 12.9417455,19.9878961 14.1773493,19.9878961 C15.1562042,19.9878961 15.9906378,20.0400482 16.6806503,20.1443524 C17.3706628,20.2486567 17.9403242,20.4532534 18.3896347,20.7581426 L18.3896347,20.7581426 L18.3896347,35.5613171 C17.7798562,35.978534 17.0136214,36.3235402 16.0909303,36.5963358 C15.1682393,36.8691315 14.2174663,37.0055293 13.2386114,37.0055293 Z M45.17977,42.8545885 C47.2337606,42.8545885 49.2075172,42.5898162 51.1010398,42.0602718 C52.9945624,41.5307273 54.4147044,40.8808319 55.3614657,40.1105854 L55.3614657,40.1105854 L54.1338853,35.8501596 C53.4438729,36.2352828 52.3567021,36.5682539 50.8723729,36.849073 C49.3880438,37.129892 48.1243581,37.2703015 47.081316,37.2703015 C44.898951,37.2703015 43.1699081,36.7166868 41.8941874,35.6094575 C40.6184667,34.5022282 39.9083957,32.817314 39.7639745,30.554715 L39.7639745,30.554715 L55.9872909,30.554715 C56.1638058,29.4314389 56.2520632,27.7144311 56.2520632,25.4036917 C56.2199696,22.8843438 55.718507,20.8223298 54.7476755,19.2176496 C53.776844,17.6129695 52.4890882,16.4495764 50.884408,15.7274703 C49.2797278,15.0053642 47.4824861,14.6443112 45.4926827,14.6443112 C42.7326328,14.6443112 40.3536944,15.2460662 38.3558676,16.4495764 C36.3580408,17.6530865 34.8376064,19.3139305 33.7945643,21.4321083 C32.7515222,23.5502861 32.2300011,25.9573063 32.2300011,28.653169 C32.2300011,31.6218273 32.727452,34.1692571 33.7223537,36.2954583 C34.7172554,38.4216595 36.1855377,40.0463982 38.1272007,41.1696743 C40.0688637,42.2929504 42.4197201,42.8545885 45.17977,42.8545885 Z M49.2717044,26.39057 L39.8843255,26.39057 C40.1410743,24.0637837 40.7067241,22.4149749 41.5812748,21.4441434 C42.4558254,20.4733119 43.6312537,19.9878961 45.1075594,19.9878961 C46.5838652,19.9878961 47.6509775,20.4412183 48.3088963,21.3478626 C48.9668152,22.2545069 49.2957746,23.5823797 49.2957746,25.3314811 C49.2957746,25.7968383 49.2877512,26.149868 49.2717044,26.39057 L49.2717044,26.39057 Z" id="de"></path>
                <path d="M103.188958,42.8545885 C105.242949,42.8545885 107.216705,42.5898162 109.110228,42.0602718 C111.00375,41.5307273 112.423892,40.8808319 113.370654,40.1105854 L113.370654,40.1105854 L112.143073,35.8501596 C111.453061,36.2352828 110.36589,36.5682539 108.881561,36.849073 C107.397232,37.129892 106.133546,37.2703015 105.090504,37.2703015 C102.908139,37.2703015 101.179096,36.7166868 99.9033753,35.6094575 C98.6276546,34.5022282 97.9175836,32.817314 97.7731624,30.554715 L97.7731624,30.554715 L113.996479,30.554715 C114.172994,29.4314389 114.261251,27.7144311 114.261251,25.4036917 C114.229157,22.8843438 113.727695,20.8223298 112.756863,19.2176496 C111.786032,17.6129695 110.498276,16.4495764 108.893596,15.7274703 C107.288916,15.0053642 105.491674,14.6443112 103.501871,14.6443112 C100.741821,14.6443112 98.3628824,15.2460662 96.3650556,16.4495764 C94.3672288,17.6530865 92.8467943,19.3139305 91.8037522,21.4321083 C90.7607101,23.5502861 90.239189,25.9573063 90.239189,28.653169 C90.239189,31.6218273 90.7366399,34.1692571 91.7315416,36.2954583 C92.7264433,38.4216595 94.1947256,40.0463982 96.1363886,41.1696743 C98.0780516,42.2929504 100.428908,42.8545885 103.188958,42.8545885 Z M107.280892,26.39057 L97.8935134,26.39057 C98.1502623,24.0637837 98.715912,22.4149749 99.5904627,21.4441434 C100.465013,20.4733119 101.640442,19.9878961 103.116747,19.9878961 C104.593053,19.9878961 105.660165,20.4412183 106.318084,21.3478626 C106.976003,22.2545069 107.304963,23.5823797 107.304963,25.3314811 C107.304963,25.7968383 107.296939,26.149868 107.280892,26.39057 L107.280892,26.39057 Z M128.944075,42.8545885 C132.313903,42.8545885 134.94959,42.1445175 136.851136,40.7243756 C138.752682,39.3042336 139.703455,37.2061143 139.703455,34.4300176 C139.703455,33.0660395 139.446706,31.8906112 138.933209,30.9037329 C138.419711,29.9168546 137.605336,29.042304 136.490083,28.2800809 C135.37483,27.5178578 133.878466,26.8158102 132.00099,26.1739382 C130.588872,25.6925341 129.509724,25.2713056 128.763548,24.9102525 C128.017372,24.5491995 127.475792,24.1720997 127.138809,23.778953 C126.801827,23.3858064 126.633335,22.908414 126.633335,22.346776 C126.633335,21.5604827 126.9984,20.9948329 127.728529,20.6498267 C128.458659,20.3048205 129.64211,20.1323173 131.278884,20.1323173 C132.418207,20.1323173 133.593635,20.3168556 134.805169,20.685932 C136.016702,21.0550084 136.895265,21.4882721 137.440856,21.9857229 L137.440856,21.9857229 L138.259243,16.2088743 C137.617371,15.8397979 136.606422,15.4867683 135.226397,15.1497854 C133.846373,14.8128026 132.281809,14.6443112 130.532708,14.6443112 C128.36639,14.6443112 126.448797,14.9492004 124.77993,15.5589789 C123.111062,16.1687573 121.80726,17.0713899 120.868522,18.2668767 C119.929784,19.4623634 119.460415,20.9105872 119.460415,22.6115482 C119.460415,24.6334452 120.001994,26.3344062 121.085153,27.7144311 C122.168313,29.0944561 123.929449,30.1856386 126.368563,30.9879787 C128.422554,31.6619443 129.926941,32.3118398 130.881726,32.9376651 C131.836511,33.5634903 132.313903,34.2615262 132.313903,35.0317727 C132.313903,35.8662064 131.968897,36.459938 131.278884,36.8129676 C130.588872,37.1659973 129.497689,37.3344887 128.005337,37.3184419 C126.930201,37.3184419 125.84303,37.1900675 124.743824,36.9333187 C123.644618,36.6765698 122.677799,36.3756923 121.843365,36.0306861 C121.008931,35.6856798 120.43927,35.3928257 120.134381,35.1521237 L120.134381,35.1521237 L119.364134,40.7364107 C119.877632,41.0733935 120.643866,41.4063646 121.662838,41.7353241 C122.68181,42.0642835 123.833168,42.3330674 125.116912,42.5416758 C126.400657,42.7502843 127.676377,42.8545885 128.944075,42.8545885 Z" id="es"></path>
                <path d="M54.1598277,3.30943116 C55.0463949,3.44981804 56.0007419,3.59219203 57.2135029,3.77809009 L57.9017827,3.88405512 C58.3792488,3.95790897 58.8954686,4.03851671 59.4596087,4.1278756 C60.3081142,4.26221686 61.2620096,4.52720561 61.7119198,5.7536138 C63.4850931,10.5232634 65.5762188,15.5890907 67.9098825,20.8268581 C72.3856953,16.2827374 77.4115405,12.1764307 83.1952777,8.51331832 C83.6381687,8.17583576 84.3859357,8.09045563 85.4385788,8.25717791 C86.4345747,8.41492816 87.4201853,8.57735427 89.7242545,8.94228299 C90.5218199,9.06860494 91.2083379,10.2376391 90.0335709,11.0846776 C83.1459041,16.0009462 76.8382348,21.7666151 71.2650698,28.1259469 C74.6803494,35.3459872 78.4723724,42.7744005 82.4570914,50.1086406 C82.9315921,50.9286786 82.4614471,51.6920313 81.5580379,51.5489453 C79.0079517,51.1450514 76.9359812,50.8250069 75.6467918,50.6208194 C74.7814656,50.4837652 74.1799486,50.0624746 73.8422409,49.3569476 C71.270412,44.0118022 68.8074516,38.9272107 66.4430134,34.0131282 C63.3701274,38.0329371 60.5787433,42.2381931 58.1023783,46.5744148 C57.5084473,47.7479878 56.7240367,47.6237494 55.5863784,47.443562 C53.9174535,47.1792303 51.906176,46.8606752 50.5527394,46.6463119 C50.1364538,46.5803788 49.7188612,46.0072076 50.1373274,45.3128747 C53.9541082,38.4384714 58.0713727,32.1467641 62.8207263,26.4465636 C59.2958888,19.03663 55.9968905,11.9258907 52.8844871,4.77484891 C52.4569078,3.68264447 53.6289099,3.22534204 54.1598277,3.30943116 Z" id="Combined-Shape-Copy-9" transform="translate(70.313199, 27.433004) scale(-1, 1) rotate(-9.000000) translate(-70.313199, -27.433004) "></path>
            </g>
        </g>
    </g>
</svg>