<?xml version="1.0" encoding="UTF-8"?>
<svg width="359px" height="74px" viewBox="0 0 359 74" version="1.1" xmlns="http://www.w3.org/2000/svg" xmlns:xlink="http://www.w3.org/1999/xlink">
    <title>DexesWaveOnderSegment Copy</title>
    <defs>
        <path d="M20,0 L335,0 C346.045695,-2.02906125e-15 355,8.954305 355,20 L355,70 L355,70 L0,70 L0,20 C-1.3527075e-15,8.954305 8.954305,2.02906125e-15 20,0 Z" id="path-1"></path>
    </defs>
    <g id="Paginas" stroke="none" stroke-width="1" fill="none" fill-rule="evenodd">
        <g id="Mobiel05-nav-onder-scroll" transform="translate(-8.000000, -628.000000)">
            <g id="MainNav" transform="translate(10.000000, 630.000000)">
                <g id="DexesWaveOnderSegment-Copy" transform="translate(0.000000, -0.000000)">
                    <mask id="mask-2" fill="white">
                        <use xlink:href="#path-1"></use>
                    </mask>
                    <path stroke="#FFFFFF" stroke-width="2" d="M335,-1 C340.79899,-1 346.04899,1.35050506 349.849242,5.1507576 C353.649495,8.95101013 356,14.2010101 356,20 L356,20 L356,71 L-1,71 L-1,20 C-1,14.2010101 1.35050506,8.95101013 5.1507576,5.1507576 C8.95101013,1.35050506 14.2010101,-1 20,-1 L20,-1 Z"></path>
                    <g id="DexesWaveOnder" mask="url(#mask-2)">
                        <g transform="translate(-502.000000, 123.500000) rotate(-360.000000) translate(502.000000, -123.500000) translate(-2743.000000, -835.000000)">
                            <path d="M1631,247 C1887,247 1890.29682,928.51165 2142.00871,928.51165 L2142.00871,928.51165 L2142.00871,1617 L95,1617 L95,1617 L95,928.51165 C351,928.51165 351.46888,247 607,247 C862.53112,247 863,928.51165 1119,928.51165 C1375,928.51165 1375,247 1631,247 Z M3679,247 C3935,247 3939.28811,928.51165 4191,928.51165 L4191,928.51165 L4191,1617 L2142.00871,1617 C2142.64975,1174.03333 2142.97988,944.811437 2142.99911,929.334312 L2142.9999,928.649568 L2142.9999,928.649568 L2143,928.51165 C2399,928.51165 2399.46888,247 2655,247 C2910.53112,247 2911,928.51165 3167,928.51165 C3423,928.51165 3423,247 3679,247 Z" id="rood" fill-opacity="0.5" fill="#FF2D55" style="mix-blend-mode: overlay;"></path>
                            <path d="M95,913 L95,476.14717 C351.123971,476.14717 351.345136,1.13686838e-13 607,1.13686838e-13 C862.654864,1.13686838e-13 862.876029,476.14717 1119,476.14717 C1375.12397,476.14717 1374.87603,1.13686838e-13 1631,1.13686838e-13 C1887.12397,1.13686838e-13 1891.16621,476.14717 2143,476.14717 C2399.12397,476.14717 2399.34514,-3.41060513e-13 2655,-3.41060513e-13 C2910.65486,-3.41060513e-13 2910.87603,476.14717 3167,476.14717 C3423.12397,476.14717 3422.87603,-3.41060513e-13 3679,-3.41060513e-13 C3935.12397,-3.41060513e-13 3939.16621,476.14717 4191,476.14717 L4191,476.14717 L4191,913 L95,913 L95,913 Z" id="blauw" fill-opacity="0.2" fill="#4890DA" style="mix-blend-mode: multiply;"></path>
                            <path d="M23,1917 L23,1228.51165 C279,1228.51165 279.46888,547 535,547 C790.53112,547 791,1228.51165 1047,1228.51165 C1303,1228.51165 1303,547 1559,547 C1815,547 1819.28811,1228.51165 2071,1228.51165 C2327,1228.51165 2327.46888,547 2583,547 C2838.53112,547 2839,1228.51165 3095,1228.51165 C3351,1228.51165 3351,547 3607,547 C3863,547 3867.28811,1228.51165 4119,1228.51165 L4119,1228.51165 L4119,1917 L23,1917 L23,1917 Z" id="rood" fill="#FF2D55" style="mix-blend-mode: overlay;"></path>
                            <path d="M4.09272616e-12,992 L4.09272616e-12,715.438187 C125.44,715.438187 189.526978,643.062878 252.331732,569.240063 L260.019787,560.198123 C322.819946,486.375309 386.789751,414 512,414 C637.210249,414 701.180054,486.375309 763.980213,560.198123 L771.668268,569.240063 C834.473022,643.062878 898.56,715.438187 1024,715.438187 C1280,715.438187 1280,414 1536,414 C1792,414 1796.28811,715.438187 2048,715.438187 C2173.44,715.438187 2237.52698,643.062878 2300.33173,569.240063 L2308.01979,560.198123 C2370.81995,486.375309 2434.78975,414 2560,414 C2685.21025,414 2749.18005,486.375309 2811.98021,560.198123 L2819.66827,569.240063 C2882.47302,643.062878 2946.56,715.438187 3072,715.438187 C3328,715.438187 3328,414 3584,414 C3840,414 3844.28811,715.438187 4096,715.438187 L4096,715.438187 L4096,992 L4.09272616e-12,992 L4.09272616e-12,992 Z" id="blauw" fill-opacity="0.4" fill="#4890DA" style="mix-blend-mode: multiply;"></path>
                            <path d="M383,1021 L383,642.080135 C639,642.080135 639.46888,267 895,267 C1150.53112,267 1151,642.080135 1407,642.080135 C1663,642.080135 1663,267 1919,267 C2175,267 2179.28811,642.080135 2431,642.080135 C2687,642.080135 2687.46888,267 2943,267 C3198.53112,267 3199,642.080135 3455,642.080135 C3711,642.080135 3711,267 3967,267 C4223,267 4227.28811,642.080135 4479,642.080135 L4479,642.080135 L4479,1021 L383,1021 L383,1021 Z" id="rood" fill-opacity="0.6" fill="#DD2430" style="mix-blend-mode: overlay;"></path>
                            <path d="M386,1306 L386,927.080135 C642,927.080135 642.46888,552 898,552 C1153.53112,552 1154,927.080135 1410,927.080135 C1666,927.080135 1666,552 1922,552 C2178,552 2182.28811,927.080135 2434,927.080135 C2690,927.080135 2690.46888,552 2946,552 C3201.53112,552 3202,927.080135 3458,927.080135 C3714,927.080135 3714,552 3970,552 C4226,552 4230.28811,927.080135 4482,927.080135 L4482,927.080135 L4482,1306 L386,1306 L386,1306 Z" id="blauw" fill="#A5DEFE" style="mix-blend-mode: multiply;"></path>
                        </g>
                    </g>
                </g>
            </g>
        </g>
    </g>
</svg>