<?xml version="1.0" encoding="UTF-8"?>
<svg width="32px" height="24px" viewBox="0 0 32 24" version="1.1" xmlns="http://www.w3.org/2000/svg" xmlns:xlink="http://www.w3.org/1999/xlink">
    <title>icon-menu</title>
    <g id="Paginas" stroke="none" stroke-width="1" fill="none" fill-rule="evenodd">
        <g id="Mobiel01" transform="translate(-317.000000, -29.000000)" fill="#FFFFFF">
            <path d="M347,49 C348.104569,49 349,49.8954305 349,51 C349,52.1045695 348.104569,53 347,53 L319,53 C317.895431,53 317,52.1045695 317,51 C317,49.8954305 317.895431,49 319,49 L347,49 Z M347,39 C348.104569,39 349,39.8954305 349,41 C349,42.1045695 348.104569,43 347,43 L319,43 C317.895431,43 317,42.1045695 317,41 C317,39.8954305 317.895431,39 319,39 L347,39 Z M347,29 C348.104569,29 349,29.8954305 349,31 C349,32.1045695 348.104569,33 347,33 L319,33 C317.895431,33 317,32.1045695 317,31 C317,29.8954305 317.895431,29 319,29 L347,29 Z" id="icon-menu"></path>
        </g>
    </g>
</svg>