<?xml version="1.0" encoding="UTF-8"?>
<svg width="1024px" height="730px" viewBox="0 0 1024 730" version="1.1" xmlns="http://www.w3.org/2000/svg" xmlns:xlink="http://www.w3.org/1999/xlink">
    <title>DexesWaveBovenSegment</title>
    <defs>
        <rect id="path-1" x="1.18234311e-11" y="0" width="1024" height="730"></rect>
        <rect id="path-3" x="1.13686838e-11" y="2.27373675e-13" width="2840" height="730"></rect>
    </defs>
    <g id="Golven" stroke="none" stroke-width="1" fill="none" fill-rule="evenodd">
        <g id="Dexes-Wave-Boven-en-Onder" transform="translate(-895.000000, -969.000000)">
            <g id="DexesWaveBovenSegment" transform="translate(895.000000, 969.000000)">
                <mask id="mask-2" fill="white">
                    <use xlink:href="#path-1"></use>
                </mask>
                <g id="Segmentmasker1024"></g>
                <g id="DexesWaveBoven" mask="url(#mask-2)">
                    <g transform="translate(648.000000, 365.000000) scale(1, -1) rotate(-360.000000) translate(-648.000000, -365.000000) translate(-772.000000, 0.000000)">
                        <mask id="mask-4" fill="white">
                            <use xlink:href="#path-3"></use>
                        </mask>
                        <g id="Rectangle" stroke="none" fill="none"></g>
                        <path d="M1433,25 C1689,25 1692.29682,706.51165 1944.00871,706.51165 L1944.00871,706.51165 L1944.00871,1395 L-103,1395 L-103,1395 L-103,706.51165 C153,706.51165 153.46888,25 409,25 C664.53112,25 665,706.51165 921,706.51165 C1177,706.51165 1177,25 1433,25 Z M3481,25 C3737,25 3741.28811,706.51165 3993,706.51165 L3993,706.51165 L3993,1395 L1944.00871,1395 C1944.66205,947.466667 1944.99525,718.10793 1945.00831,706.923789 L1945.00871,706.51165 C2201.00871,706.51165 2201.46888,25 2457,25 C2712.53112,25 2713,706.51165 2969,706.51165 C3225,706.51165 3225,25 3481,25 Z" id="rood" stroke="none" fill-opacity="0.5" fill="#FF2D55" fill-rule="evenodd" style="mix-blend-mode: overlay;" mask="url(#mask-4)"></path>
                        <path d="M-175,1695 L-175,1006.51165 C81,1006.51165 81.4688797,325 337,325 C592.53112,325 593,1006.51165 849,1006.51165 C1105,1006.51165 1105,325 1361,325 C1617,325 1621.28811,1006.51165 1873,1006.51165 C2129,1006.51165 2129.46888,325 2385,325 C2640.53112,325 2641,1006.51165 2897,1006.51165 C3153,1006.51165 3153,325 3409,325 C3665,325 3669.28811,1006.51165 3921,1006.51165 L3921,1006.51165 L3921,1695 L-175,1695 L-175,1695 Z" id="rood" stroke="none" fill="#FF2D55" fill-rule="evenodd" style="mix-blend-mode: overlay;" mask="url(#mask-4)"></path>
                        <path d="M-198,770 L-198,493.438187 C-72.56,493.438187 -8.47302199,421.062878 54.3317324,347.240063 L62.0197867,338.198123 C124.819946,264.375309 188.789751,192 314,192 C439.210249,192 503.180054,264.375309 565.980213,338.198123 L573.668268,347.240063 C636.473022,421.062878 700.56,493.438187 826,493.438187 C1082,493.438187 1082,192 1338,192 C1594,192 1598.28811,493.438187 1850,493.438187 C1975.44,493.438187 2039.52698,421.062878 2102.33173,347.240063 L2110.01979,338.198123 C2172.81995,264.375309 2236.78975,192 2362,192 C2487.21025,192 2551.18005,264.375309 2613.98021,338.198123 L2621.66827,347.240063 C2684.47302,421.062878 2748.56,493.438187 2874,493.438187 C3130,493.438187 3130,192 3386,192 C3642,192 3646.28811,493.438187 3898,493.438187 L3898,493.438187 L3898,770 L-198,770 L-198,770 Z" id="blauw" stroke="none" fill-opacity="0.4" fill="#4890DA" fill-rule="evenodd" style="mix-blend-mode: multiply;" mask="url(#mask-4)"></path>
                        <path d="M188,1084 L188,705.080135 C444,705.080135 444.46888,330 700,330 C955.53112,330 956,705.080135 1212,705.080135 C1468,705.080135 1468,330 1724,330 C1980,330 1984.28811,705.080135 2236,705.080135 C2492,705.080135 2492.46888,330 2748,330 C3003.53112,330 3004,705.080135 3260,705.080135 C3516,705.080135 3516,330 3772,330 C4028,330 4032.28811,705.080135 4284,705.080135 L4284,705.080135 L4284,1084 L188,1084 L188,1084 Z" id="blauw" stroke="none" fill="#A5DEFE" fill-rule="evenodd" style="mix-blend-mode: multiply;" mask="url(#mask-4)"></path>
                    </g>
                </g>
            </g>
        </g>
    </g>
</svg>