<?xml version="1.0"?>
<svg width="286" height="134" xmlns="http://www.w3.org/2000/svg" xmlns:svg="http://www.w3.org/2000/svg">
 <g class="layer">
  <title>Layer 1</title>
  <g fill="#02d35f" id="svg_6">
   <path d="m97.09,95.77l71.73,-79.13l19.09,1.85l-1.23,19.4l-70.5,78.5l0.3,-20.32l-19.39,-0.3z" fill="#4bb4e6" id="svg_7"/>
  </g>
 </g>
</svg>