<TICKER>;<PER>;<DATE>;<TIME>;<LAST>;<VOL>
MOEX.IBM-RM:FQBR;0;20210113;10:02:53;9457.000000000;1
MOEX.IBM-RM:FQBR;0;20210113;10:02:53;9457.000000000;2
MOEX.IBM-RM:FQBR;0;20210113;10:03:16;9457.000000000;1
MOEX.IBM-RM:FQBR;0;20210113;10:03:22;9457.000000000;6
MOEX.IBM-RM:FQBR;0;20210113;10:03:28;9457.000000000;6
MOEX.IBM-RM:FQBR;0;20210113;10:03:30;9457.000000000;2
MOEX.IBM-RM:FQBR;0;20210113;10:31:11;9549.000000000;1
MOEX.IBM-RM:FQBR;0;20210113;10:31:11;9550.000000000;10
MOEX.IBM-RM:FQBR;0;20210113;10:31:12;9550.000000000;1
MOEX.IBM-RM:FQBR;0;20210113;10:31:48;9543.000000000;1
MOEX.IBM-RM:FQBR;0;20210113;10:36:01;9543.000000000;1
MOEX.IBM-RM:FQBR;0;20210113;10:43:10;9553.000000000;1
MOEX.IBM-RM:FQBR;0;20210113;10:49:09;9547.000000000;8
MOEX.IBM-RM:FQBR;0;20210113;10:49:17;9543.000000000;1
MOEX.IBM-RM:FQBR;0;20210113;10:51:22;9543.000000000;4
MOEX.IBM-RM:FQBR;0;20210113;10:52:05;9543.000000000;1
MOEX.IBM-RM:FQBR;0;20210113;11:08:54;9543.000000000;1
MOEX.IBM-RM:FQBR;0;20210113;11:16:32;9543.000000000;1
MOEX.IBM-RM:FQBR;0;20210113;11:16:32;9543.000000000;4
MOEX.IBM-RM:FQBR;0;20210113;11:19:49;9543.000000000;1
MOEX.IBM-RM:FQBR;0;20210113;11:30:50;9543.000000000;5
MOEX.IBM-RM:FQBR;0;20210113;12:01:25;9544.000000000;1
MOEX.IBM-RM:FQBR;0;20210113;12:40:03;9561.000000000;1
MOEX.IBM-RM:FQBR;0;20210113;12:47:27;9561.000000000;5
MOEX.IBM-RM:FQBR;0;20210113;12:47:35;9561.000000000;15
MOEX.IBM-RM:FQBR;0;20210113;12:51:12;9579.000000000;1
MOEX.IBM-RM:FQBR;0;20210113;13:00:29;9579.000000000;2
MOEX.IBM-RM:FQBR;0;20210113;13:26:10;9579.000000000;1
MOEX.IBM-RM:FQBR;0;20210113;14:30:42;9581.000000000;2
MOEX.IBM-RM:FQBR;0;20210113;14:30:43;9580.000000000;1
MOEX.IBM-RM:FQBR;0;20210113;14:30:44;9579.000000000;1
MOEX.IBM-RM:FQBR;0;20210113;14:30:44;9579.000000000;1
MOEX.IBM-RM:FQBR;0;20210113;14:30:44;9579.000000000;2
MOEX.IBM-RM:FQBR;0;20210113;14:30:44;9579.000000000;1
MOEX.IBM-RM:FQBR;0;20210113;14:32:50;9560.000000000;2
MOEX.IBM-RM:FQBR;0;20210113;14:57:41;9545.000000000;2
MOEX.IBM-RM:FQBR;0;20210113;14:57:41;9544.000000000;1
MOEX.IBM-RM:FQBR;0;20210113;14:57:41;9544.000000000;9
MOEX.IBM-RM:FQBR;0;20210113;14:57:41;9544.000000000;1
MOEX.IBM-RM:FQBR;0;20210113;14:57:41;9544.000000000;1
MOEX.IBM-RM:FQBR;0;20210113;14:57:41;9544.000000000;2
MOEX.IBM-RM:FQBR;0;20210113;14:57:41;9544.000000000;2
MOEX.IBM-RM:FQBR;0;20210113;14:57:41;9544.000000000;2
MOEX.IBM-RM:FQBR;0;20210113;14:57:41;9543.000000000;10
MOEX.IBM-RM:FQBR;0;20210113;14:57:42;9543.000000000;4
MOEX.IBM-RM:FQBR;0;20210113;14:57:42;9543.000000000;2
MOEX.IBM-RM:FQBR;0;20210113;14:57:42;9543.000000000;4
MOEX.IBM-RM:FQBR;0;20210113;14:57:42;9543.000000000;10
MOEX.IBM-RM:FQBR;0;20210113;14:57:42;9543.000000000;2
MOEX.IBM-RM:FQBR;0;20210113;14:57:42;9543.000000000;3
MOEX.IBM-RM:FQBR;0;20210113;14:57:47;9540.000000000;1
MOEX.IBM-RM:FQBR;0;20210113;14:59:21;9540.000000000;1
MOEX.IBM-RM:FQBR;0;20210113;15:15:03;9569.000000000;1
MOEX.IBM-RM:FQBR;0;20210113;15:17:47;9569.000000000;1
MOEX.IBM-RM:FQBR;0;20210113;15:28:37;9562.000000000;2
MOEX.IBM-RM:FQBR;0;20210113;15:28:37;9563.000000000;3
MOEX.IBM-RM:FQBR;0;20210113;15:29:02;9564.000000000;3
MOEX.IBM-RM:FQBR;0;20210113;15:32:07;9564.000000000;10
MOEX.IBM-RM:FQBR;0;20210113;15:33:46;9541.000000000;1
MOEX.IBM-RM:FQBR;0;20210113;16:03:49;9542.000000000;2
MOEX.IBM-RM:FQBR;0;20210113;16:06:09;9542.000000000;1
MOEX.IBM-RM:FQBR;0;20210113;16:06:09;9541.000000000;2
MOEX.IBM-RM:FQBR;0;20210113;16:06:09;9541.000000000;10
MOEX.IBM-RM:FQBR;0;20210113;16:23:46;9541.000000000;1
MOEX.IBM-RM:FQBR;0;20210113;16:23:46;9541.000000000;1
MOEX.IBM-RM:FQBR;0;20210113;16:26:48;9555.000000000;1
MOEX.IBM-RM:FQBR;0;20210113;16:28:04;9555.000000000;1
MOEX.IBM-RM:FQBR;0;20210113;16:46:24;9519.000000000;1
MOEX.IBM-RM:FQBR;0;20210113;16:47:01;9517.000000000;1
MOEX.IBM-RM:FQBR;0;20210113;16:55:07;9517.000000000;2
MOEX.IBM-RM:FQBR;0;20210113;16:58:32;9517.000000000;80
MOEX.IBM-RM:FQBR;0;20210113;16:58:32;9517.000000000;20
MOEX.IBM-RM:FQBR;0;20210113;17:05:37;9517.000000000;1
MOEX.IBM-RM:FQBR;0;20210113;17:32:12;9552.000000000;1
MOEX.IBM-RM:FQBR;0;20210113;17:32:13;9552.000000000;1
MOEX.IBM-RM:FQBR;0;20210113;17:37:22;9543.000000000;3
MOEX.IBM-RM:FQBR;0;20210113;17:37:22;9543.000000000;3
MOEX.IBM-RM:FQBR;0;20210113;17:41:53;9542.000000000;1
MOEX.IBM-RM:FQBR;0;20210113;17:43:35;9542.000000000;13
MOEX.IBM-RM:FQBR;0;20210113;17:46:42;9522.000000000;1
MOEX.IBM-RM:FQBR;0;20210113;17:48:39;9521.000000000;14
MOEX.IBM-RM:FQBR;0;20210113;17:48:39;9520.000000000;2
MOEX.IBM-RM:FQBR;0;20210113;17:49:41;9520.000000000;1
MOEX.IBM-RM:FQBR;0;20210113;17:50:02;9517.000000000;1
MOEX.IBM-RM:FQBR;0;20210113;17:50:02;9517.000000000;1
MOEX.IBM-RM:FQBR;0;20210113;17:50:10;9511.000000000;2
MOEX.IBM-RM:FQBR;0;20210113;17:50:10;9510.000000000;5
MOEX.IBM-RM:FQBR;0;20210113;17:50:16;9509.000000000;1
MOEX.IBM-RM:FQBR;0;20210113;17:50:59;9500.000000000;1
MOEX.IBM-RM:FQBR;0;20210113;17:51:25;9495.000000000;1
MOEX.IBM-RM:FQBR;0;20210113;17:53:53;9485.000000000;6
MOEX.IBM-RM:FQBR;0;20210113;17:58:39;9490.000000000;1
MOEX.IBM-RM:FQBR;0;20210113;18:03:14;9490.000000000;1
MOEX.IBM-RM:FQBR;0;20210113;18:13:20;9460.000000000;1
MOEX.IBM-RM:FQBR;0;20210113;18:13:20;9460.000000000;1
MOEX.IBM-RM:FQBR;0;20210113;18:14:02;9457.000000000;3
MOEX.IBM-RM:FQBR;0;20210113;18:14:02;9457.000000000;1
MOEX.IBM-RM:FQBR;0;20210113;18:14:02;9457.000000000;2
MOEX.IBM-RM:FQBR;0;20210113;18:14:02;9457.000000000;1
MOEX.IBM-RM:FQBR;0;20210113;18:14:02;9457.000000000;1
MOEX.IBM-RM:FQBR;0;20210113;18:14:30;9450.000000000;2
MOEX.IBM-RM:FQBR;0;20210113;18:15:45;9450.000000000;9
MOEX.IBM-RM:FQBR;0;20210113;18:18:03;9435.000000000;5
MOEX.IBM-RM:FQBR;0;20210113;18:46:48;9435.000000000;1
MOEX.IBM-RM:FQBR;0;20210113;18:46:48;9435.000000000;2
MOEX.IBM-RM:FQBR;0;20210113;18:46:48;9435.000000000;1
MOEX.IBM-RM:FQBR;0;20210113;18:47:01;9430.000000000;5
MOEX.IBM-RM:FQBR;0;20210113;18:50:55;9411.000000000;1
MOEX.IBM-RM:FQBR;0;20210113;18:52:33;9400.000000000;1
MOEX.IBM-RM:FQBR;0;20210113;18:55:11;9410.000000000;1
MOEX.IBM-RM:FQBR;0;20210113;18:57:54;9410.000000000;1
MOEX.IBM-RM:FQBR;0;20210113;18:57:54;9410.000000000;1
MOEX.IBM-RM:FQBR;0;20210113;19:08:56;9423.000000000;1
MOEX.IBM-RM:FQBR;0;20210113;19:13:37;9423.000000000;1
MOEX.IBM-RM:FQBR;0;20210113;19:21:42;9430.000000000;1
MOEX.IBM-RM:FQBR;0;20210113;19:25:00;9423.000000000;1
MOEX.IBM-RM:FQBR;0;20210113;19:25:00;9423.000000000;1
MOEX.IBM-RM:FQBR;0;20210113;19:26:27;9429.000000000;1
MOEX.IBM-RM:FQBR;0;20210113;19:29:28;9422.000000000;2
MOEX.IBM-RM:FQBR;0;20210113;19:29:28;9409.000000000;1
MOEX.IBM-RM:FQBR;0;20210113;20:01:02;9409.000000000;1
MOEX.IBM-RM:FQBR;0;20210113;20:01:02;9409.000000000;1
MOEX.IBM-RM:FQBR;0;20210113;20:01:02;9409.000000000;10
MOEX.IBM-RM:FQBR;0;20210113;20:01:02;9409.000000000;1
MOEX.IBM-RM:FQBR;0;20210113;20:08:48;9401.000000000;1
MOEX.IBM-RM:FQBR;0;20210113;20:08:49;9400.000000000;1
MOEX.IBM-RM:FQBR;0;20210113;20:08:49;9400.000000000;1
MOEX.IBM-RM:FQBR;0;20210113;20:08:49;9400.000000000;1
MOEX.IBM-RM:FQBR;0;20210113;20:08:49;9400.000000000;1
MOEX.IBM-RM:FQBR;0;20210113;20:08:49;9400.000000000;1
MOEX.IBM-RM:FQBR;0;20210113;20:08:49;9400.000000000;5
MOEX.IBM-RM:FQBR;0;20210113;20:08:49;9400.000000000;1
MOEX.IBM-RM:FQBR;0;20210113;20:09:01;9398.000000000;5
MOEX.IBM-RM:FQBR;0;20210113;20:09:22;9395.000000000;1
MOEX.IBM-RM:FQBR;0;20210113;20:09:39;9395.000000000;1
MOEX.IBM-RM:FQBR;0;20210113;20:11:04;9390.000000000;2
MOEX.IBM-RM:FQBR;0;20210113;20:40:40;9406.000000000;11
MOEX.IBM-RM:FQBR;0;20210113;21:00:08;9406.000000000;3
MOEX.IBM-RM:FQBR;0;20210113;21:00:08;9406.000000000;1
MOEX.IBM-RM:FQBR;0;20210113;21:01:31;9400.000000000;2
MOEX.IBM-RM:FQBR;0;20210113;21:02:32;9390.000000000;1
MOEX.IBM-RM:FQBR;0;20210113;21:02:32;9390.000000000;1
MOEX.IBM-RM:FQBR;0;20210113;21:02:32;9390.000000000;1
MOEX.IBM-RM:FQBR;0;20210113;21:02:32;9390.000000000;1
MOEX.IBM-RM:FQBR;0;20210113;21:02:32;9390.000000000;25
MOEX.IBM-RM:FQBR;0;20210113;21:03:09;9385.000000000;5
MOEX.IBM-RM:FQBR;0;20210113;21:03:27;9382.000000000;1
MOEX.IBM-RM:FQBR;0;20210113;21:03:28;9380.000000000;1
MOEX.IBM-RM:FQBR;0;20210113;21:09:28;9380.000000000;5
MOEX.IBM-RM:FQBR;0;20210113;21:09:28;9380.000000000;2
MOEX.IBM-RM:FQBR;0;20210113;21:10:11;9384.000000000;1
MOEX.IBM-RM:FQBR;0;20210113;21:10:53;9380.000000000;1
MOEX.IBM-RM:FQBR;0;20210113;21:20:49;9370.000000000;1
MOEX.IBM-RM:FQBR;0;20210113;21:36:39;9370.000000000;1
MOEX.IBM-RM:FQBR;0;20210113;21:36:39;9370.000000000;1
MOEX.IBM-RM:FQBR;0;20210113;21:36:39;9370.000000000;1
MOEX.IBM-RM:FQBR;0;20210113;21:36:39;9370.000000000;1
MOEX.IBM-RM:FQBR;0;20210113;21:36:39;9370.000000000;10
MOEX.IBM-RM:FQBR;0;20210113;21:40:40;9370.000000000;3
MOEX.IBM-RM:FQBR;0;20210113;21:49:18;9370.000000000;1
MOEX.IBM-RM:FQBR;0;20210113;21:55:30;9360.000000000;3
MOEX.IBM-RM:FQBR;0;20210113;21:55:31;9360.000000000;5
MOEX.IBM-RM:FQBR;0;20210113;22:00:51;9360.000000000;1
MOEX.IBM-RM:FQBR;0;20210113;22:01:02;9357.000000000;2
MOEX.IBM-RM:FQBR;0;20210113;22:05:56;9355.000000000;1
MOEX.IBM-RM:FQBR;0;20210113;22:12:35;9355.000000000;5
MOEX.IBM-RM:FQBR;0;20210113;22:36:23;9368.000000000;2
MOEX.IBM-RM:FQBR;0;20210113;22:39:14;9374.000000000;1
MOEX.IBM-RM:FQBR;0;20210113;22:41:01;9368.000000000;1
MOEX.IBM-RM:FQBR;0;20210113;22:41:26;9368.000000000;1
MOEX.IBM-RM:FQBR;0;20210113;22:44:28;9360.000000000;1
MOEX.IBM-RM:FQBR;0;20210113;22:58:33;9362.000000000;6
MOEX.IBM-RM:FQBR;0;20210113;23:01:25;9372.000000000;1
MOEX.IBM-RM:FQBR;0;20210113;23:03:38;9364.000000000;1
MOEX.IBM-RM:FQBR;0;20210113;23:04:16;9365.000000000;1
MOEX.IBM-RM:FQBR;0;20210113;23:04:27;9365.000000000;1
MOEX.IBM-RM:FQBR;0;20210113;23:06:21;9365.000000000;1
MOEX.IBM-RM:FQBR;0;20210113;23:07:27;9365.000000000;1
MOEX.IBM-RM:FQBR;0;20210113;23:07:33;9365.000000000;1
MOEX.IBM-RM:FQBR;0;20210113;23:08:19;9364.000000000;11
MOEX.IBM-RM:FQBR;0;20210113;23:14:55;9363.000000000;1
MOEX.IBM-RM:FQBR;0;20210113;23:15:58;9363.000000000;13
MOEX.IBM-RM:FQBR;0;20210113;23:16:21;9360.000000000;10
MOEX.IBM-RM:FQBR;0;20210113;23:16:21;9360.000000000;2
MOEX.IBM-RM:FQBR;0;20210113;23:16:31;9355.000000000;1
MOEX.IBM-RM:FQBR;0;20210113;23:16:31;9355.000000000;1
MOEX.IBM-RM:FQBR;0;20210113;23:16:31;9355.000000000;1
MOEX.IBM-RM:FQBR;0;20210113;23:16:31;9355.000000000;3
MOEX.IBM-RM:FQBR;0;20210113;23:16:31;9355.000000000;9
MOEX.IBM-RM:FQBR;0;20210113;23:17:22;9350.000000000;2
MOEX.IBM-RM:FQBR;0;20210113;23:17:22;9349.000000000;1
MOEX.IBM-RM:FQBR;0;20210113;23:19:56;9345.000000000;1
MOEX.IBM-RM:FQBR;0;20210113;23:20:01;9345.000000000;1
MOEX.IBM-RM:FQBR;0;20210113;23:23:06;9345.000000000;1
MOEX.IBM-RM:FQBR;0;20210113;23:23:23;9345.000000000;1
MOEX.IBM-RM:FQBR;0;20210113;23:46:02;9366.000000000;1
MOEX.IBM-RM:FQBR;0;20210113;23:46:36;9368.000000000;1
MOEX.IBM-RM:FQBR;0;20210113;23:47:53;9366.000000000;2
