<TICKER>;<PER>;<DATE>;<TIME>;<LAST>;<VOL>
MOEX.CSCO-RM:FQBR;0;20210113;09:59:56;3500.000000000;1
MOEX.CSCO-RM:FQBR;0;20210113;10:00:35;3500.000000000;8
MOEX.CSCO-RM:FQBR;0;20210113;10:01:17;3371.000000000;1
MOEX.CSCO-RM:FQBR;0;20210113;10:09:59;3364.000000000;1
MOEX.CSCO-RM:FQBR;0;20210113;10:10:03;3363.000000000;3
MOEX.CSCO-RM:FQBR;0;20210113;10:14:56;3358.000000000;1
MOEX.CSCO-RM:FQBR;0;20210113;10:18:41;3358.000000000;1
MOEX.CSCO-RM:FQBR;0;20210113;10:19:31;3351.000000000;1
MOEX.CSCO-RM:FQBR;0;20210113;10:21:12;3351.000000000;1
MOEX.CSCO-RM:FQBR;0;20210113;10:21:35;3351.000000000;1
MOEX.CSCO-RM:FQBR;0;20210113;10:24:22;3353.000000000;1
MOEX.CSCO-RM:FQBR;0;20210113;10:24:22;3352.000000000;1
MOEX.CSCO-RM:FQBR;0;20210113;10:29:52;3363.000000000;1
MOEX.CSCO-RM:FQBR;0;20210113;10:32:01;3353.000000000;1
MOEX.CSCO-RM:FQBR;0;20210113;10:33:59;3353.000000000;1
MOEX.CSCO-RM:FQBR;0;20210113;10:34:51;3353.000000000;1
MOEX.CSCO-RM:FQBR;0;20210113;10:38:08;3353.000000000;1
MOEX.CSCO-RM:FQBR;0;20210113;10:39:43;3352.000000000;2
MOEX.CSCO-RM:FQBR;0;20210113;10:43:56;3353.000000000;1
MOEX.CSCO-RM:FQBR;0;20210113;10:46:01;3354.000000000;3
MOEX.CSCO-RM:FQBR;0;20210113;10:46:01;3353.000000000;2
MOEX.CSCO-RM:FQBR;0;20210113;11:06:37;3369.000000000;1
MOEX.CSCO-RM:FQBR;0;20210113;11:13:18;3365.000000000;1
MOEX.CSCO-RM:FQBR;0;20210113;11:19:53;3364.000000000;1
MOEX.CSCO-RM:FQBR;0;20210113;11:21:21;3368.000000000;20
MOEX.CSCO-RM:FQBR;0;20210113;11:27:14;3368.000000000;2
MOEX.CSCO-RM:FQBR;0;20210113;11:38:43;3365.000000000;1
MOEX.CSCO-RM:FQBR;0;20210113;11:38:43;3368.000000000;1
MOEX.CSCO-RM:FQBR;0;20210113;11:41:16;3368.000000000;3
MOEX.CSCO-RM:FQBR;0;20210113;11:48:55;3368.000000000;1
MOEX.CSCO-RM:FQBR;0;20210113;11:58:57;3368.000000000;1
MOEX.CSCO-RM:FQBR;0;20210113;12:00:01;3368.000000000;1
MOEX.CSCO-RM:FQBR;0;20210113;12:00:01;3368.000000000;8
MOEX.CSCO-RM:FQBR;0;20210113;12:00:01;3368.000000000;2
MOEX.CSCO-RM:FQBR;0;20210113;12:14:42;3370.000000000;2
MOEX.CSCO-RM:FQBR;0;20210113;12:26:52;3372.000000000;4
MOEX.CSCO-RM:FQBR;0;20210113;12:33:57;3371.000000000;1
MOEX.CSCO-RM:FQBR;0;20210113;12:42:05;3371.000000000;1
MOEX.CSCO-RM:FQBR;0;20210113;13:19:57;3378.000000000;1
MOEX.CSCO-RM:FQBR;0;20210113;13:19:57;3374.000000000;2
MOEX.CSCO-RM:FQBR;0;20210113;13:19:57;3372.000000000;2
MOEX.CSCO-RM:FQBR;0;20210113;13:19:57;3372.000000000;4
MOEX.CSCO-RM:FQBR;0;20210113;13:21:43;3373.000000000;10
MOEX.CSCO-RM:FQBR;0;20210113;13:25:38;3390.000000000;1
MOEX.CSCO-RM:FQBR;0;20210113;13:25:41;3388.000000000;1
MOEX.CSCO-RM:FQBR;0;20210113;13:28:02;3387.000000000;1
MOEX.CSCO-RM:FQBR;0;20210113;13:34:35;3387.000000000;1
MOEX.CSCO-RM:FQBR;0;20210113;13:34:35;3387.000000000;2
MOEX.CSCO-RM:FQBR;0;20210113;13:35:39;3387.000000000;1
MOEX.CSCO-RM:FQBR;0;20210113;13:36:49;3387.000000000;2
MOEX.CSCO-RM:FQBR;0;20210113;13:39:17;3387.000000000;1
MOEX.CSCO-RM:FQBR;0;20210113;13:42:40;3387.000000000;1
MOEX.CSCO-RM:FQBR;0;20210113;14:22:37;3388.000000000;1
MOEX.CSCO-RM:FQBR;0;20210113;14:25:06;3388.000000000;4
MOEX.CSCO-RM:FQBR;0;20210113;14:25:48;3387.000000000;1
MOEX.CSCO-RM:FQBR;0;20210113;14:25:48;3387.000000000;8
MOEX.CSCO-RM:FQBR;0;20210113;14:25:48;3387.000000000;1
MOEX.CSCO-RM:FQBR;0;20210113;14:32:06;3387.000000000;1
MOEX.CSCO-RM:FQBR;0;20210113;14:32:06;3387.000000000;7
MOEX.CSCO-RM:FQBR;0;20210113;14:32:06;3387.000000000;2
MOEX.CSCO-RM:FQBR;0;20210113;14:46:44;3388.000000000;3
MOEX.CSCO-RM:FQBR;0;20210113;15:03:08;3380.000000000;4
MOEX.CSCO-RM:FQBR;0;20210113;15:03:08;3380.000000000;1
MOEX.CSCO-RM:FQBR;0;20210113;15:04:18;3379.000000000;7
MOEX.CSCO-RM:FQBR;0;20210113;15:04:18;3379.000000000;3
MOEX.CSCO-RM:FQBR;0;20210113;15:04:19;3373.000000000;1
MOEX.CSCO-RM:FQBR;0;20210113;15:06:12;3371.000000000;8
MOEX.CSCO-RM:FQBR;0;20210113;15:06:12;3371.000000000;7
MOEX.CSCO-RM:FQBR;0;20210113;15:06:12;3371.000000000;3
MOEX.CSCO-RM:FQBR;0;20210113;15:06:12;3371.000000000;1
MOEX.CSCO-RM:FQBR;0;20210113;15:06:12;3371.000000000;3
MOEX.CSCO-RM:FQBR;0;20210113;15:06:12;3371.000000000;1
MOEX.CSCO-RM:FQBR;0;20210113;15:09:48;3371.000000000;1
MOEX.CSCO-RM:FQBR;0;20210113;15:18:12;3371.000000000;1
MOEX.CSCO-RM:FQBR;0;20210113;15:18:12;3371.000000000;2
MOEX.CSCO-RM:FQBR;0;20210113;15:18:12;3370.000000000;1
MOEX.CSCO-RM:FQBR;0;20210113;15:24:15;3370.000000000;2
MOEX.CSCO-RM:FQBR;0;20210113;15:33:39;3369.000000000;2
MOEX.CSCO-RM:FQBR;0;20210113;15:34:42;3369.000000000;1
MOEX.CSCO-RM:FQBR;0;20210113;15:36:45;3369.000000000;1
MOEX.CSCO-RM:FQBR;0;20210113;16:01:28;3369.000000000;2
MOEX.CSCO-RM:FQBR;0;20210113;16:01:28;3369.000000000;1
MOEX.CSCO-RM:FQBR;0;20210113;16:01:28;3369.000000000;17
MOEX.CSCO-RM:FQBR;0;20210113;16:01:29;3369.000000000;3
MOEX.CSCO-RM:FQBR;0;20210113;16:08:05;3362.000000000;1
MOEX.CSCO-RM:FQBR;0;20210113;16:08:05;3362.000000000;1
MOEX.CSCO-RM:FQBR;0;20210113;16:18:46;3353.000000000;2
MOEX.CSCO-RM:FQBR;0;20210113;16:18:46;3353.000000000;1
MOEX.CSCO-RM:FQBR;0;20210113;16:18:46;3353.000000000;1
MOEX.CSCO-RM:FQBR;0;20210113;16:18:46;3353.000000000;1
MOEX.CSCO-RM:FQBR;0;20210113;16:21:40;3352.000000000;1
MOEX.CSCO-RM:FQBR;0;20210113;16:21:41;3351.000000000;4
MOEX.CSCO-RM:FQBR;0;20210113;16:33:13;3351.000000000;1
MOEX.CSCO-RM:FQBR;0;20210113;16:33:13;3351.000000000;2
MOEX.CSCO-RM:FQBR;0;20210113;16:39:16;3350.000000000;1
MOEX.CSCO-RM:FQBR;0;20210113;16:39:17;3350.000000000;1
MOEX.CSCO-RM:FQBR;0;20210113;16:39:17;3340.000000000;1
MOEX.CSCO-RM:FQBR;0;20210113;16:39:17;3338.000000000;2
MOEX.CSCO-RM:FQBR;0;20210113;16:39:19;3349.000000000;3
MOEX.CSCO-RM:FQBR;0;20210113;16:45:08;3354.000000000;2
MOEX.CSCO-RM:FQBR;0;20210113;16:46:05;3349.000000000;2
MOEX.CSCO-RM:FQBR;0;20210113;16:50:02;3349.000000000;3
MOEX.CSCO-RM:FQBR;0;20210113;17:01:47;3333.000000000;1
MOEX.CSCO-RM:FQBR;0;20210113;17:04:07;3333.000000000;2
MOEX.CSCO-RM:FQBR;0;20210113;17:05:17;3333.000000000;1
MOEX.CSCO-RM:FQBR;0;20210113;17:05:41;3330.000000000;1
MOEX.CSCO-RM:FQBR;0;20210113;17:12:06;3337.000000000;129
MOEX.CSCO-RM:FQBR;0;20210113;17:30:02;3345.000000000;6
MOEX.CSCO-RM:FQBR;0;20210113;17:30:06;3352.000000000;3
MOEX.CSCO-RM:FQBR;0;20210113;17:37:20;3370.000000000;7
MOEX.CSCO-RM:FQBR;0;20210113;17:37:20;3370.000000000;3
MOEX.CSCO-RM:FQBR;0;20210113;17:37:26;3370.000000000;7
MOEX.CSCO-RM:FQBR;0;20210113;17:37:26;3370.000000000;2
MOEX.CSCO-RM:FQBR;0;20210113;17:40:23;3370.000000000;1
MOEX.CSCO-RM:FQBR;0;20210113;17:40:25;3370.000000000;1
MOEX.CSCO-RM:FQBR;0;20210113;17:42:11;3369.000000000;1
MOEX.CSCO-RM:FQBR;0;20210113;17:42:52;3370.000000000;2
MOEX.CSCO-RM:FQBR;0;20210113;17:42:52;3370.000000000;1
MOEX.CSCO-RM:FQBR;0;20210113;17:46:31;3371.000000000;1
MOEX.CSCO-RM:FQBR;0;20210113;18:04:03;3386.000000000;20
MOEX.CSCO-RM:FQBR;0;20210113;18:04:04;3386.000000000;3
MOEX.CSCO-RM:FQBR;0;20210113;18:04:51;3386.000000000;77
MOEX.CSCO-RM:FQBR;0;20210113;18:08:20;3375.000000000;1
MOEX.CSCO-RM:FQBR;0;20210113;18:17:55;3371.000000000;1
MOEX.CSCO-RM:FQBR;0;20210113;18:18:39;3371.000000000;15
MOEX.CSCO-RM:FQBR;0;20210113;18:25:42;3371.000000000;2
MOEX.CSCO-RM:FQBR;0;20210113;18:56:37;3371.000000000;1
MOEX.CSCO-RM:FQBR;0;20210113;19:08:28;3371.000000000;2
MOEX.CSCO-RM:FQBR;0;20210113;19:11:07;3370.000000000;5
MOEX.CSCO-RM:FQBR;0;20210113;19:16:19;3370.000000000;2
MOEX.CSCO-RM:FQBR;0;20210113;19:18:28;3369.000000000;4
MOEX.CSCO-RM:FQBR;0;20210113;19:27:25;3375.000000000;2
MOEX.CSCO-RM:FQBR;0;20210113;19:29:12;3373.000000000;1
MOEX.CSCO-RM:FQBR;0;20210113;19:29:12;3375.000000000;3
MOEX.CSCO-RM:FQBR;0;20210113;19:31:04;3375.000000000;1
MOEX.CSCO-RM:FQBR;0;20210113;19:38:07;3377.000000000;1
MOEX.CSCO-RM:FQBR;0;20210113;19:47:41;3375.000000000;1
MOEX.CSCO-RM:FQBR;0;20210113;19:48:40;3377.000000000;1
MOEX.CSCO-RM:FQBR;0;20210113;19:51:57;3375.000000000;1
MOEX.CSCO-RM:FQBR;0;20210113;19:58:41;3377.000000000;1
MOEX.CSCO-RM:FQBR;0;20210113;20:02:58;3372.000000000;1
MOEX.CSCO-RM:FQBR;0;20210113;20:13:30;3367.000000000;3
MOEX.CSCO-RM:FQBR;0;20210113;20:46:58;3367.000000000;1
MOEX.CSCO-RM:FQBR;0;20210113;20:51:18;3367.000000000;1
MOEX.CSCO-RM:FQBR;0;20210113;20:55:52;3367.000000000;3
MOEX.CSCO-RM:FQBR;0;20210113;20:58:40;3367.000000000;2
MOEX.CSCO-RM:FQBR;0;20210113;21:01:19;3362.000000000;1
MOEX.CSCO-RM:FQBR;0;20210113;21:16:33;3361.000000000;1
MOEX.CSCO-RM:FQBR;0;20210113;21:16:33;3362.000000000;1
MOEX.CSCO-RM:FQBR;0;20210113;21:20:33;3361.000000000;1
MOEX.CSCO-RM:FQBR;0;20210113;21:21:59;3361.000000000;2
MOEX.CSCO-RM:FQBR;0;20210113;21:26:00;3361.000000000;1
MOEX.CSCO-RM:FQBR;0;20210113;21:26:00;3361.000000000;9
MOEX.CSCO-RM:FQBR;0;20210113;21:38:52;3361.000000000;1
MOEX.CSCO-RM:FQBR;0;20210113;21:39:23;3357.000000000;1
MOEX.CSCO-RM:FQBR;0;20210113;21:40:00;3354.000000000;1
MOEX.CSCO-RM:FQBR;0;20210113;21:40:56;3353.000000000;5
MOEX.CSCO-RM:FQBR;0;20210113;21:41:12;3352.000000000;10
MOEX.CSCO-RM:FQBR;0;20210113;21:43:06;3350.000000000;1
MOEX.CSCO-RM:FQBR;0;20210113;21:46:41;3347.000000000;1
MOEX.CSCO-RM:FQBR;0;20210113;22:00:17;3350.000000000;2
MOEX.CSCO-RM:FQBR;0;20210113;22:15:31;3351.000000000;1
MOEX.CSCO-RM:FQBR;0;20210113;22:17:50;3352.000000000;1
MOEX.CSCO-RM:FQBR;0;20210113;22:17:58;3350.000000000;1
MOEX.CSCO-RM:FQBR;0;20210113;22:17:58;3350.000000000;1
MOEX.CSCO-RM:FQBR;0;20210113;22:17:58;3350.000000000;3
MOEX.CSCO-RM:FQBR;0;20210113;22:17:58;3350.000000000;1
MOEX.CSCO-RM:FQBR;0;20210113;22:17:58;3347.000000000;4
MOEX.CSCO-RM:FQBR;0;20210113;22:22:50;3352.000000000;1
MOEX.CSCO-RM:FQBR;0;20210113;22:24:36;3352.000000000;3
MOEX.CSCO-RM:FQBR;0;20210113;22:24:37;3352.000000000;5
MOEX.CSCO-RM:FQBR;0;20210113;22:41:55;3349.000000000;1
MOEX.CSCO-RM:FQBR;0;20210113;22:45:30;3347.000000000;1
MOEX.CSCO-RM:FQBR;0;20210113;22:45:30;3347.000000000;1
MOEX.CSCO-RM:FQBR;0;20210113;22:45:30;3347.000000000;2
MOEX.CSCO-RM:FQBR;0;20210113;22:49:28;3347.000000000;1
MOEX.CSCO-RM:FQBR;0;20210113;22:52:16;3344.000000000;1
MOEX.CSCO-RM:FQBR;0;20210113;23:01:53;3343.000000000;1
MOEX.CSCO-RM:FQBR;0;20210113;23:01:54;3344.000000000;50
MOEX.CSCO-RM:FQBR;0;20210113;23:01:55;3344.000000000;38
MOEX.CSCO-RM:FQBR;0;20210113;23:02:11;3344.000000000;11
MOEX.CSCO-RM:FQBR;0;20210113;23:11:19;3341.000000000;1
MOEX.CSCO-RM:FQBR;0;20210113;23:11:24;3340.000000000;4
MOEX.CSCO-RM:FQBR;0;20210113;23:16:28;3337.000000000;3
MOEX.CSCO-RM:FQBR;0;20210113;23:17:41;3339.000000000;1
MOEX.CSCO-RM:FQBR;0;20210113;23:20:36;3335.000000000;1
MOEX.CSCO-RM:FQBR;0;20210113;23:20:41;3334.000000000;1
MOEX.CSCO-RM:FQBR;0;20210113;23:40:32;3346.000000000;2
MOEX.CSCO-RM:FQBR;0;20210113;23:40:32;3346.000000000;8
