<TICKER>;<PER>;<DATE>;<TIME>;<LAST>;<VOL>
FB-RM;0;20210113;09:59:44;18338.000000000;1
FB-RM;0;20210113;09:59:44;18338.000000000;1
FB-RM;0;20210113;10:00:01;18474.000000000;1
FB-RM;0;20210113;10:00:01;18475.000000000;9
FB-RM;0;20210113;10:00:01;18475.000000000;4
FB-RM;0;20210113;10:00:01;18475.000000000;1
FB-RM;0;20210113;10:00:01;18475.000000000;6
FB-RM;0;20210113;10:00:01;18475.000000000;6
FB-RM;0;20210113;10:00:02;18475.000000000;6
FB-RM;0;20210113;10:00:02;18475.000000000;4
FB-RM;0;20210113;10:00:02;18475.000000000;6
FB-RM;0;20210113;10:00:08;18475.000000000;1
FB-RM;0;20210113;10:00:09;18475.000000000;10
FB-RM;0;20210113;10:00:09;18475.000000000;5
FB-RM;0;20210113;10:00:36;18475.000000000;1
FB-RM;0;20210113;10:00:36;18475.000000000;4
FB-RM;0;20210113;10:00:36;18475.000000000;1
FB-RM;0;20210113;10:00:36;18475.000000000;10
FB-RM;0;20210113;10:00:47;18475.000000000;1
FB-RM;0;20210113;10:01:22;18475.000000000;1
FB-RM;0;20210113;10:01:49;18475.000000000;2
FB-RM;0;20210113;10:01:56;18475.000000000;1
FB-RM;0;20210113;10:01:56;18475.000000000;1
FB-RM;0;20210113;10:01:56;18475.000000000;1
FB-RM;0;20210113;10:02:29;18475.000000000;1
FB-RM;0;20210113;10:02:29;18475.000000000;2
FB-RM;0;20210113;10:02:29;18475.000000000;8
FB-RM;0;20210113;10:02:29;18475.000000000;4
FB-RM;0;20210113;10:02:47;18475.000000000;1
FB-RM;0;20210113;10:02:52;18475.000000000;1
FB-RM;0;20210113;10:03:00;18475.000000000;1
FB-RM;0;20210113;10:03:24;18475.000000000;4
FB-RM;0;20210113;10:03:26;18475.000000000;1
FB-RM;0;20210113;10:03:41;18475.000000000;1
FB-RM;0;20210113;10:03:44;18475.000000000;1
FB-RM;0;20210113;10:03:46;18475.000000000;1
FB-RM;0;20210113;10:04:06;18475.000000000;5
FB-RM;0;20210113;10:04:06;18475.000000000;4
FB-RM;0;20210113;10:04:06;18475.000000000;1
FB-RM;0;20210113;10:07:23;18550.000000000;1
FB-RM;0;20210113;10:07:46;18550.000000000;1
FB-RM;0;20210113;10:07:57;18550.000000000;1
FB-RM;0;20210113;10:08:28;18550.000000000;1
FB-RM;0;20210113;10:08:28;18550.000000000;1
FB-RM;0;20210113;10:08:55;18550.000000000;1
FB-RM;0;20210113;10:08:55;18550.000000000;1
FB-RM;0;20210113;10:08:56;18550.000000000;1
FB-RM;0;20210113;10:08:56;18550.000000000;1
FB-RM;0;20210113;10:09:01;18550.000000000;1
FB-RM;0;20210113;10:10:01;18572.000000000;1
FB-RM;0;20210113;10:10:35;18571.000000000;4
FB-RM;0;20210113;10:10:55;18570.000000000;1
FB-RM;0;20210113;10:11:14;18550.000000000;1
FB-RM;0;20210113;10:12:07;18550.000000000;3
FB-RM;0;20210113;10:12:59;18550.000000000;1
FB-RM;0;20210113;10:14:00;18550.000000000;1
FB-RM;0;20210113;10:14:41;18565.000000000;1
FB-RM;0;20210113;10:14:56;18564.000000000;4
FB-RM;0;20210113;10:14:56;18564.000000000;1
FB-RM;0;20210113;10:15:55;18564.000000000;1
FB-RM;0;20210113;10:17:00;18564.000000000;4
FB-RM;0;20210113;10:17:00;18564.000000000;1
FB-RM;0;20210113;10:17:11;18564.000000000;4
FB-RM;0;20210113;10:17:11;18564.000000000;4
FB-RM;0;20210113;10:17:39;18563.000000000;1
FB-RM;0;20210113;10:17:44;18562.000000000;1
FB-RM;0;20210113;10:22:44;18573.000000000;4
FB-RM;0;20210113;10:22:44;18573.000000000;5
FB-RM;0;20210113;10:22:44;18573.000000000;10
FB-RM;0;20210113;10:23:05;18573.000000000;1
FB-RM;0;20210113;10:24:03;18574.000000000;1
FB-RM;0;20210113;10:24:53;18574.000000000;4
FB-RM;0;20210113;10:24:53;18574.000000000;6
FB-RM;0;20210113;10:26:19;18612.000000000;1
FB-RM;0;20210113;10:26:34;18578.000000000;1
FB-RM;0;20210113;10:26:34;18578.000000000;1
FB-RM;0;20210113;10:27:19;18574.000000000;1
FB-RM;0;20210113;10:27:19;18574.000000000;1
FB-RM;0;20210113;10:27:20;18573.000000000;1
FB-RM;0;20210113;10:28:43;18573.000000000;1
FB-RM;0;20210113;10:28:43;18560.000000000;1
FB-RM;0;20210113;10:28:43;18501.000000000;7
FB-RM;0;20210113;10:29:01;18521.000000000;1
FB-RM;0;20210113;10:30:13;18573.000000000;1
FB-RM;0;20210113;10:30:33;18580.000000000;1
FB-RM;0;20210113;10:31:35;18531.000000000;4
FB-RM;0;20210113;10:31:35;18530.000000000;1
FB-RM;0;20210113;10:31:35;18523.000000000;1
FB-RM;0;20210113;10:31:35;18523.000000000;4
FB-RM;0;20210113;10:37:39;18582.000000000;1
FB-RM;0;20210113;10:37:41;18581.000000000;1
FB-RM;0;20210113;10:41:28;18596.000000000;1
FB-RM;0;20210113;10:41:38;18594.000000000;4
FB-RM;0;20210113;10:41:38;18594.000000000;2
FB-RM;0;20210113;10:42:39;18581.000000000;4
FB-RM;0;20210113;10:44:20;18579.000000000;4
FB-RM;0;20210113;10:44:20;18579.000000000;4
FB-RM;0;20210113;10:44:20;18580.000000000;1
FB-RM;0;20210113;10:44:20;18589.000000000;7
FB-RM;0;20210113;10:46:25;18589.000000000;1
FB-RM;0;20210113;10:46:51;18589.000000000;1
FB-RM;0;20210113;10:48:05;18589.000000000;1
FB-RM;0;20210113;10:54:46;18590.000000000;1
FB-RM;0;20210113;10:54:46;18590.000000000;1
FB-RM;0;20210113;10:54:46;18589.000000000;1
FB-RM;0;20210113;10:54:46;18589.000000000;1
FB-RM;0;20210113;10:55:02;18589.000000000;4
FB-RM;0;20210113;10:55:22;18589.000000000;2
FB-RM;0;20210113;10:55:27;18589.000000000;1
FB-RM;0;20210113;10:57:19;18619.000000000;1
FB-RM;0;20210113;11:01:02;18619.000000000;1
FB-RM;0;20210113;11:01:23;18635.000000000;1
FB-RM;0;20210113;11:01:59;18635.000000000;1
FB-RM;0;20210113;11:01:59;18640.000000000;1
FB-RM;0;20210113;11:04:00;18640.000000000;1
FB-RM;0;20210113;11:05:03;18651.000000000;1
FB-RM;0;20210113;11:06:14;18671.000000000;1
FB-RM;0;20210113;11:06:59;18651.000000000;1
FB-RM;0;20210113;11:10:02;18740.000000000;1
FB-RM;0;20210113;11:10:30;18737.000000000;1
FB-RM;0;20210113;11:10:45;18734.000000000;1
FB-RM;0;20210113;11:10:45;18734.000000000;1
FB-RM;0;20210113;11:10:58;18734.000000000;1
FB-RM;0;20210113;11:11:44;18730.000000000;1
FB-RM;0;20210113;11:11:45;18730.000000000;1
FB-RM;0;20210113;11:11:45;18730.000000000;1
FB-RM;0;20210113;11:12:43;18730.000000000;1
FB-RM;0;20210113;11:13:29;18730.000000000;1
FB-RM;0;20210113;11:14:07;18730.000000000;1
FB-RM;0;20210113;11:15:07;18730.000000000;1
FB-RM;0;20210113;11:15:07;18730.000000000;3
FB-RM;0;20210113;11:15:56;18730.000000000;1
FB-RM;0;20210113;11:17:41;18683.000000000;1
FB-RM;0;20210113;11:23:23;18720.000000000;4
FB-RM;0;20210113;11:23:23;18737.000000000;1
FB-RM;0;20210113;11:23:41;18733.000000000;1
FB-RM;0;20210113;11:27:23;18755.000000000;1
FB-RM;0;20210113;11:27:23;18755.000000000;4
FB-RM;0;20210113;11:27:23;18755.000000000;5
FB-RM;0;20210113;11:27:23;18755.000000000;4
FB-RM;0;20210113;11:27:23;18755.000000000;1
FB-RM;0;20210113;11:27:24;18750.000000000;4
FB-RM;0;20210113;11:27:25;18750.000000000;4
FB-RM;0;20210113;11:27:25;18750.000000000;2
FB-RM;0;20210113;11:28:38;18747.000000000;1
FB-RM;0;20210113;11:29:12;18733.000000000;1
FB-RM;0;20210113;11:34:00;18735.000000000;1
FB-RM;0;20210113;11:42:50;18737.000000000;1
FB-RM;0;20210113;11:43:01;18740.000000000;4
FB-RM;0;20210113;11:46:48;18740.000000000;20
FB-RM;0;20210113;11:49:02;18740.000000000;32
FB-RM;0;20210113;11:49:02;18740.000000000;1
FB-RM;0;20210113;11:49:02;18737.000000000;10
FB-RM;0;20210113;11:51:05;18735.000000000;29
FB-RM;0;20210113;11:51:05;18735.000000000;4
FB-RM;0;20210113;11:51:05;18735.000000000;1
FB-RM;0;20210113;11:51:05;18735.000000000;5
FB-RM;0;20210113;11:51:05;18735.000000000;1
FB-RM;0;20210113;11:51:05;18735.000000000;5
FB-RM;0;20210113;11:51:09;18754.000000000;1
FB-RM;0;20210113;11:51:09;18755.000000000;1
FB-RM;0;20210113;11:51:27;18754.000000000;1
FB-RM;0;20210113;11:52:10;18751.000000000;1
FB-RM;0;20210113;11:52:15;18750.000000000;2
FB-RM;0;20210113;11:53:20;18733.000000000;1
FB-RM;0;20210113;11:53:20;18733.000000000;1
FB-RM;0;20210113;11:53:20;18733.000000000;2
FB-RM;0;20210113;11:53:20;18733.000000000;4
FB-RM;0;20210113;11:53:21;18733.000000000;1
FB-RM;0;20210113;11:53:21;18733.000000000;1
FB-RM;0;20210113;11:53:35;18730.000000000;1
FB-RM;0;20210113;11:53:43;18731.000000000;1
FB-RM;0;20210113;11:53:56;18726.000000000;1
FB-RM;0;20210113;11:58:35;18722.000000000;1
FB-RM;0;20210113;12:00:00;18701.000000000;2
FB-RM;0;20210113;12:00:00;18700.000000000;1
FB-RM;0;20210113;12:00:01;18683.000000000;1
FB-RM;0;20210113;12:00:01;18683.000000000;5
FB-RM;0;20210113;12:00:01;18683.000000000;5
FB-RM;0;20210113;12:02:37;18665.000000000;3
FB-RM;0;20210113;12:02:37;18665.000000000;4
FB-RM;0;20210113;12:02:37;18665.000000000;2
FB-RM;0;20210113;12:02:37;18665.000000000;10
FB-RM;0;20210113;12:02:49;18683.000000000;2
FB-RM;0;20210113;12:05:32;18665.000000000;4
FB-RM;0;20210113;12:05:32;18665.000000000;4
FB-RM;0;20210113;12:07:59;18692.000000000;1
FB-RM;0;20210113;12:07:59;18696.000000000;1
FB-RM;0;20210113;12:11:38;18687.000000000;1
FB-RM;0;20210113;12:11:48;18693.000000000;1
FB-RM;0;20210113;12:12:30;18699.000000000;4
FB-RM;0;20210113;12:12:30;18699.000000000;3
FB-RM;0;20210113;12:12:30;18699.000000000;5
FB-RM;0;20210113;12:12:30;18699.000000000;10
FB-RM;0;20210113;12:12:30;18699.000000000;4
FB-RM;0;20210113;12:15:36;18672.000000000;4
FB-RM;0;20210113;12:15:36;18675.000000000;5
FB-RM;0;20210113;12:15:36;18675.000000000;10
FB-RM;0;20210113;12:15:36;18675.000000000;4
FB-RM;0;20210113;12:16:58;18675.000000000;1
FB-RM;0;20210113;12:17:39;18675.000000000;1
FB-RM;0;20210113;12:18:15;18672.000000000;1
FB-RM;0;20210113;12:21:13;18672.000000000;1
FB-RM;0;20210113;12:21:13;18675.000000000;3
FB-RM;0;20210113;12:21:13;18675.000000000;2
FB-RM;0;20210113;12:22:03;18685.000000000;8
FB-RM;0;20210113;12:22:11;18675.000000000;1
FB-RM;0;20210113;12:22:35;18673.000000000;10
FB-RM;0;20210113;12:22:35;18673.000000000;4
FB-RM;0;20210113;12:25:36;18702.000000000;1
FB-RM;0;20210113;12:26:10;18700.000000000;10
FB-RM;0;20210113;12:26:42;18700.000000000;1
FB-RM;0;20210113;12:28:33;18674.000000000;2
FB-RM;0;20210113;12:29:37;18664.000000000;1
FB-RM;0;20210113;12:29:54;18670.000000000;4
FB-RM;0;20210113;12:29:54;18671.000000000;5
FB-RM;0;20210113;12:29:54;18671.000000000;4
FB-RM;0;20210113;12:32:05;18650.000000000;1
FB-RM;0;20210113;12:32:07;18660.000000000;1
FB-RM;0;20210113;12:39:42;18675.000000000;4
FB-RM;0;20210113;12:39:42;18676.000000000;1
FB-RM;0;20210113;12:39:42;18681.000000000;6
FB-RM;0;20210113;12:39:42;18682.000000000;19
FB-RM;0;20210113;12:39:50;18682.000000000;1
FB-RM;0;20210113;12:40:12;18681.000000000;2
FB-RM;0;20210113;12:48:01;18675.000000000;1
FB-RM;0;20210113;12:50:19;18675.000000000;10
FB-RM;0;20210113;12:53:58;18675.000000000;4
FB-RM;0;20210113;12:53:58;18675.000000000;6
FB-RM;0;20210113;12:55:36;18675.000000000;1
FB-RM;0;20210113;12:56:32;18667.000000000;1
FB-RM;0;20210113;12:57:15;18686.000000000;1
FB-RM;0;20210113;12:58:51;18682.000000000;1
FB-RM;0;20210113;12:58:51;18682.000000000;1
FB-RM;0;20210113;13:02:14;18682.000000000;1
FB-RM;0;20210113;13:15:50;18715.000000000;1
FB-RM;0;20210113;13:16:38;18701.000000000;4
FB-RM;0;20210113;13:16:38;18701.000000000;4
FB-RM;0;20210113;13:16:38;18704.000000000;4
FB-RM;0;20210113;13:16:38;18704.000000000;10
FB-RM;0;20210113;13:17:54;18704.000000000;1
FB-RM;0;20210113;13:18:13;18700.000000000;1
FB-RM;0;20210113;13:18:30;18700.000000000;1
FB-RM;0;20210113;13:21:14;18685.000000000;4
FB-RM;0;20210113;13:21:24;18688.000000000;4
FB-RM;0;20210113;13:22:27;18683.000000000;1
FB-RM;0;20210113;13:22:28;18682.000000000;1
FB-RM;0;20210113;13:22:28;18682.000000000;5
FB-RM;0;20210113;13:22:28;18682.000000000;1
FB-RM;0;20210113;13:22:28;18682.000000000;1
FB-RM;0;20210113;13:22:28;18682.000000000;2
FB-RM;0;20210113;13:23:23;18663.000000000;4
FB-RM;0;20210113;13:23:23;18663.000000000;5
FB-RM;0;20210113;13:23:23;18663.000000000;10
FB-RM;0;20210113;13:23:37;18662.000000000;1
FB-RM;0;20210113;13:23:37;18662.000000000;1
FB-RM;0;20210113;13:23:49;18660.000000000;1
FB-RM;0;20210113;13:23:49;18660.000000000;1
FB-RM;0;20210113;13:26:39;18683.000000000;1
FB-RM;0;20210113;13:26:58;18676.000000000;1
FB-RM;0;20210113;13:26:58;18676.000000000;1
FB-RM;0;20210113;13:27:02;18676.000000000;1
FB-RM;0;20210113;13:30:58;18676.000000000;2
FB-RM;0;20210113;13:30:58;18658.000000000;1
FB-RM;0;20210113;13:30:58;18650.000000000;1
FB-RM;0;20210113;13:30:58;18650.000000000;1
FB-RM;0;20210113;13:30:59;18644.000000000;4
FB-RM;0;20210113;13:30:59;18644.000000000;4
FB-RM;0;20210113;13:30:59;18644.000000000;4
FB-RM;0;20210113;13:30:59;18644.000000000;5
FB-RM;0;20210113;13:31:00;18644.000000000;4
FB-RM;0;20210113;13:31:07;18644.000000000;4
FB-RM;0;20210113;13:31:12;18644.000000000;1
FB-RM;0;20210113;13:31:16;18643.000000000;1
FB-RM;0;20210113;13:31:26;18650.000000000;3
FB-RM;0;20210113;13:31:26;18639.000000000;1
FB-RM;0;20210113;13:33:28;18630.000000000;4
FB-RM;0;20210113;13:33:28;18630.000000000;10
FB-RM;0;20210113;13:33:28;18630.000000000;5
FB-RM;0;20210113;13:33:28;18630.000000000;4
FB-RM;0;20210113;13:35:28;18608.000000000;1
FB-RM;0;20210113;13:35:40;18609.000000000;1
FB-RM;0;20210113;13:40:12;18644.000000000;1
FB-RM;0;20210113;13:41:28;18640.000000000;1
FB-RM;0;20210113;13:42:14;18629.000000000;2
FB-RM;0;20210113;13:44:27;18629.000000000;1
FB-RM;0;20210113;13:48:57;18629.000000000;2
FB-RM;0;20210113;13:48:58;18629.000000000;2
FB-RM;0;20210113;13:52:00;18629.000000000;1
FB-RM;0;20210113;13:53:36;18629.000000000;1
FB-RM;0;20210113;13:54:34;18629.000000000;1
FB-RM;0;20210113;14:00:41;18635.000000000;50
FB-RM;0;20210113;14:03:18;18635.000000000;1
FB-RM;0;20210113;14:16:50;18636.000000000;4
FB-RM;0;20210113;14:17:10;18635.000000000;1
FB-RM;0;20210113;14:17:10;18635.000000000;5
FB-RM;0;20210113;14:22:39;18635.000000000;1
FB-RM;0;20210113;14:22:39;18620.000000000;1
FB-RM;0;20210113;14:22:39;18619.000000000;1
FB-RM;0;20210113;14:22:39;18619.000000000;1
FB-RM;0;20210113;14:23:10;18638.000000000;1
FB-RM;0;20210113;14:28:09;18638.000000000;1
FB-RM;0;20210113;14:28:09;18638.000000000;1
FB-RM;0;20210113;14:28:36;18619.000000000;4
FB-RM;0;20210113;14:30:58;18614.000000000;4
FB-RM;0;20210113;14:30:58;18614.000000000;10
FB-RM;0;20210113;14:30:59;18613.000000000;1
FB-RM;0;20210113;14:30:59;18610.000000000;1
FB-RM;0;20210113;14:30:59;18610.000000000;2
FB-RM;0;20210113;14:30:59;18610.000000000;5
FB-RM;0;20210113;14:30:59;18595.000000000;1
FB-RM;0;20210113;14:31:42;18596.000000000;1
FB-RM;0;20210113;14:31:42;18596.000000000;1
FB-RM;0;20210113;14:35:25;18631.000000000;1
FB-RM;0;20210113;14:35:58;18635.000000000;1
FB-RM;0;20210113;14:35:58;18635.000000000;1
FB-RM;0;20210113;14:36:10;18612.000000000;7
FB-RM;0;20210113;14:37:45;18607.000000000;15
FB-RM;0;20210113;14:41:17;18597.000000000;1
FB-RM;0;20210113;14:42:52;18596.000000000;1
FB-RM;0;20210113;14:42:52;18595.000000000;1
FB-RM;0;20210113;14:43:57;18595.000000000;1
FB-RM;0;20210113;14:50:35;18610.000000000;1
FB-RM;0;20210113;14:50:38;18610.000000000;1
FB-RM;0;20210113;14:53:48;18630.000000000;1
FB-RM;0;20210113;14:53:59;18631.000000000;1
FB-RM;0;20210113;14:54:07;18631.000000000;1
FB-RM;0;20210113;14:54:07;18631.000000000;1
FB-RM;0;20210113;14:54:13;18630.000000000;152
FB-RM;0;20210113;14:55:35;18620.000000000;187
FB-RM;0;20210113;14:57:57;18621.000000000;1
FB-RM;0;20210113;14:58:11;18620.000000000;1
FB-RM;0;20210113;15:01:10;18600.000000000;3
FB-RM;0;20210113;15:01:10;18600.000000000;10
FB-RM;0;20210113;15:05:58;18631.000000000;1
FB-RM;0;20210113;15:11:45;18631.000000000;1
FB-RM;0;20210113;15:14:23;18605.000000000;1
FB-RM;0;20210113;15:14:31;18600.000000000;1
FB-RM;0;20210113;15:19:40;18595.000000000;1
FB-RM;0;20210113;15:22:21;18609.000000000;5
FB-RM;0;20210113;15:23:13;18595.000000000;1
FB-RM;0;20210113;15:23:14;18594.000000000;1
FB-RM;0;20210113;15:26:01;18582.000000000;1
FB-RM;0;20210113;15:33:17;18570.000000000;1
FB-RM;0;20210113;15:36:43;18562.000000000;1
FB-RM;0;20210113;15:36:43;18562.000000000;1
FB-RM;0;20210113;15:37:40;18560.000000000;4
FB-RM;0;20210113;15:37:40;18560.000000000;1
FB-RM;0;20210113;15:38:21;18562.000000000;1
FB-RM;0;20210113;15:51:22;18593.000000000;1
FB-RM;0;20210113;15:51:46;18593.000000000;9
FB-RM;0;20210113;15:55:25;18593.000000000;1
FB-RM;0;20210113;15:55:35;18593.000000000;954
FB-RM;0;20210113;15:55:47;18593.000000000;20
FB-RM;0;20210113;15:55:47;18593.000000000;4
FB-RM;0;20210113;15:55:47;18593.000000000;4
FB-RM;0;20210113;15:55:47;18593.000000000;1
FB-RM;0;20210113;15:55:47;18593.000000000;6
FB-RM;0;20210113;15:55:47;18593.000000000;4
FB-RM;0;20210113;15:55:47;18593.000000000;6
FB-RM;0;20210113;15:57:37;18565.000000000;4
FB-RM;0;20210113;15:57:37;18565.000000000;3
FB-RM;0;20210113;15:57:40;18579.000000000;3
FB-RM;0;20210113;15:57:40;18579.000000000;2
FB-RM;0;20210113;15:58:40;18571.000000000;1
FB-RM;0;20210113;15:58:40;18571.000000000;6
FB-RM;0;20210113;16:01:23;18562.000000000;1
FB-RM;0;20210113;16:01:23;18562.000000000;4
FB-RM;0;20210113;16:07:10;18560.000000000;1
FB-RM;0;20210113;16:09:38;18560.000000000;1
FB-RM;0;20210113;16:09:39;18577.000000000;1
FB-RM;0;20210113;16:10:13;18550.000000000;1
FB-RM;0;20210113;16:10:13;18550.000000000;3
FB-RM;0;20210113;16:10:24;18541.000000000;2
FB-RM;0;20210113;16:11:27;18541.000000000;16
FB-RM;0;20210113;16:12:09;18541.000000000;10
FB-RM;0;20210113;16:12:10;18541.000000000;6
FB-RM;0;20210113;16:12:10;18541.000000000;5
FB-RM;0;20210113;16:19:52;18559.000000000;1
FB-RM;0;20210113;16:19:52;18559.000000000;5
FB-RM;0;20210113;16:19:52;18560.000000000;6
FB-RM;0;20210113;16:19:52;18560.000000000;10
FB-RM;0;20210113;16:19:52;18560.000000000;5
FB-RM;0;20210113;16:19:53;18560.000000000;10
FB-RM;0;20210113;16:19:53;18560.000000000;10
FB-RM;0;20210113;16:19:55;18560.000000000;4
FB-RM;0;20210113;16:19:55;18560.000000000;3
FB-RM;0;20210113;16:19:57;18560.000000000;10
FB-RM;0;20210113;16:19:57;18560.000000000;1
FB-RM;0;20210113;16:19:57;18560.000000000;5
FB-RM;0;20210113;16:19:57;18560.000000000;4
FB-RM;0;20210113;16:19:57;18560.000000000;1
FB-RM;0;20210113;16:19:57;18560.000000000;10
FB-RM;0;20210113;16:19:57;18560.000000000;4
FB-RM;0;20210113;16:19:57;18560.000000000;10
FB-RM;0;20210113;16:19:58;18560.000000000;4
FB-RM;0;20210113;16:19:58;18560.000000000;4
FB-RM;0;20210113;16:19:58;18560.000000000;4
FB-RM;0;20210113;16:19:58;18560.000000000;4
FB-RM;0;20210113;16:19:58;18560.000000000;4
FB-RM;0;20210113;16:19:59;18560.000000000;4
FB-RM;0;20210113;16:19:59;18560.000000000;10
FB-RM;0;20210113;16:19:59;18560.000000000;4
FB-RM;0;20210113;16:19:59;18560.000000000;10
FB-RM;0;20210113;16:19:59;18560.000000000;4
FB-RM;0;20210113;16:19:59;18560.000000000;4
FB-RM;0;20210113;16:19:59;18560.000000000;8
FB-RM;0;20210113;16:20:31;18560.000000000;1
FB-RM;0;20210113;16:20:31;18560.000000000;4
FB-RM;0;20210113;16:21:00;18558.000000000;1
FB-RM;0;20210113;16:21:00;18558.000000000;4
FB-RM;0;20210113;16:21:00;18559.000000000;1
FB-RM;0;20210113;16:21:00;18560.000000000;4
FB-RM;0;20210113;16:35:32;18540.000000000;1
FB-RM;0;20210113;16:36:29;18540.000000000;5
FB-RM;0;20210113;16:36:36;18535.000000000;1
FB-RM;0;20210113;16:39:47;18529.000000000;1
FB-RM;0;20210113;16:41:35;18525.000000000;1
FB-RM;0;20210113;16:42:22;18523.000000000;1
FB-RM;0;20210113;16:42:22;18523.000000000;3
FB-RM;0;20210113;16:42:22;18523.000000000;1
FB-RM;0;20210113;16:42:22;18523.000000000;1
FB-RM;0;20210113;16:42:22;18521.000000000;3
FB-RM;0;20210113;16:44:58;18521.000000000;1
FB-RM;0;20210113;16:44:58;18521.000000000;1
FB-RM;0;20210113;16:44:58;18521.000000000;1
FB-RM;0;20210113;16:53:33;18500.000000000;1
FB-RM;0;20210113;17:04:44;18516.000000000;2
FB-RM;0;20210113;17:06:19;18508.000000000;1
FB-RM;0;20210113;17:06:23;18500.000000000;5
FB-RM;0;20210113;17:06:23;18500.000000000;1
FB-RM;0;20210113;17:06:23;18500.000000000;1
FB-RM;0;20210113;17:06:23;18500.000000000;5
FB-RM;0;20210113;17:06:23;18500.000000000;1
FB-RM;0;20210113;17:16:03;18522.000000000;4
FB-RM;0;20210113;17:16:03;18522.000000000;2
FB-RM;0;20210113;17:19:26;18580.000000000;1
FB-RM;0;20210113;17:19:26;18580.000000000;1
FB-RM;0;20210113;17:19:49;18580.000000000;4
FB-RM;0;20210113;17:19:52;18580.000000000;1
FB-RM;0;20210113;17:19:52;18580.000000000;5
FB-RM;0;20210113;17:19:52;18580.000000000;10
FB-RM;0;20210113;17:29:57;18610.000000000;1
FB-RM;0;20210113;17:30:00;18613.000000000;1
FB-RM;0;20210113;17:30:02;18580.000000000;1
FB-RM;0;20210113;17:30:06;18525.000000000;5
FB-RM;0;20210113;17:30:12;18506.000000000;1
FB-RM;0;20210113;17:30:13;18505.000000000;1
FB-RM;0;20210113;17:30:13;18500.000000000;2
FB-RM;0;20210113;17:30:13;18500.000000000;5
FB-RM;0;20210113;17:30:13;18500.000000000;2
FB-RM;0;20210113;17:30:13;18500.000000000;1
FB-RM;0;20210113;17:30:13;18500.000000000;1
FB-RM;0;20210113;17:30:13;18500.000000000;1
FB-RM;0;20210113;17:30:13;18500.000000000;8
FB-RM;0;20210113;17:30:13;18500.000000000;6
FB-RM;0;20210113;17:30:13;18500.000000000;6
FB-RM;0;20210113;17:30:13;18500.000000000;1
FB-RM;0;20210113;17:30:13;18500.000000000;1
FB-RM;0;20210113;17:30:13;18500.000000000;1
FB-RM;0;20210113;17:30:13;18500.000000000;1
FB-RM;0;20210113;17:30:13;18499.000000000;1
FB-RM;0;20210113;17:30:33;18496.000000000;1
FB-RM;0;20210113;17:32:41;18521.000000000;1
FB-RM;0;20210113;17:32:41;18521.000000000;3
FB-RM;0;20210113;17:32:41;18521.000000000;4
FB-RM;0;20210113;17:32:56;18516.000000000;2
FB-RM;0;20210113;17:33:16;18499.000000000;10
FB-RM;0;20210113;17:33:16;18496.000000000;1
FB-RM;0;20210113;17:33:23;18480.000000000;20
FB-RM;0;20210113;17:33:28;18475.000000000;13
FB-RM;0;20210113;17:33:42;18480.000000000;1
FB-RM;0;20210113;17:35:04;18453.000000000;4
FB-RM;0;20210113;17:35:04;18453.000000000;4
FB-RM;0;20210113;17:35:04;18452.000000000;1
FB-RM;0;20210113;17:35:04;18452.000000000;10
FB-RM;0;20210113;17:35:04;18452.000000000;5
FB-RM;0;20210113;17:35:04;18450.000000000;2
FB-RM;0;20210113;17:35:04;18450.000000000;1
FB-RM;0;20210113;17:35:04;18450.000000000;13
FB-RM;0;20210113;17:35:04;18450.000000000;2
FB-RM;0;20210113;17:35:04;18450.000000000;2
FB-RM;0;20210113;17:36:11;18449.000000000;1
FB-RM;0;20210113;17:37:06;18440.000000000;1
FB-RM;0;20210113;17:37:28;18443.000000000;1
FB-RM;0;20210113;17:37:29;18453.000000000;1
FB-RM;0;20210113;17:39:54;18435.000000000;12
FB-RM;0;20210113;17:42:01;18484.000000000;1
FB-RM;0;20210113;17:42:08;18478.000000000;1
FB-RM;0;20210113;17:45:44;18476.000000000;7
FB-RM;0;20210113;17:53:38;18626.000000000;1
FB-RM;0;20210113;17:53:52;18614.000000000;1
FB-RM;0;20210113;17:54:09;18608.000000000;40
FB-RM;0;20210113;17:54:14;18600.000000000;2
FB-RM;0;20210113;17:54:39;18596.000000000;1
FB-RM;0;20210113;17:55:34;18595.000000000;1
FB-RM;0;20210113;17:59:50;18544.000000000;1
FB-RM;0;20210113;18:01:44;18544.000000000;1
FB-RM;0;20210113;18:03:57;18504.000000000;10
FB-RM;0;20210113;18:04:02;18500.000000000;2
FB-RM;0;20210113;18:04:02;18500.000000000;1
FB-RM;0;20210113;18:05:16;18480.000000000;10
FB-RM;0;20210113;18:05:16;18480.000000000;4
FB-RM;0;20210113;18:05:16;18480.000000000;8
FB-RM;0;20210113;18:05:26;18480.000000000;1
FB-RM;0;20210113;18:05:26;18480.000000000;10
FB-RM;0;20210113;18:05:26;18480.000000000;4
FB-RM;0;20210113;18:05:27;18480.000000000;1
FB-RM;0;20210113;18:05:27;18480.000000000;1
FB-RM;0;20210113;18:05:27;18480.000000000;4
FB-RM;0;20210113;18:05:27;18480.000000000;10
FB-RM;0;20210113;18:05:28;18480.000000000;10
FB-RM;0;20210113;18:05:28;18480.000000000;4
FB-RM;0;20210113;18:05:28;18480.000000000;10
FB-RM;0;20210113;18:05:28;18480.000000000;4
FB-RM;0;20210113;18:05:28;18480.000000000;4
FB-RM;0;20210113;18:05:49;18480.000000000;4
FB-RM;0;20210113;18:05:49;18480.000000000;4
FB-RM;0;20210113;18:05:49;18480.000000000;10
FB-RM;0;20210113;18:05:49;18480.000000000;4
FB-RM;0;20210113;18:05:49;18480.000000000;10
FB-RM;0;20210113;18:05:49;18480.000000000;3
FB-RM;0;20210113;18:05:50;18480.000000000;4
FB-RM;0;20210113;18:05:50;18480.000000000;5
FB-RM;0;20210113;18:05:50;18480.000000000;4
FB-RM;0;20210113;18:05:50;18480.000000000;4
FB-RM;0;20210113;18:05:50;18480.000000000;4
FB-RM;0;20210113;18:05:56;18480.000000000;4
FB-RM;0;20210113;18:05:57;18480.000000000;4
FB-RM;0;20210113;18:05:57;18480.000000000;4
FB-RM;0;20210113;18:05:57;18480.000000000;4
FB-RM;0;20210113;18:05:58;18480.000000000;4
FB-RM;0;20210113;18:05:58;18480.000000000;4
FB-RM;0;20210113;18:05:58;18480.000000000;4
FB-RM;0;20210113;18:05:58;18480.000000000;4
FB-RM;0;20210113;18:05:58;18480.000000000;2
FB-RM;0;20210113;18:05:59;18480.000000000;1
FB-RM;0;20210113;18:05:59;18480.000000000;10
FB-RM;0;20210113;18:05:59;18480.000000000;10
FB-RM;0;20210113;18:05:59;18480.000000000;10
FB-RM;0;20210113;18:05:59;18480.000000000;4
FB-RM;0;20210113;18:06:00;18480.000000000;5
FB-RM;0;20210113;18:06:01;18480.000000000;4
FB-RM;0;20210113;18:06:24;18480.000000000;1
FB-RM;0;20210113;18:06:24;18480.000000000;4
FB-RM;0;20210113;18:06:24;18480.000000000;10
FB-RM;0;20210113;18:06:24;18480.000000000;5
FB-RM;0;20210113;18:06:24;18480.000000000;10
FB-RM;0;20210113;18:06:24;18480.000000000;4
FB-RM;0;20210113;18:06:24;18480.000000000;1
FB-RM;0;20210113;18:06:24;18480.000000000;4
FB-RM;0;20210113;18:06:24;18480.000000000;10
FB-RM;0;20210113;18:06:24;18480.000000000;6
FB-RM;0;20210113;18:06:24;18480.000000000;6
FB-RM;0;20210113;18:06:24;18480.000000000;1
FB-RM;0;20210113;18:06:24;18480.000000000;10
FB-RM;0;20210113;18:06:24;18480.000000000;4
FB-RM;0;20210113;18:06:24;18480.000000000;4
FB-RM;0;20210113;18:06:24;18480.000000000;1
FB-RM;0;20210113;18:06:24;18480.000000000;2
FB-RM;0;20210113;18:06:25;18480.000000000;4
FB-RM;0;20210113;18:06:25;18480.000000000;5
FB-RM;0;20210113;18:06:25;18480.000000000;4
FB-RM;0;20210113;18:06:25;18480.000000000;4
FB-RM;0;20210113;18:06:25;18480.000000000;4
FB-RM;0;20210113;18:06:26;18480.000000000;4
FB-RM;0;20210113;18:06:26;18480.000000000;4
FB-RM;0;20210113;18:06:26;18480.000000000;4
FB-RM;0;20210113;18:06:26;18480.000000000;10
FB-RM;0;20210113;18:06:26;18480.000000000;4
FB-RM;0;20210113;18:06:28;18480.000000000;2
FB-RM;0;20210113;18:06:51;18476.000000000;1
FB-RM;0;20210113;18:06:58;18476.000000000;1
FB-RM;0;20210113;18:06:58;18476.000000000;1
FB-RM;0;20210113;18:07:31;18476.000000000;1
FB-RM;0;20210113;18:08:25;18480.000000000;1
FB-RM;0;20210113;18:10:47;18536.000000000;1
FB-RM;0;20210113;18:21:58;18536.000000000;1
FB-RM;0;20210113;18:22:22;18550.000000000;1
FB-RM;0;20210113;18:24:57;18557.000000000;1
FB-RM;0;20210113;18:27:07;18577.000000000;3
FB-RM;0;20210113;18:32:30;18604.000000000;1
FB-RM;0;20210113;18:32:54;18613.000000000;1
FB-RM;0;20210113;18:40:14;18650.000000000;2
FB-RM;0;20210113;18:42:00;18650.000000000;1
FB-RM;0;20210113;18:42:00;18650.000000000;6
FB-RM;0;20210113;18:42:33;18650.000000000;5
FB-RM;0;20210113;18:43:19;18613.000000000;1
FB-RM;0;20210113;18:47:38;18613.000000000;16
FB-RM;0;20210113;18:47:38;18613.000000000;1
FB-RM;0;20210113;18:47:38;18613.000000000;2
FB-RM;0;20210113;18:47:52;18607.000000000;2
FB-RM;0;20210113;18:48:08;18597.000000000;1
FB-RM;0;20210113;18:48:08;18597.000000000;1
FB-RM;0;20210113;18:59:22;18657.000000000;1
FB-RM;0;20210113;19:00:44;18657.000000000;5
FB-RM;0;20210113;19:02:16;18657.000000000;2
FB-RM;0;20210113;19:03:19;18646.000000000;2
FB-RM;0;20210113;19:09:28;18646.000000000;1
FB-RM;0;20210113;19:10:29;18655.000000000;2
FB-RM;0;20210113;19:16:50;18671.000000000;3
FB-RM;0;20210113;19:16:50;18673.000000000;7
FB-RM;0;20210113;19:18:46;18673.000000000;1
FB-RM;0;20210113;19:19:18;18671.000000000;1
FB-RM;0;20210113;19:19:24;18660.000000000;1
FB-RM;0;20210113;19:19:24;18660.000000000;5
FB-RM;0;20210113;19:19:24;18660.000000000;4
FB-RM;0;20210113;19:19:24;18660.000000000;1
FB-RM;0;20210113;19:19:35;18657.000000000;1
FB-RM;0;20210113;19:19:54;18655.000000000;1
FB-RM;0;20210113;19:19:54;18655.000000000;1
FB-RM;0;20210113;19:20:29;18626.000000000;1
FB-RM;0;20210113;19:26:15;18695.000000000;1
FB-RM;0;20210113;19:26:15;18698.000000000;9
FB-RM;0;20210113;19:30:02;18675.000000000;3
FB-RM;0;20210113;19:30:26;18675.000000000;2
FB-RM;0;20210113;19:30:31;18672.000000000;1
FB-RM;0;20210113;19:30:33;18668.000000000;1
FB-RM;0;20210113;19:34:27;18669.000000000;1
FB-RM;0;20210113;19:35:34;18689.000000000;1
FB-RM;0;20210113;19:36:15;18697.000000000;1
FB-RM;0;20210113;19:36:15;18697.000000000;7
FB-RM;0;20210113;19:36:46;18697.000000000;2
FB-RM;0;20210113;19:38:28;18682.000000000;1
FB-RM;0;20210113;19:39:13;18668.000000000;1
FB-RM;0;20210113;19:41:26;18635.000000000;1
FB-RM;0;20210113;19:44:39;18646.000000000;40
FB-RM;0;20210113;19:44:39;18657.000000000;40
FB-RM;0;20210113;19:44:39;18657.000000000;20
FB-RM;0;20210113;19:44:39;18651.000000000;20
FB-RM;0;20210113;19:45:05;18635.000000000;1
FB-RM;0;20210113;19:45:05;18635.000000000;3
FB-RM;0;20210113;19:45:27;18626.000000000;1
FB-RM;0;20210113;19:48:55;18600.000000000;1
FB-RM;0;20210113;19:48:55;18600.000000000;2
FB-RM;0;20210113;19:49:18;18597.000000000;1
FB-RM;0;20210113;19:51:46;18570.000000000;40
FB-RM;0;20210113;19:51:46;18570.000000000;13
FB-RM;0;20210113;19:51:59;18551.000000000;1
FB-RM;0;20210113;19:51:59;18550.000000000;1
FB-RM;0;20210113;19:51:59;18550.000000000;1
FB-RM;0;20210113;19:53:43;18537.000000000;1
FB-RM;0;20210113;19:55:28;18536.000000000;7
FB-RM;0;20210113;19:55:31;18512.000000000;1
FB-RM;0;20210113;19:57:45;18530.000000000;1
FB-RM;0;20210113;19:57:49;18539.000000000;1
FB-RM;0;20210113;19:58:33;18547.000000000;9
FB-RM;0;20210113;19:59:00;18539.000000000;1
FB-RM;0;20210113;19:59:00;18539.000000000;1
FB-RM;0;20210113;19:59:13;18535.000000000;1
FB-RM;0;20210113;20:00:57;18527.000000000;1
FB-RM;0;20210113;20:01:47;18526.000000000;2
FB-RM;0;20210113;20:03:01;18527.000000000;1
FB-RM;0;20210113;20:12:08;18555.000000000;40
FB-RM;0;20210113;20:12:08;18566.000000000;48
FB-RM;0;20210113;20:12:08;18567.000000000;12
FB-RM;0;20210113;20:12:08;18561.000000000;12
FB-RM;0;20210113;20:12:15;18550.000000000;1
FB-RM;0;20210113;20:16:28;18558.000000000;2
FB-RM;0;20210113;20:16:50;18558.000000000;1
FB-RM;0;20210113;20:18:26;18550.000000000;4
FB-RM;0;20210113;20:19:57;18550.000000000;2
FB-RM;0;20210113;20:22:03;18565.000000000;30
FB-RM;0;20210113;20:22:48;18565.000000000;1
FB-RM;0;20210113;20:24:36;18548.000000000;1
FB-RM;0;20210113;20:24:40;18549.000000000;1
FB-RM;0;20210113;20:25:32;18538.000000000;40
FB-RM;0;20210113;20:25:32;18552.000000000;40
FB-RM;0;20210113;20:25:32;18557.000000000;5
FB-RM;0;20210113;20:25:32;18551.000000000;5
FB-RM;0;20210113;20:29:01;18555.000000000;2
FB-RM;0;20210113;20:34:03;18555.000000000;1
FB-RM;0;20210113;20:34:03;18555.000000000;1
FB-RM;0;20210113;20:34:05;18551.000000000;1
FB-RM;0;20210113;20:34:07;18550.000000000;1
FB-RM;0;20210113;20:34:07;18550.000000000;1
FB-RM;0;20210113;20:35:06;18540.000000000;40
FB-RM;0;20210113;20:35:06;18540.000000000;40
FB-RM;0;20210113;20:44:17;18588.000000000;2
FB-RM;0;20210113;20:45:15;18575.000000000;2
FB-RM;0;20210113;20:45:55;18573.000000000;1
FB-RM;0;20210113;20:46:21;18562.000000000;1
FB-RM;0;20210113;20:46:43;18561.000000000;1
FB-RM;0;20210113;20:56:56;18548.000000000;4
FB-RM;0;20210113;20:57:16;18540.000000000;1
FB-RM;0;20210113;20:57:16;18540.000000000;1
FB-RM;0;20210113;20:57:16;18540.000000000;7
FB-RM;0;20210113;20:57:16;18540.000000000;5
FB-RM;0;20210113;20:57:16;18540.000000000;1
FB-RM;0;20210113;20:58:03;18520.000000000;1
FB-RM;0;20210113;20:59:43;18523.000000000;1
FB-RM;0;20210113;21:00:09;18523.000000000;10
FB-RM;0;20210113;21:00:10;18520.000000000;1
FB-RM;0;20210113;21:00:34;18512.000000000;2
FB-RM;0;20210113;21:00:48;18510.000000000;1
FB-RM;0;20210113;21:07:42;18534.000000000;1
FB-RM;0;20210113;21:11:27;18530.000000000;1
FB-RM;0;20210113;21:22:13;18525.000000000;2
FB-RM;0;20210113;21:24:21;18525.000000000;2
FB-RM;0;20210113;21:25:49;18520.000000000;1
FB-RM;0;20210113;21:26:08;18515.000000000;1
FB-RM;0;20210113;21:26:33;18510.000000000;1
FB-RM;0;20210113;21:26:33;18510.000000000;10
FB-RM;0;20210113;21:26:33;18510.000000000;1
FB-RM;0;20210113;21:26:33;18510.000000000;1
FB-RM;0;20210113;21:26:49;18509.000000000;1
FB-RM;0;20210113;21:35:50;18543.000000000;1
FB-RM;0;20210113;21:37:07;18534.000000000;1
FB-RM;0;20210113;21:45:27;18510.000000000;1
FB-RM;0;20210113;21:51:50;18543.000000000;1
FB-RM;0;20210113;21:52:37;18543.000000000;2
FB-RM;0;20210113;21:54:03;18543.000000000;2
FB-RM;0;20210113;21:54:03;18543.000000000;1
FB-RM;0;20210113;21:55:11;18543.000000000;1
FB-RM;0;20210113;21:55:11;18540.000000000;5
FB-RM;0;20210113;21:56:26;18524.000000000;10
FB-RM;0;20210113;21:57:04;18524.000000000;40
FB-RM;0;20210113;21:57:04;18524.000000000;40
FB-RM;0;20210113;21:57:04;18524.000000000;27
FB-RM;0;20210113;22:00:18;18540.000000000;1
FB-RM;0;20210113;22:00:33;18553.000000000;5
FB-RM;0;20210113;22:00:33;18553.000000000;1
FB-RM;0;20210113;22:00:33;18553.000000000;4
FB-RM;0;20210113;22:00:33;18553.000000000;4
FB-RM;0;20210113;22:00:33;18553.000000000;10
FB-RM;0;20210113;22:00:51;18542.000000000;1
FB-RM;0;20210113;22:00:53;18537.000000000;4
FB-RM;0;20210113;22:00:53;18537.000000000;4
FB-RM;0;20210113;22:00:53;18537.000000000;8
FB-RM;0;20210113;22:01:36;18553.000000000;1
FB-RM;0;20210113;22:07:07;18583.000000000;2
FB-RM;0;20210113;22:07:46;18565.000000000;1
FB-RM;0;20210113;22:07:55;18564.000000000;9
FB-RM;0;20210113;22:08:28;18572.000000000;1
FB-RM;0;20210113;22:09:01;18568.000000000;2
FB-RM;0;20210113;22:09:22;18564.000000000;40
FB-RM;0;20210113;22:09:22;18564.000000000;40
FB-RM;0;20210113;22:09:22;18564.000000000;40
FB-RM;0;20210113;22:09:22;18564.000000000;40
FB-RM;0;20210113;22:09:23;18564.000000000;28
FB-RM;0;20210113;22:09:43;18562.000000000;3
FB-RM;0;20210113;22:10:56;18553.000000000;1
FB-RM;0;20210113;22:10:56;18553.000000000;39
FB-RM;0;20210113;22:10:56;18553.000000000;25
FB-RM;0;20210113;22:10:56;18553.000000000;2
FB-RM;0;20210113;22:10:56;18553.000000000;1
FB-RM;0;20210113;22:10:56;18553.000000000;2
FB-RM;0;20210113;22:15:11;18553.000000000;1
FB-RM;0;20210113;22:20:44;18553.000000000;6
FB-RM;0;20210113;22:21:07;18548.000000000;1
FB-RM;0;20210113;22:22:46;18548.000000000;1
FB-RM;0;20210113;22:23:09;18528.000000000;4
FB-RM;0;20210113;22:23:09;18528.000000000;1
FB-RM;0;20210113;22:23:16;18547.000000000;11
FB-RM;0;20210113;22:30:07;18567.000000000;1
FB-RM;0;20210113;22:33:54;18601.000000000;1
FB-RM;0;20210113;22:34:38;18594.000000000;1
FB-RM;0;20210113;22:35:28;18593.000000000;2
FB-RM;0;20210113;22:37:37;18589.000000000;3
FB-RM;0;20210113;22:39:24;18600.000000000;6
FB-RM;0;20210113;22:40:42;18601.000000000;1
FB-RM;0;20210113;22:41:21;18603.000000000;1
FB-RM;0;20210113;22:42:03;18603.000000000;1
FB-RM;0;20210113;22:42:06;18603.000000000;1
FB-RM;0;20210113;22:42:52;18600.000000000;8
FB-RM;0;20210113;22:46:07;18605.000000000;1
FB-RM;0;20210113;22:46:24;18602.000000000;5
FB-RM;0;20210113;22:47:45;18600.000000000;6
FB-RM;0;20210113;22:50:19;18605.000000000;4
FB-RM;0;20210113;22:50:19;18605.000000000;4
FB-RM;0;20210113;22:50:19;18605.000000000;4
FB-RM;0;20210113;22:50:27;18605.000000000;4
FB-RM;0;20210113;22:50:27;18605.000000000;4
FB-RM;0;20210113;22:50:29;18605.000000000;4
FB-RM;0;20210113;22:50:29;18605.000000000;4
FB-RM;0;20210113;22:50:29;18605.000000000;4
FB-RM;0;20210113;22:50:30;18605.000000000;4
FB-RM;0;20210113;22:50:30;18605.000000000;28
FB-RM;0;20210113;22:50:30;18605.000000000;1
FB-RM;0;20210113;22:50:36;18605.000000000;4
FB-RM;0;20210113;22:50:36;18605.000000000;4
FB-RM;0;20210113;22:50:36;18605.000000000;4
FB-RM;0;20210113;22:50:36;18605.000000000;4
FB-RM;0;20210113;22:50:36;18605.000000000;4
FB-RM;0;20210113;22:50:36;18605.000000000;4
FB-RM;0;20210113;22:50:37;18605.000000000;4
FB-RM;0;20210113;22:50:37;18605.000000000;5
FB-RM;0;20210113;22:50:37;18605.000000000;3
FB-RM;0;20210113;22:50:37;18605.000000000;4
FB-RM;0;20210113;22:50:37;18605.000000000;10
FB-RM;0;20210113;22:50:37;18605.000000000;4
FB-RM;0;20210113;22:50:37;18605.000000000;10
FB-RM;0;20210113;22:50:38;18605.000000000;4
FB-RM;0;20210113;22:50:38;18605.000000000;5
FB-RM;0;20210113;22:50:38;18605.000000000;10
FB-RM;0;20210113;22:50:38;18605.000000000;4
FB-RM;0;20210113;22:50:38;18605.000000000;10
FB-RM;0;20210113;22:50:38;18605.000000000;4
FB-RM;0;20210113;22:50:38;18605.000000000;5
FB-RM;0;20210113;22:54:29;18605.000000000;3
FB-RM;0;20210113;22:55:02;18605.000000000;1
FB-RM;0;20210113;22:55:02;18605.000000000;1
FB-RM;0;20210113;22:55:02;18605.000000000;1
FB-RM;0;20210113;22:55:06;18601.000000000;2
FB-RM;0;20210113;22:55:14;18600.000000000;1
FB-RM;0;20210113;22:57:53;18600.000000000;2
FB-RM;0;20210113;23:04:34;18622.000000000;4
FB-RM;0;20210113;23:04:34;18622.000000000;6
FB-RM;0;20210113;23:04:34;18622.000000000;4
FB-RM;0;20210113;23:04:34;18622.000000000;1
FB-RM;0;20210113;23:05:20;18625.000000000;10
FB-RM;0;20210113;23:05:26;18625.000000000;1
FB-RM;0;20210113;23:07:49;18618.000000000;1
FB-RM;0;20210113;23:08:29;18600.000000000;2
FB-RM;0;20210113;23:08:29;18600.000000000;2
FB-RM;0;20210113;23:08:29;18600.000000000;2
FB-RM;0;20210113;23:09:31;18580.000000000;1
FB-RM;0;20210113;23:11:43;18580.000000000;3
FB-RM;0;20210113;23:15:24;18580.000000000;4
FB-RM;0;20210113;23:17:42;18580.000000000;10
FB-RM;0;20210113;23:17:42;18580.000000000;5
FB-RM;0;20210113;23:17:42;18580.000000000;4
FB-RM;0;20210113;23:17:42;18580.000000000;5
FB-RM;0;20210113;23:17:42;18580.000000000;4
FB-RM;0;20210113;23:17:42;18580.000000000;4
FB-RM;0;20210113;23:17:42;18580.000000000;5
FB-RM;0;20210113;23:17:42;18580.000000000;1
FB-RM;0;20210113;23:17:43;18580.000000000;4
FB-RM;0;20210113;23:17:43;18580.000000000;4
FB-RM;0;20210113;23:17:43;18580.000000000;4
FB-RM;0;20210113;23:17:43;18580.000000000;4
FB-RM;0;20210113;23:17:44;18580.000000000;4
FB-RM;0;20210113;23:17:44;18580.000000000;4
FB-RM;0;20210113;23:17:44;18580.000000000;4
FB-RM;0;20210113;23:17:44;18580.000000000;4
FB-RM;0;20210113;23:17:45;18580.000000000;4
FB-RM;0;20210113;23:17:45;18580.000000000;2
FB-RM;0;20210113;23:21:00;18566.000000000;1
FB-RM;0;20210113;23:22:14;18567.000000000;1
FB-RM;0;20210113;23:27:16;18567.000000000;5
FB-RM;0;20210113;23:27:31;18567.000000000;1
FB-RM;0;20210113;23:27:31;18567.000000000;4
FB-RM;0;20210113;23:27:31;18567.000000000;5
FB-RM;0;20210113;23:27:31;18567.000000000;4
FB-RM;0;20210113;23:27:31;18567.000000000;5
FB-RM;0;20210113;23:27:31;18567.000000000;1
FB-RM;0;20210113;23:27:31;18567.000000000;4
FB-RM;0;20210113;23:27:31;18567.000000000;5
FB-RM;0;20210113;23:27:31;18567.000000000;4
FB-RM;0;20210113;23:27:32;18567.000000000;4
FB-RM;0;20210113;23:27:32;18567.000000000;5
FB-RM;0;20210113;23:27:32;18567.000000000;4
FB-RM;0;20210113;23:27:32;18567.000000000;4
FB-RM;0;20210113;23:27:32;18567.000000000;4
FB-RM;0;20210113;23:27:32;18567.000000000;4
FB-RM;0;20210113;23:27:33;18567.000000000;4
FB-RM;0;20210113;23:27:33;18567.000000000;4
FB-RM;0;20210113;23:27:33;18567.000000000;4
FB-RM;0;20210113;23:27:33;18567.000000000;1
FB-RM;0;20210113;23:27:34;18567.000000000;4
FB-RM;0;20210113;23:27:34;18567.000000000;4
FB-RM;0;20210113;23:27:34;18567.000000000;4
FB-RM;0;20210113;23:27:34;18567.000000000;4
FB-RM;0;20210113;23:27:34;18567.000000000;4
FB-RM;0;20210113;23:27:35;18567.000000000;4
FB-RM;0;20210113;23:29:31;18570.000000000;1
FB-RM;0;20210113;23:31:49;18565.000000000;5
FB-RM;0;20210113;23:33:42;18571.000000000;3
FB-RM;0;20210113;23:34:40;18571.000000000;1
FB-RM;0;20210113;23:37:00;18569.000000000;5
FB-RM;0;20210113;23:37:00;18570.000000000;5
FB-RM;0;20210113;23:48:18;18600.000000000;1
