module github.com/devops-works/yeshttp

go 1.24

require (
	github.com/fatih/color v1.18.0
	github.com/lestrrat-go/jwx v1.2.30
	github.com/mileusna/useragent v1.3.5
)

require (
	github.com/decred/dcrd/dcrec/secp256k1/v4 v4.3.0 // indirect
	github.com/goccy/go-json v0.10.3 // indirect
	github.com/lestrrat-go/backoff/v2 v2.0.8 // indirect
	github.com/lestrrat-go/blackmagic v1.0.2 // indirect
	github.com/lestrrat-go/httpcc v1.0.1 // indirect
	github.com/lestrrat-go/iter v1.0.2 // indirect
	github.com/lestrrat-go/option v1.0.1 // indirect
	github.com/mattn/go-colorable v0.1.13 // indirect
	github.com/mattn/go-isatty v0.0.20 // indirect
	github.com/pkg/errors v0.9.1 // indirect
	golang.org/x/crypto v0.28.0 // indirect
	golang.org/x/sys v0.26.0 // indirect
)
