{
  "lxos-test": {
    "interface":{
      "ip": "172.16.0.100",
      "netmask": "255.240.0.0",
      "name": "enp3s0f1"
    },
    "role": "controller"
  },
 "openstack-node02": {
    "interface":{
      "ip": "172.16.0.102",
      "netmask": "255.240.0.0",
      "name": "enp3s0f0"
    },
    "role": "compute"
  },
  "openstack-node03": {
    "interface":{
      "ip": "172.16.0.103",
      "netmask": "255.240.0.0",
      "name": "enp3s0f0"
    },
    "role": "compute"
  }
}
