{
  "Version": "2012-10-17",
  "Statement": [
      {
          "Effect": "Allow",
          "Action": [
              "iam:CreateServiceLinkedRole",
              "ec2:Describe*",
              "elasticloadbalancing:*",
              "acm:ListCertificates",
              "acm:DescribeCertificate",
              "waf-regional:*",
              "wafv2:*",
              "shield:*",
              "ec2:AuthorizeSecurityGroupIngress",
              "ec2:RevokeSecurityGroupIngress",
              "ec2:CreateSecurityGroup",
              "ec2:CreateTags",
              "ec2:DeleteTags",
              "ec2:DeleteSecurityGroup"
          ],
          "Resource": "*"
      }
  ]
}