<?xml version="1.0" encoding="utf-8"?>
<COLLADA xmlns="http://www.collada.org/2005/11/COLLADASchema" version="1.4.1" xmlns:xsi="http://www.w3.org/2001/XMLSchema-instance">
  <asset>
    <contributor>
      <author>Blender User</author>
      <authoring_tool>Blender 2.80.39 commit date:2019-01-02, commit time:18:59, hash:11f2c65128dc</authoring_tool>
    </contributor>
    <created>2019-04-24T07:03:28</created>
    <modified>2019-04-24T07:03:28</modified>
    <unit name="meter" meter="1"/>
    <up_axis>Z_UP</up_axis>
  </asset>
  <library_images/>
  <library_geometries>
    <geometry id="Cube_002-mesh" name="Cube.002">
      <mesh>
        <source id="Cube_002-mesh-positions">
          <float_array id="Cube_002-mesh-positions-array" count="120">-0.4500001 -0.4500001 -0.6 -0.4500001 -0.6 -0.4500001 -0.6 -0.4500001 -0.4500001 -0.4500001 -0.6 0.4500001 -0.4500001 -0.6 0.75 -0.6 -0.4500001 0.75 -0.6 -0.4500001 0.4500001 -0.4500001 0.4500001 -0.6 -0.6 0.4500001 -0.4500001 -0.4500001 0.6 -0.4500001 -0.6 0.4500001 0.75 -0.4500001 0.6 0.75 -0.4500001 0.6 0.4500001 -0.6 0.4500001 0.4500001 0.4500001 -0.4500001 -0.6 0.6 -0.4500001 -0.4500001 0.4500001 -0.6 -0.4500001 0.6 -0.4500001 0.75 0.4500001 -0.6 0.75 0.4500001 -0.6 0.4500001 0.6 -0.4500001 0.4500001 0.4500001 0.4500001 -0.6 0.4500001 0.6 -0.4500001 0.6 0.4500001 -0.4500001 0.4500001 0.6 0.75 0.6 0.4500001 0.75 0.6 0.4500001 0.4500001 0.4500001 0.6 0.4500001 -0.6 -0.4500001 2.250113 -0.4500001 -0.6 2.250113 -0.4500001 -0.4500001 2.400113 -0.6 0.4500001 2.250113 -0.4500001 0.4500001 2.400113 -0.4500001 0.6 2.250113 0.4500001 0.6 2.250113 0.4500001 0.4500001 2.400113 0.6 0.4500001 2.250113 0.6 -0.4500001 2.250113 0.4500001 -0.4500001 2.400113 0.4500001 -0.6 2.250113</float_array>
          <technique_common>
            <accessor source="#Cube_002-mesh-positions-array" count="40" stride="3">
              <param name="X" type="float"/>
              <param name="Y" type="float"/>
              <param name="Z" type="float"/>
            </accessor>
          </technique_common>
        </source>
        <source id="Cube_002-mesh-normals">
          <float_array id="Cube_002-mesh-normals-array" count="90">0 -1 0 0 1 0 1 0 0 -1 0 0 0 0 1 -0.5773503 -0.5773503 -0.5773503 -0.7071068 -0.7071068 0 -0.5773503 0.5773503 -0.5773503 -0.7071068 0.7071068 0 0.5773503 -0.5773503 -0.5773503 0.7071068 -0.7071068 0 0.5773503 0.5773503 -0.5773503 0.7071068 0.7071068 0 -0.5773508 -0.5773504 0.5773497 -0.5773508 0.5773504 0.5773497 0.5773508 0.5773504 0.5773497 0.5773508 -0.5773504 0.5773497 -0.7071068 0 -0.7071068 -0.7071068 -0.7071068 0 -0.7071068 0.7071068 0 0 0.7071068 -0.7071068 0.7071068 0.7071068 0 0.7071068 0 -0.7071068 0.7071068 -0.7071068 0 0 -0.7071068 -0.7071068 -0.7071074 0 0.7071062 0 0.7071071 0.7071065 0.7071074 0 0.7071062 0 -0.7071071 0.7071065 0 0 -1</float_array>
          <technique_common>
            <accessor source="#Cube_002-mesh-normals-array" count="30" stride="3">
              <param name="X" type="float"/>
              <param name="Y" type="float"/>
              <param name="Z" type="float"/>
            </accessor>
          </technique_common>
        </source>
        <source id="Cube_002-mesh-map-0">
          <float_array id="Cube_002-mesh-map-0-array" count="456">0.5937501 0.78125 0.40625 0.96875 0.40625 0.78125 0.625 0.28125 0.6250001 0.46875 0.625 0.46875 0.625 0.53125 0.6250001 0.71875 0.625 0.7187501 0.625 0.03124994 0.6250001 0.21875 0.625 0.21875 0.5937501 0.03124994 0.40625 0.21875 0.40625 0.03124994 0.8437501 0.53125 0.65625 0.71875 0.65625 0.53125 0.625 0.78125 0.6250001 0.96875 0.625 0.9687501 0.5937501 0.28125 0.40625 0.46875 0.40625 0.28125 0.5937501 0.53125 0.40625 0.71875 0.40625 0.53125 0.15625 0.71875 0.15625 0.75 0.125 0.71875 0.625 0.96875 0.59375 1 0.59375 0.96875 0.15625 0.53125 0.125 0.53125 0.15625 0.5 0.625 0.28125 0.59375 0.21875 0.625 0.21875 0.34375 0.71875 0.375 0.71875 0.34375 0.75 0.625 0.78125 0.59375 0.71875 0.625 0.7187501 0.34375 0.53125 0.34375 0.5 0.375 0.53125 0.625 0.53125 0.59375 0.46875 0.625 0.46875 0.625 0.03125 0.625 0 0.625 0.03125 0.6250001 0.21875 0.625 0.21875 0.625 0.25 0.6250001 0.46875 0.625 0.46875 0.625 0.5 0.6250001 0.71875 0.625 0.71875 0.625 0.75 0.15625 0.71875 0.125 0.53125 0.15625 0.53125 0.59375 0.96875 0.40625 1 0.40625 0.96875 0.625 0.21875 0.5937501 0.03124994 0.625 0.03124994 0.40625 0.28125 0.59375 0.21875 0.5937501 0.28125 0.15625 0.53125 0.34375 0.5 0.34375 0.53125 0.625 0.46875 0.5937501 0.28125 0.625 0.28125 0.40625 0.53125 0.59375 0.46875 0.5937501 0.53125 0.34375 0.53125 0.40625 0.71875 0.34375 0.71875 0.625 0.7187501 0.5937501 0.53125 0.625 0.53125 0.40625 0.78125 0.59375 0.71875 0.5937501 0.78125 0.34375 0.71875 0.15625 0.75 0.15625 0.71875 0.625 0.9687501 0.5937501 0.78125 0.625 0.78125 0.8437501 0.53125 0.875 0.71875 0.8437501 0.71875 0.65625 0.53125 0.84375 0.5 0.8437501 0.53125 0.65625 0.71875 0.625 0.53125 0.65625 0.53125 0.8437501 0.71875 0.65625 0.75 0.65625 0.71875 0.6250001 0.46875 0.625 0.53125 0.625 0.46875 0.625 0.78125 0.6250001 0.71875 0.625 0.78125 0.6250001 0.96875 0.625 1 0.625 0.9687501 0.625 0.28125 0.6250001 0.21875 0.625 0.28125 0.34375 0.53125 0.15625 0.71875 0.15625 0.53125 0.5937501 0.78125 0.59375 0.96875 0.40625 0.96875 0.625 0.28125 0.625 0.28125 0.6250001 0.46875 0.625 0.53125 0.625 0.53125 0.6250001 0.71875 0.625 0.03124994 0.625 0.03125 0.6250001 0.21875 0.5937501 0.03124994 0.59375 0.21875 0.40625 0.21875 0.8437501 0.53125 0.8437501 0.71875 0.65625 0.71875 0.625 0.78125 0.625 0.78125 0.6250001 0.96875 0.5937501 0.28125 0.59375 0.46875 0.40625 0.46875 0.5937501 0.53125 0.59375 0.71875 0.40625 0.71875 0.625 0.96875 0.625 1 0.59375 1 0.625 0.28125 0.5937501 0.28125 0.59375 0.21875 0.625 0.78125 0.5937501 0.78125 0.59375 0.71875 0.625 0.53125 0.5937501 0.53125 0.59375 0.46875 0.15625 0.71875 0.125 0.71875 0.125 0.53125 0.59375 0.96875 0.59375 1 0.40625 1 0.625 0.21875 0.59375 0.21875 0.5937501 0.03124994 0.40625 0.28125 0.40625 0.21875 0.59375 0.21875 0.15625 0.53125 0.15625 0.5 0.34375 0.5 0.625 0.46875 0.59375 0.46875 0.5937501 0.28125 0.40625 0.53125 0.40625 0.46875 0.59375 0.46875 0.34375 0.53125 0.40625 0.53125 0.40625 0.71875 0.625 0.7187501 0.59375 0.71875 0.5937501 0.53125 0.40625 0.78125 0.40625 0.71875 0.59375 0.71875 0.34375 0.71875 0.34375 0.75 0.15625 0.75 0.625 0.9687501 0.59375 0.96875 0.5937501 0.78125 0.8437501 0.53125 0.875 0.53125 0.875 0.71875 0.65625 0.53125 0.65625 0.5 0.84375 0.5 0.65625 0.71875 0.6250001 0.71875 0.625 0.53125 0.8437501 0.71875 0.84375 0.75 0.65625 0.75 0.6250001 0.46875 0.625 0.53125 0.625 0.53125 0.625 0.78125 0.625 0.7187501 0.6250001 0.71875 0.6250001 0.96875 0.625 1 0.625 1 0.625 0.28125 0.625 0.21875 0.6250001 0.21875 0.34375 0.53125 0.34375 0.71875 0.15625 0.71875</float_array>
          <technique_common>
            <accessor source="#Cube_002-mesh-map-0-array" count="228" stride="2">
              <param name="S" type="float"/>
              <param name="T" type="float"/>
            </accessor>
          </technique_common>
        </source>
        <vertices id="Cube_002-mesh-vertices">
          <input semantic="POSITION" source="#Cube_002-mesh-positions"/>
        </vertices>
        <polylist count="76">
          <input semantic="VERTEX" source="#Cube_002-mesh-vertices" offset="0"/>
          <input semantic="NORMAL" source="#Cube_002-mesh-normals" offset="1"/>
          <input semantic="TEXCOORD" source="#Cube_002-mesh-map-0" offset="2" set="1"/>
          <vcount>3 3 3 3 3 3 3 3 3 3 3 3 3 3 3 3 3 3 3 3 3 3 3 3 3 3 3 3 3 3 3 3 3 3 3 3 3 3 3 3 3 3 3 3 3 3 3 3 3 3 3 3 3 3 3 3 3 3 3 3 3 3 3 3 3 3 3 3 3 3 3 3 3 3 3 3 </vcount>
          <p>19 0 0 1 0 1 16 0 2 11 1 3 34 1 4 24 1 5 25 2 6 37 2 7 17 2 8 5 3 9 31 3 10 10 3 11 6 3 12 8 3 13 2 3 14 32 4 15 38 4 16 35 4 17 18 0 18 29 0 19 4 0 20 12 1 21 22 1 22 9 1 23 26 2 24 15 2 25 23 2 26 0 5 27 1 5 28 2 5 29 4 6 30 6 6 31 3 6 32 7 7 33 8 7 34 9 7 35 11 8 36 13 8 37 10 8 38 14 9 39 15 9 40 16 9 41 18 10 42 20 10 43 17 10 44 21 11 45 22 11 46 23 11 47 25 12 48 27 12 49 24 12 50 28 13 51 29 13 52 30 13 53 31 14 54 32 14 55 33 14 56 34 15 57 35 15 58 36 15 59 37 16 60 38 16 61 39 16 62 0 17 63 8 17 64 7 17 65 3 18 66 2 18 67 1 18 68 10 3 69 6 3 70 5 3 71 9 19 72 13 19 73 12 19 74 7 20 75 22 20 76 21 20 77 24 1 78 12 1 79 11 1 80 23 21 81 27 21 82 26 21 83 21 22 84 15 22 85 14 22 86 17 2 87 26 2 88 25 2 89 16 23 90 20 23 91 19 23 92 14 24 93 1 24 94 0 24 95 4 0 96 19 0 97 18 0 98 32 25 99 28 25 100 30 25 101 35 26 102 33 26 103 32 26 104 38 27 105 36 27 106 35 27 107 30 28 108 39 28 109 38 28 110 34 21 111 25 21 112 24 21 113 18 23 114 37 23 115 39 23 116 29 18 117 5 18 118 4 18 119 11 19 120 31 19 121 33 19 122 21 29 123 0 29 124 7 29 125 19 0 126 3 0 127 1 0 128 11 1 129 33 1 130 34 1 131 25 2 132 36 2 133 37 2 134 5 3 135 28 3 136 31 3 137 6 3 138 13 3 139 8 3 140 32 4 141 30 4 142 38 4 143 18 0 144 39 0 145 29 0 146 12 1 147 27 1 148 22 1 149 26 2 150 20 2 151 15 2 152 4 6 153 5 6 154 6 6 155 11 8 156 12 8 157 13 8 158 18 10 159 19 10 160 20 10 161 25 12 162 26 12 163 27 12 164 0 17 165 2 17 166 8 17 167 3 18 168 6 18 169 2 18 170 10 3 171 13 3 172 6 3 173 9 19 174 8 19 175 13 19 176 7 20 177 9 20 178 22 20 179 24 1 180 27 1 181 12 1 182 23 21 183 22 21 184 27 21 185 21 22 186 23 22 187 15 22 188 17 2 189 20 2 190 26 2 191 16 23 192 15 23 193 20 23 194 14 24 195 16 24 196 1 24 197 4 0 198 3 0 199 19 0 200 32 25 201 31 25 202 28 25 203 35 26 204 34 26 205 33 26 206 38 27 207 37 27 208 36 27 209 30 28 210 29 28 211 39 28 212 34 21 213 36 21 214 25 21 215 18 23 216 17 23 217 37 23 218 29 18 219 28 18 220 5 18 221 11 19 222 10 19 223 31 19 224 21 29 225 14 29 226 0 29 227</p>
        </polylist>
      </mesh>
    </geometry>
  </library_geometries>
  <library_visual_scenes>
    <visual_scene id="Scene" name="Scene">
      <node id="Cube" name="Cube" type="NODE">
        <matrix sid="transform">1 0 0 0 0 1 0 0 0 0 1 0.6 0 0 0 1</matrix>
        <instance_geometry url="#Cube_002-mesh" name="Cube"/>
      </node>
    </visual_scene>
  </library_visual_scenes>
  <scene>
    <instance_visual_scene url="#Scene"/>
  </scene>
</COLLADA>