[gd_scene load_steps=2 format=2]

[sub_resource type="Animation" id=1]
resource_name = "IDLE"
length = 4.0
loop = true
tracks/0/type = "value"
tracks/0/path = NodePath(".:translation")
tracks/0/interp = 1
tracks/0/loop_wrap = true
tracks/0/imported = false
tracks/0/enabled = true
tracks/0/keys = {
"times": PoolRealArray( 0, 2 ),
"transitions": PoolRealArray( 1, 1 ),
"update": 0,
"values": [ Vector3( 0, 3.5, 0 ), Vector3( 0, 3.6, 0 ) ]
}

[node name="AnimationPlayer2" type="AnimationPlayer"]
anims/IDLE = SubResource( 1 )

