{
	"name": "acf/offers",
	"title": "offers",
	"description": "A custom testimonial block that uses ACF fields.",
	"style": ["file:./testimonial.css"],
	"category": "formatting",
	"icon": "admin-comments",
	"keywords": ["testimonial", "quote"],
	"acf": {
		"mode": "preview",
		"renderTemplate": "testimonial.php"
	},
	"supports": {
		"anchor": true
	}
}
