<svg viewBox="0 0 403 95" xmlns="http://www.w3.org/2000/svg">
    <path d="M165.95 51.3538L150.951 20.6635C149.074 16.8133 143.345 14.8407 139.495 16.7186C135.644 18.5968 133.672 24.3252 135.55 28.1754L158.1 74.3739C159.456 77.1542 162.859 79.1368 165.949 79.0315C169.057 79.1379 172.431 77.1792 173.799 74.3736L196.35 28.1754C198.227 24.3252 196.255 18.5968 192.405 16.7186C188.554 14.8407 182.826 16.8133 180.948 20.6635L165.95 51.3538ZM248.789 24.5682C248.789 20.2841 253.074 16 257.357 16C261.641 16 265.925 20.2841 265.925 24.5682L265.928 70.2639C265.928 72.0474 265.185 73.8306 264.009 75.3051C263.707 75.7619 263.358 76.1813 262.962 76.5502C262.423 77.0529 261.798 77.4629 261.117 77.7812C259.943 78.4424 258.651 78.8321 257.36 78.8321C256.466 78.8321 255.572 78.6449 254.717 78.3106C253.223 77.9317 251.854 77.2011 250.853 76.1275L229.45 53.1296L223.072 46.3036V70.2639C223.072 74.548 218.788 78.8318 214.504 78.8318C210.22 78.8318 205.936 74.548 205.936 70.2639V24.5679C205.936 24.5573 205.936 24.5467 205.937 24.536L205.937 24.5084C205.911 22.0821 206.75 19.6266 208.424 18.0654C209.95 16.6429 212.168 15.9633 214.38 16.002L214.404 16.0015C214.437 16.0007 214.471 16 214.504 16C214.926 16 215.348 16.0421 215.765 16.1212C217.604 16.4074 219.333 17.2008 220.534 18.4884L241.983 41.4428L248.777 48.7433L248.789 24.5682ZM333.012 24.5682C333.012 20.2841 328.728 16 324.444 16H278.764C274.48 16 270.196 20.2841 270.196 24.5682C270.196 28.852 274.48 33.1361 278.764 33.1361H324.444C328.728 33.1361 333.012 28.852 333.012 24.5682ZM394.432 33.1361H380.168L380.165 70.2639C380.165 74.548 375.881 78.8318 371.597 78.8318C367.313 78.8318 363.029 74.548 363.029 70.2639L363.032 33.1361H348.736C344.452 33.1361 340.168 28.852 340.168 24.5682C340.168 20.2841 344.452 16 348.736 16H394.432C398.716 16 403 20.2841 403 24.5682C403 28.852 398.716 33.1361 394.432 33.1361ZM331.6 38.8481C335.884 38.8481 340.168 43.1322 340.168 47.416C340.168 51.7001 335.884 55.9842 331.6 55.9842H285.917C281.634 55.9842 277.349 51.7001 277.349 47.416C277.349 43.1322 281.634 38.8481 285.917 38.8481H331.6ZM345.884 70.2639C345.884 65.9798 341.6 61.696 337.316 61.696H291.629C287.345 61.696 283.061 65.9798 283.061 70.2639C283.061 74.548 287.345 78.8321 291.629 78.8321H337.316C341.6 78.8321 345.884 74.548 345.884 70.2639ZM138.677 70.2639C138.677 65.9798 134.392 61.696 130.109 61.696H84.4803C80.1965 61.696 75.9124 65.9798 75.9124 70.2639C75.9124 74.548 80.1965 78.8321 84.4803 78.8321H130.109C134.392 78.8321 138.677 74.548 138.677 70.2639ZM125.804 24.5682C125.804 20.2841 121.52 16 117.236 16H71.5563C67.2722 16 62.9884 20.2841 62.9884 24.5682C62.9884 28.852 67.2722 33.1361 71.5563 33.1361H117.236C121.52 33.1361 125.804 28.852 125.804 24.5682ZM124.392 38.8481C128.676 38.8481 132.96 43.1322 132.96 47.416C132.96 51.7001 128.676 55.9842 124.392 55.9842H78.7684C74.4846 55.9842 70.2005 51.7001 70.2005 47.416C70.2005 43.1322 74.4846 38.8481 78.7684 38.8481H124.392ZM0 70.2639C0 74.548 4.96203 78.8318 8.5679 78.8318L27.1159 78.8321C57.104 78.8321 59.9599 57.412 59.9599 47.4159H59.9759C59.9759 37.4202 57.1199 16 27.1318 16H8.5679C4.28409 16 0 20.2841 0 24.5682V47.4159V70.2639ZM27.1159 61.696H17.1361V33.1361H27.1318C38.556 33.1361 42.8401 38.848 42.8401 47.4159H42.8239C42.8239 55.9841 38.5401 61.696 27.1159 61.696Z"
          fill="#90B573"/>
</svg>
