<svg viewBox="0 0 438 70" fill="#000000" xmlns="http://www.w3.org/2000/svg">
    <path d="M412.317 19.0293H428.157C432.914 19.0293 437.672 14.2719 437.672 9.51481C437.672 4.7574 432.914 0 428.157 0H377.413C372.656 0 367.898 4.7574 367.898 9.51481C367.898 14.2719 372.656 19.0293 377.413 19.0293H393.288L393.285 60.2592C393.285 65.0166 398.042 69.7737 402.8 69.7737C407.557 69.7737 412.314 65.0166 412.314 60.2592L412.317 19.0293V19.0293Z"
    />
    <path d="M350.437 0C355.194 0 359.952 4.7574 359.952 9.51481C359.952 14.2719 355.194 19.0293 350.437 19.0293H299.71C294.953 19.0293 290.196 14.2719 290.196 9.51481C290.196 4.7574 294.953 0 299.71 0H350.437Z"
    />
    <path d="M358.383 25.3723C363.141 25.3723 367.898 30.1297 367.898 34.8868C367.898 39.6442 363.141 44.4016 358.383 44.4016H307.654C302.897 44.4016 298.139 39.6442 298.139 34.8868C298.139 30.1297 302.897 25.3723 307.654 25.3723H358.383V25.3723Z"
    />
    <path d="M364.731 50.7447C369.489 50.7447 374.246 55.5018 374.246 60.2592C374.246 65.0166 369.489 69.774 364.731 69.774H313.997C309.239 69.774 304.482 65.0166 304.482 60.2592C304.482 55.5018 309.239 50.7447 313.997 50.7447H364.731Z"
    />
    <path d="M266.424 9.51481C266.424 4.7574 271.181 0 275.938 0C280.696 0 285.453 4.7574 285.453 9.51481L285.456 60.2592C285.456 62.2396 284.631 64.2198 283.325 65.8572C282.99 66.3646 282.602 66.8302 282.162 67.24C281.564 67.7982 280.869 68.2534 280.113 68.6069C278.809 69.3411 277.375 69.774 275.941 69.774C274.948 69.774 273.956 69.5661 273.006 69.1949C271.348 68.7741 269.827 67.9628 268.715 66.7705L244.948 41.2317L237.865 33.6516V60.2592C237.865 65.0166 233.108 69.7737 228.351 69.7737C223.593 69.7737 218.836 65.0166 218.836 60.2592V9.5145C218.836 9.4927 218.837 9.47059 218.837 9.44848C218.808 6.75401 219.74 4.02733 221.599 2.29357C223.293 0.713978 225.756 -0.040759 228.213 0.00220587C228.258 0.00125812 228.304 0 228.351 0C228.819 0 229.287 0.0467485 229.751 0.134574C231.793 0.452387 233.713 1.33348 235.046 2.76333L258.865 28.2538L266.41 36.3609L266.424 9.51481V9.51481Z"
    />
    <path d="M177.21 39.2597L160.555 5.17879C158.47 0.903155 152.108 -1.28742 147.832 0.797957C143.557 2.88365 141.366 9.24498 143.452 13.5206L168.493 64.8232C169.999 67.9106 173.779 70.1123 177.21 69.9954C180.661 70.1135 184.408 67.9384 185.927 64.8229L210.969 13.5206C213.054 9.24498 210.864 2.88365 206.588 0.797957C202.312 -1.28742 195.951 0.903155 193.866 5.17879L177.21 39.2597Z"
    />
    <path d="M125.192 0C129.95 0 134.707 4.7574 134.707 9.51481C134.707 14.2719 129.95 19.0293 125.192 19.0293H74.4657C69.7083 19.0293 64.9512 14.2719 64.9512 9.51481C64.9512 4.7574 69.7083 0 74.4657 0H125.192Z"
    />
    <path d="M133.139 25.3723C137.896 25.3723 142.654 30.1297 142.654 34.8868C142.654 39.6442 137.896 44.4016 133.139 44.4016H82.4745C77.7174 44.4016 72.96 39.6442 72.96 34.8868C72.96 30.1297 77.7174 25.3723 82.4745 25.3723H133.139Z"
    />
    <path d="M139.487 50.7447C144.244 50.7447 149.001 55.5018 149.001 60.2592C149.001 65.0166 144.244 69.774 139.487 69.774H88.8175C84.0604 69.774 79.303 65.0166 79.303 60.2592C79.303 55.5018 84.0604 50.7447 88.8175 50.7447H139.487Z"
    />
    <path d="M9.5145 69.7737C5.51024 69.7737 0 65.0166 0 60.2592V34.8868V9.51481C0 4.7574 4.75741 0 9.5145 0H30.1294C63.4307 0 66.6022 23.7867 66.6022 34.8868H66.5845C66.5845 45.9872 63.413 69.774 30.1117 69.774L9.5145 69.7737ZM19.0293 50.7447H30.1117C42.798 50.7447 47.5551 44.4017 47.5551 34.8868H47.5731C47.5731 25.3723 42.8157 19.0293 30.1294 19.0293H19.0293V50.7447V50.7447Z"
    />
</svg>
