<svg viewBox="0 0 128 128" xmlns="http://www.w3.org/2000/svg">
    <style>
        @media (prefers-color-scheme: dark) { :root { fill: #90C787; } }
        @media (prefers-color-scheme: light) { :root { fill: #418450; } }
    </style>
    <path d="M80.1437 45.9302C108.051 45.9302 114.309 52.907 111.436 80.814H99.8085C101.963 59.8837 99.8769 57.5581 78.9467 57.5581H76.6211L76.3817 59.8837C74.2271 80.814 76.3133 83.1395 97.2435 83.1395L96.0465 94.7674C68.1395 94.7674 61.881 87.7907 64.7538 59.8837L66.1902 45.9302H80.1437ZM28.9809 45.9302C56.8879 45.9302 63.1464 52.907 60.2736 80.814H48.6457C50.8003 59.8837 48.7142 57.5581 27.7839 57.5581H25.4583L25.2189 59.8837C23.0643 80.814 25.1505 83.1395 46.0807 83.1395L44.8837 94.7674C16.9767 94.7674 10.7182 87.7907 13.591 59.8837L15.0274 45.9302H28.9809ZM55.7593 34.3023L55.2805 38.9535L32.7429 31.9767L33.2217 27.3256L55.7593 34.3023ZM67.6266 31.9767L91.6007 25L91.1219 29.6512L67.1478 36.6279L67.6266 31.9767ZM111.197 83.1395L110 94.7674H98.3721L99.5691 83.1395H111.197ZM83.3585 59.8837L82.8797 64.5349H78.2285L78.7073 59.8837H83.3585ZM32.1957 59.8837L31.7169 64.5349H27.0657L27.5445 59.8837H32.1957ZM60.0342 83.1395L58.8372 94.7674H47.2093L48.4063 83.1395H60.0342Z"/>
</svg>
