<svg viewBox="0 0 403 95" xmlns="http://www.w3.org/2000/svg">
    <path
            d="M199.85 47.2441L203.945 6.29922H219.693L215.598 47.2441C212.764 75.5906 215.598 78.7402 243.945 78.7402L242.37 94.4882C204.575 94.4882 196.071 85.0394 199.85 47.2441ZM311.661 94.4882C273.866 94.4882 265.362 85.0394 269.142 47.2441H284.89C282.055 75.5906 284.89 78.7402 313.236 78.7402H341.583L340.008 94.4882H311.661ZM363.945 75.5906L362.055 94.4882H346.307L348.197 75.5906C351.976 37.7953 362.37 28.3465 400.165 28.3465L398.591 44.0945C370.244 44.0945 366.78 47.2441 363.945 75.5906ZM220.638 28.3465C258.433 28.3465 266.937 37.7953 263.157 75.5906H247.409C250.244 47.2441 247.409 44.0945 219.063 44.0945L220.638 28.3465ZM289.929 28.3465C327.724 28.3465 336.228 37.7953 332.449 75.5906H316.701C319.535 47.2441 316.701 44.0945 288.354 44.0945L289.929 28.3465ZM286.78 28.3465L285.205 44.0945H269.457L271.032 28.3465H286.78ZM262.843 78.7402L261.268 94.4882H245.52L247.094 78.7402H262.843Z"
            fill="#90C787"/>
    <path
            d="M148.346 28.3465C186.142 28.3465 194.646 37.7953 190.866 75.5905H175.118C177.953 47.2441 175.118 44.0945 146.772 44.0945H143.622L143.307 47.2441C140.472 75.5905 143.307 78.7402 171.654 78.7402L170.079 94.4882C132.283 94.4882 123.78 85.0394 127.559 47.2441L129.449 28.3465H148.346ZM79.0551 28.3465C116.85 28.3465 125.354 37.7953 121.575 75.5905H105.827C108.661 47.2441 105.827 44.0945 77.4803 44.0945H74.3307L74.0157 47.2441C71.1811 75.5905 74.0158 78.7402 102.362 78.7402L100.787 94.4882C62.9921 94.4882 54.4882 85.0394 58.2677 47.2441L60.1575 28.3465H79.0551ZM19.8425 53.5433L15.748 94.4882H3.9175e-06L4.09449 53.5433C7.87402 15.748 18.2677 6.29921 56.063 6.29921L54.4882 22.0472C26.1417 22.0472 22.6772 25.1968 19.8425 53.5433ZM115.276 12.5984L114.646 18.8976L84.0945 9.44882L84.7244 3.14961L115.276 12.5984ZM131.339 9.44882L163.78 0L163.15 6.29921L130.709 15.748L131.339 9.44882ZM190.551 78.7402L188.976 94.4882H173.228L174.803 78.7402H190.551ZM152.756 47.2441L152.126 53.5433H145.827L146.457 47.2441H152.756ZM83.4646 47.2441L82.8346 53.5433H76.5354L77.1654 47.2441H83.4646ZM121.26 78.7402L119.685 94.4882H103.937L105.512 78.7402H121.26ZM44.0945 62.9921H22.0472L23.6221 47.2441H45.6693L44.0945 62.9921Z"
            fill="#418450"/>
</svg>
