^C:\USERS\НАСТЯ\SOURCE\REPOS\HW_16\HW_16\MAIN.CPP
C:\USERS\Настя\SOURCE\REPOS\HW_16\HW_16\DEBUG\VC141.PDB
C:\USERS\Настя\SOURCE\REPOS\HW_16\HW_16\DEBUG\VC141.IDB
C:\USERS\Настя\SOURCE\REPOS\HW_16\HW_16\DEBUG\MAIN.OBJ
