<?xml version="1.0" encoding="UTF-8"?>
<svg width="20px" height="20px" viewBox="0 0 20 20" version="1.1" xmlns="http://www.w3.org/2000/svg" xmlns:xlink="http://www.w3.org/1999/xlink">
    <!-- Generator: Sketch 52.5 (67469) - http://www.bohemiancoding.com/sketch -->
    <title>Icon / comments</title>
    <desc>Created with Sketch.</desc>
    <g id="Page-1" stroke="none" stroke-width="1" fill="none" fill-rule="evenodd">
        <g id="lk" transform="translate(-32.000000, -468.000000)" fill="#B50D10">
            <g id="left-menu">
                <g id="Icon-/-comments" transform="translate(30.000000, 466.000000)">
                    <path d="M19.99,2 L3.99,2 C2.89,2 2,2.9 2,4 L2,22 L5.99,18 L19.99,18 C21.09,18 21.99,17.1 21.99,16 L21.99,4 C21.99,2.9 21.09,2 19.99,2 Z M5.99,9 L17.99,9 L17.99,11 L5.99,11 L5.99,9 Z M13.99,14 L5.99,14 L5.99,12 L13.99,12 L13.99,14 Z M17.99,8 L5.99,8 L5.99,6 L17.99,6 L17.99,8 Z" id="icon/communication/chat_24px"></path>
                </g>
            </g>
        </g>
    </g>
</svg>