<?xml version="1.0" encoding="UTF-8"?>
<svg width="17px" height="12px" viewBox="0 0 17 12" version="1.1" xmlns="http://www.w3.org/2000/svg" xmlns:xlink="http://www.w3.org/1999/xlink">
    <!-- Generator: Sketch 53.2 (72643) - https://sketchapp.com -->
    <title>Path 2 Copy</title>
    <desc>Created with Sketch.</desc>
    <g id="Symbols" stroke="none" stroke-width="1" fill="none" fill-rule="evenodd" stroke-linecap="round">
        <g id="form-/-CheckBox-/-Active" transform="translate(-4.000000, -6.000000)" stroke="#FFFFFF" stroke-width="2">
            <path d="M5,12.1492537 L9.21826635,16.3675201 C9.60879064,16.7580444 10.2419556,16.7580444 10.6324799,16.3675201 L20,7" id="Path-2-Copy"></path>
        </g>
    </g>
</svg>