<svg xmlns="http://www.w3.org/2000/svg" xmlns:xlink="http://www.w3.org/1999/xlink" width="44" height="44" viewBox="0 0 44 44">
    <defs>
        <path id="a" d="M31 6h-6.747c.484-.353.897-.729 1.19-1.155.352-.509.555-1.091.553-1.677.003-.801-.374-1.529-.919-2.063C24.371.401 23.381-.004 22.308 0c-.979 0-2.017.325-3.026.981l-.001.001c-.615.404-1.104.952-1.533 1.537-.823 1.137-1.423 2.449-1.751 3.248a20.193 20.193 0 0 0-.664-1.446 13.577 13.577 0 0 0-1.088-1.802c-.429-.585-.918-1.133-1.533-1.537L12.71.981C11.7.325 10.662 0 9.684 0c-1.07-.003-2.062.401-2.769 1.104h-.001c-.545.534-.92 1.261-.918 2.061-.001.586.202 1.169.554 1.678.293.425.707.802 1.192 1.156H1a1.002 1.002 0 0 0-1 1v6a1.003 1.003 0 0 0 1 1h.996v13a1.002 1.002 0 0 0 1 1h26a.997.997 0 0 0 1-.999V14H31a1.003 1.003 0 0 0 1-1V7a1 1 0 0 0-1-1zm-12.456-.965c.26-.492.563-.997.884-1.423.319-.428.66-.771.945-.954l-.001.001C21.115 2.177 21.776 2 22.31 2c.586.003 1.027.201 1.358.525.258.262.325.462.327.642-.001.136-.039.306-.201.545-.162.237-.455.53-.919.831-.304.202-.882.429-1.546.603-.994.266-2.184.442-3.115.547.101-.211.21-.432.33-.658zM8.321 2.526c.333-.325.775-.523 1.362-.526.531 0 1.192.177 1.938.659l-.002-.001c.305.195.672.573 1.01 1.04.445.61.843 1.353 1.146 1.996-.464-.052-.986-.12-1.521-.21a16.595 16.595 0 0 1-1.835-.404c-.559-.161-1.035-.36-1.299-.535h-.001c-.465-.302-.759-.595-.921-.833-.162-.24-.2-.41-.202-.546.003-.18.069-.379.325-.64zM15 8v4H2V8h13zM3.996 14H15v12H3.996V14zm24 12H17V14h10.996v12zM30 12H17V8h13v4z"/>
    </defs>
    <g fill="none" fill-rule="evenodd" transform="translate(6 8)">
        <mask id="b" fill="#fff">
            <use xlink:href="#a"/>
        </mask>
        <g fill="#FFB200" mask="url(#b)">
            <path d="M-6-8h44v44H-6z"/>
        </g>
    </g>
</svg>
