<svg xmlns="http://www.w3.org/2000/svg" width="30" height="30" viewBox="0 0 30 30">
    <g fill="none" fill-rule="evenodd" stroke="#FFB200" stroke-linecap="round" stroke-linejoin="round" stroke-width="2">
        <path d="M4.733 18.736h6.53l.004 6.53M18.733 25.267v-6.534h6.534M25.267 11.27H18.73V4.735M11.267 4.733v6.532H4.733M29 29L18.733 18.733m-7.466-7.468L1 1M1 29l10.264-10.264m7.467-7.467L29 1"/>
    </g>
</svg>
