<svg xmlns="http://www.w3.org/2000/svg" xmlns:xlink="http://www.w3.org/1999/xlink" width="138" height="40" viewBox="0 0 138 40">
    <defs>
        <path id="a" d="M72.324 22.19a6.099 6.099 0 0 1 2.225 2.546c.502 1.051.756 2.22.756 3.473v9.296c0 .566-.204 1.048-.607 1.437a2.013 2.013 0 0 1-1.439.576 1.955 1.955 0 0 1-1.43-.584 1.952 1.952 0 0 1-.583-1.43v-8.967c0-2.356-.973-3.453-3.06-3.453-.978 0-1.864.256-2.632.762-.766.505-1.505 1.187-2.195 2.03v9.629c0 .566-.205 1.048-.608 1.437a2.01 2.01 0 0 1-1.438.576 1.955 1.955 0 0 1-1.43-.584 1.957 1.957 0 0 1-.584-1.43V16.264c0-.558.195-1.043.577-1.439.388-.404.87-.607 1.437-.607a1.98 1.98 0 0 1 1.446.599c.398.398.6.885.6 1.447v7.241c.596-.535 1.224-.99 1.877-1.361 1.038-.59 2.274-.89 3.67-.89 1.3 0 2.45.316 3.418.937zm10.23-.773c.582 0 1.074.196 1.463.584.387.389.584.88.584 1.462v14.042c0 .565-.205 1.05-.607 1.437a2.012 2.012 0 0 1-1.44.576 1.955 1.955 0 0 1-1.429-.584 1.954 1.954 0 0 1-.584-1.43v-14.04c0-.559.194-1.041.577-1.44a1.926 1.926 0 0 1 1.437-.607zm.132-6.71c.604 0 1.13.219 1.56.65.43.43.65.955.65 1.56v.13c0 .605-.22 1.13-.65 1.561-.43.432-.956.65-1.56.65h-.197c-.604 0-1.13-.218-1.56-.65-.43-.43-.65-.955-.65-1.56v-.131c0-.605.22-1.13.65-1.56.43-.431.955-.65 1.56-.65h.197zm20.292 6.71c.565 0 1.048.204 1.437.608.383.398.576.881.576 1.438 0 .27-.067.563-.204.895L99.09 37.975c-.196.448-.5.817-.909 1.101a2.378 2.378 0 0 1-1.39.442h-.327c-.504 0-.972-.148-1.39-.442a2.587 2.587 0 0 1-.906-1.093l-5.698-13.624c-.139-.33-.205-.624-.205-.896 0-.558.193-1.04.576-1.44a1.925 1.925 0 0 1 1.437-.606c.388 0 .758.112 1.096.333.337.22.585.5.738.834l.01.026 4.505 11.425 4.516-11.45c.151-.334.4-.615.737-.834.34-.222.708-.334 1.097-.334zM121.7 34.672c.488 0 .919.17 1.283.503.372.342.568.796.568 1.315 0 .47-.195 1.145-1.122 1.679-.887.501-1.775.881-2.64 1.132-.875.253-2.005.38-3.358.38-2.801 0-5.029-.818-6.62-2.435-1.591-1.614-2.398-3.894-2.398-6.778 0-1.618.301-3.134.895-4.503a7.86 7.86 0 0 1 2.81-3.405c1.266-.867 2.833-1.306 4.658-1.306 1.713 0 3.22.408 4.48 1.214a7.886 7.886 0 0 1 2.88 3.229c.644 1.324.971 2.786.971 4.345 0 .557-.189 1.036-.56 1.423-.378.391-.879.59-1.486.59h-10.465c.222 1.109.693 1.97 1.43 2.623.853.757 2.086 1.14 3.667 1.14.868 0 1.633-.081 2.272-.244a9.608 9.608 0 0 0 1.904-.712c.25-.127.53-.19.831-.19zm-10.136-6.12h8.457c-.11-.717-.337-1.333-.681-1.84-.433-.633-.973-1.107-1.602-1.401-1.287-.606-2.635-.606-3.925 0-.627.294-1.158.765-1.58 1.398-.338.505-.56 1.124-.669 1.843z"/>
        <linearGradient id="c" x1="0%" y1="100%" y2="0%">
            <stop offset="0%" stop-color="#FF9700"/>
            <stop offset="100%" stop-color="#FFCD00"/>
        </linearGradient>
        <path id="d" d="M22.91 31.78a3.97 3.97 0 1 1 0-7.94 3.97 3.97 0 0 1 0 7.94zM34.366 0h-22.91L0 19.84l11.455 19.842h22.91L45.821 19.84 34.365 0z"/>
    </defs>
    <g fill="none" fill-rule="evenodd">
        <mask id="b" fill="#fff">
            <use xlink:href="#a"/>
        </mask>
        <use fill="#FFF" xlink:href="#a"/>
        <g fill="url(#c)" mask="url(#b)">
            <path d="M-83.999-24.063h294.776v326.86H-83.999z"/>
        </g>
        <mask id="e" fill="#fff">
            <use xlink:href="#d"/>
        </mask>
        <use fill="#FFF" xlink:href="#d"/>
        <g fill="url(#c)" mask="url(#e)">
            <path d="M-83.999-142.375h295v327h-295z"/>
        </g>
    </g>
</svg>
