<svg xmlns="http://www.w3.org/2000/svg" xmlns:xlink="http://www.w3.org/1999/xlink" width="44" height="44" viewBox="0 0 44 44">
    <defs>
        <path id="a" d="M2.699 19.056c.628 2.422 1.87 4.775 3.564 6.633.157.17.323.332.488.493v8.693a1.124 1.124 0 1 0 2.25 0v-6.936c.171.104.343.212.521.305 1.216.633 2.564 1.008 3.98 1.008 1.414 0 2.762-.375 3.978-1.008.18-.094.348-.215.521-.32v6.951a1.124 1.124 0 1 0 2.25 0v-8.698a14.62 14.62 0 0 0 1.802-2.151c.093-.137.17-.286.258-.427.235-.08.468-.163.689-.25 1.107-.446 2.045-.982 2.764-1.66.357-.339.665-.719.885-1.149.22-.43.351-.917.351-1.42v-4.495c-.001-2.297-.14-4.337-.538-6.147-.297-1.354-.737-2.582-1.386-3.662-.968-1.622-2.428-2.881-4.348-3.665C18.805.362 16.438 0 13.5 0c-2.613.001-4.771.287-6.571.906-1.348.462-2.494 1.12-3.426 1.973C2.097 4.159 1.213 5.85.696 7.81.176 9.78.001 12.042 0 14.626c0 .143.032.278.08.403a3.376 3.376 0 0 0 2.619 4.027zm13.745 7.19c-.944.489-1.928.754-2.943.754-1.015 0-1.999-.265-2.943-.754-1.414-.729-2.72-1.975-3.745-3.487-1.028-1.51-1.773-3.279-2.105-4.996a1.131 1.131 0 0 0-1.22-.906l-.131.014a1.128 1.128 0 0 1-1.105-1.121 1.13 1.13 0 0 1 1.125-1.125 4.369 4.369 0 0 0 2.355-.705c1.044-.665 1.846-1.701 2.404-2.933.359-.8.604-1.699.74-2.649 1.436.446 3.029.66 4.626.663 1.594-.002 3.184-.214 4.617-.66.207 1.439.683 2.744 1.389 3.808.481.721 1.067 1.332 1.762 1.772a4.362 4.362 0 0 0 2.355.705 1.13 1.13 0 0 1 1.125 1.125 1.128 1.128 0 0 1-1.105 1.12l-.131-.014a1.128 1.128 0 0 0-1.218.907c-.257 1.333-.771 2.69-1.463 3.938-.277.08-.558.161-.859.228-1.555.356-3.39.568-5.349.568a1.124 1.124 0 1 0 0 2.25 28.166 28.166 0 0 0 4.196-.314c-.73.75-1.532 1.375-2.377 1.812zm8.201-6.73c-.11.221-.357.508-.742.803.147-.418.272-.835.384-1.26a3.08 3.08 0 0 0 .464-.14v.205a.837.837 0 0 1-.106.393zM3.853 5.977C4.597 4.75 5.598 3.871 7.13 3.233c1.53-.633 3.616-.984 6.371-.983 2.45-.001 4.37.276 5.838.782 1.103.381 1.957.883 2.641 1.507 1.02.935 1.703 2.172 2.149 3.848.314 1.182.49 2.586.57 4.18a3.325 3.325 0 0 0-1.073-.192c-.391-.001-.765-.115-1.149-.353-.571-.36-1.144-1.037-1.555-1.958-.416-.919-.672-2.069-.67-3.313 0-.01-.006-.019-.006-.025-.002-.073-.027-.145-.043-.216-.018-.075-.026-.153-.058-.22-.004-.01-.002-.018-.006-.024-.024-.05-.067-.08-.095-.123-.048-.071-.092-.146-.154-.204-.054-.05-.116-.08-.175-.117-.061-.04-.117-.085-.187-.113-.078-.029-.161-.036-.242-.048-.054-.012-.103-.036-.16-.036-.01 0-.018.006-.026.006-.072 0-.143.027-.215.043-.075.017-.154.025-.22.057-.01.004-.018.002-.025.006-1.339.653-3.239 1.018-5.134 1.013-1.9.005-3.796-.36-5.135-1.013-.009-.004-.018-.002-.025-.006-.07-.03-.145-.04-.22-.058-.072-.015-.143-.041-.215-.042-.012 0-.021-.006-.03-.006-.058 0-.106.024-.161.033-.082.012-.164.019-.242.048-.07.026-.125.07-.19.11-.06.037-.12.069-.172.116-.064.06-.106.132-.154.204-.03.044-.07.075-.095.123-.005.01-.002.018-.007.025-.03.07-.04.147-.057.22-.017.073-.043.144-.044.216 0 .009-.006.018-.006.026.003 1.663-.458 3.148-1.128 4.149-.334.5-.717.878-1.1 1.12a2.113 2.113 0 0 1-1.148.354c-.377 0-.732.076-1.07.19.068-1.34.2-2.554.43-3.605.254-1.171.623-2.159 1.116-2.978z"/>
    </defs>
    <g fill="none" fill-rule="evenodd" transform="translate(9 4)">
        <mask id="b" fill="#fff">
            <use xlink:href="#a"/>
        </mask>
        <g fill="#FFB200" mask="url(#b)">
            <path d="M-9-4h44v44H-9z"/>
        </g>
    </g>
</svg>
