<svg xmlns="http://www.w3.org/2000/svg" width="23" height="26" viewBox="0 0 23 26">
    <g fill="none" fill-rule="evenodd" stroke="#FFAD00" stroke-width="2" transform="translate(1 1)">
        <path stroke-linecap="round" stroke-linejoin="round" d="M0 0h21v8.826C20.858 15.502 16.734 21.46 10.498 24 4.263 21.46.14 15.501 0 8.826V0z"/>
        <circle cx="10.5" cy="10.5" r="3.5"/>
    </g>
</svg>
