<?xml version="1.0" encoding="UTF-8"?>
<svg width="26px" height="27px" viewBox="0 0 26 27" version="1.1" xmlns="http://www.w3.org/2000/svg" xmlns:xlink="http://www.w3.org/1999/xlink">
    <!-- Generator: Sketch 53.2 (72643) - https://sketchapp.com -->
    <title>Add Icon Copy 2</title>
    <desc>Created with Sketch.</desc>
    <g id="Форма" stroke="none" stroke-width="1" fill="none" fill-rule="evenodd">
        <g id="Hive_Step_2" transform="translate(-563.000000, -1514.000000)" fill="#FFFFFF">
            <g id="Bt-Загранпаспорт" transform="translate(539.000000, 1503.656250)">
                <path d="M42.1647143,27.2277143 C42.7032857,27.7662857 42.707,28.6298571 42.1684286,29.1702857 C41.6354286,29.7032857 40.7681429,29.707 40.2277143,29.1665714 L36.9981429,25.9388571 L33.7704286,29.1665714 C33.23,29.7032857 32.3682857,29.707 31.8297143,29.1702857 C31.2948571,28.6335714 31.293,27.77 31.8334286,27.2277143 L35.0611429,24 L31.8334286,20.7722857 C31.2985714,20.2355714 31.293,19.372 31.8297143,18.8315714 C32.3645714,18.2948571 33.2281429,18.293 33.7704286,18.8315714 L36.9981429,22.0592857 L40.2277143,18.8315714 C40.7644286,18.2967143 41.6317143,18.293 42.1684286,18.8315714 C42.7032857,19.3664286 42.707,20.2281429 42.1647143,20.7722857 L38.9388571,24 L42.1647143,27.2277143 Z M37,11 C29.8221429,11 24,16.8221429 24,24 C24,31.1778571 29.8221429,37 37,37 C44.1797143,37 50,31.1778571 50,24 C50,16.8221429 44.1797143,11 37,11 L37,11 Z" id="Add-Icon-Copy-2" transform="translate(37.000000, 24.000000) rotate(-315.000000) translate(-37.000000, -24.000000) "></path>
            </g>
        </g>
    </g>
</svg>