<svg xmlns="http://www.w3.org/2000/svg" width="30" height="38" viewBox="0 0 30 38">
    <g fill="none" fill-rule="evenodd" stroke="#BCBCBC" stroke-linecap="round" stroke-linejoin="round" stroke-width="2">
        <path d="M6.333 9H13M6.333 19.667h5.334m-5.334-5.334h5.334M6.333 25H9M29 1H1v32l4.067 4L9 34.333 13 37l4-2.667L21 37l4-2.667L29 37z"/>
        <path d="M17 12.883h5.372M17 15.17h5.372M23.915 9h-.638c-2.766 0-5.054 2.234-5.107 5 0 2.713 2.394 5 5.107 5h.638"/>
    </g>
</svg>
