<?xml version="1.0" encoding="UTF-8"?>
<svg width="18px" height="18px" viewBox="0 0 18 18" version="1.1" xmlns="http://www.w3.org/2000/svg" xmlns:xlink="http://www.w3.org/1999/xlink">
    <!-- Generator: Sketch 53.2 (72643) - https://sketchapp.com -->
    <title>Group</title>
    <desc>Created with Sketch.</desc>
    <defs>
        <path d="M8.875,8.61611652 L12.1830583,5.30805826 C12.4271359,5.06398058 12.8228641,5.06398058 13.0669417,5.30805826 C13.3110194,5.55213594 13.3110194,5.94786406 13.0669417,6.19194174 L9.75888348,9.5 L13.0669417,12.8080583 C13.3110194,13.0521359 13.3110194,13.4478641 13.0669417,13.6919417 C12.8228641,13.9360194 12.4271359,13.9360194 12.1830583,13.6919417 L8.875,10.3838835 L5.56694174,13.6919417 C5.32286406,13.9360194 4.92713594,13.9360194 4.68305826,13.6919417 C4.43898058,13.4478641 4.43898058,13.0521359 4.68305826,12.8080583 L7.99111652,9.5 L4.68305826,6.19194174 C4.43898058,5.94786406 4.43898058,5.55213594 4.68305826,5.30805826 C4.92713594,5.06398058 5.32286406,5.06398058 5.56694174,5.30805826 L8.875,8.61611652 Z" id="path-1"></path>
    </defs>
    <g id="Symbols" stroke="none" stroke-width="1" fill="none" fill-rule="evenodd">
        <g id="icon-/-info-/-close">
            <g id="Group">
                <circle id="Oval" fill="#FFB200" cx="9" cy="9" r="9"></circle>
                <mask id="mask-2" fill="white">
                    <use xlink:href="#path-1"></use>
                </mask>
                <use id="Mask" fill="#FFFFFF" fill-rule="nonzero" xlink:href="#path-1"></use>
            </g>
        </g>
    </g>
</svg>