<svg xmlns="http://www.w3.org/2000/svg" width="208" height="133" viewBox="0 0 208 133">
    <defs>
        <linearGradient id="a" x1="0%" y1="50%" y2="50%">
            <stop offset="0%" stop-color="#E2E1E0"/>
            <stop offset="14.46%" stop-color="#F9FCFF"/>
            <stop offset="38.04%" stop-color="#B4B3B2"/>
            <stop offset="68.71%" stop-color="#9D9D9D"/>
            <stop offset="76.41%" stop-color="#A2A2A2"/>
            <stop offset="85.3%" stop-color="#B0B0AF"/>
            <stop offset="94.75%" stop-color="#C7C7C6"/>
            <stop offset="100%" stop-color="#D7D7D6"/>
        </linearGradient>
    </defs>
    <g fill="none" fill-rule="evenodd">
        <path fill="#506180" d="M7.429 0H200.57C204.676 0 208 3.375 208 7.543v116.914c0 4.168-3.324 7.543-7.429 7.543H7.43C3.324 132 0 128.625 0 124.457V7.543C0 3.375 3.324 0 7.429 0z"/>
        <path fill="#233549" d="M46.4 3.385l9.834 17.33-9.833 17.301H26.706l-9.834-17.301 9.834-17.33H46.4zm9.834 51.932H75.92l9.834 17.311L75.92 89.93H56.234l-9.833-17.302 9.833-17.31zM26.706 72.628L16.872 89.93H0V55.317h16.872l9.834 17.311zM46.4 107.26l9.833 17.302L52.353 132l-31.228.019-4.253-7.458 9.834-17.302H46.4zm59.066 0l9.834 17.302-4.235 7.439-30.884.019-4.262-7.458 9.852-17.302h19.695zm59.02-103.874l9.852 17.301-9.852 17.302h-19.695l-9.824-17.302 9.824-17.301h19.695zm29.52 51.914l9.86 17.33-9.86 17.3h-19.668l-9.852-17.3 9.852-17.33h19.667zm-78.734 0h19.695l9.852 17.33-9.852 17.3h-19.695l-9.834-17.3 9.834-17.33zm49.214 51.932l9.852 17.302-4.262 7.486-30.856-.019-4.253-7.467 9.824-17.302h19.695zm29.52 17.302l9.833-17.302H208v17.226c0 4.168-3.324 7.543-7.429 7.543h-2.33l-4.235-7.467zM115.3 20.715l-9.862 17.301H85.754L75.92 20.715l9.834-17.33h19.685l9.862 17.33zm88.539-17.33h2.925A7.56 7.56 0 0 1 208 7.543v30.445h-4.16l-9.834-17.302 9.834-17.301z"/>
        <path fill="#051C2C" d="M105.44 38.016l9.833 17.301-9.834 17.311H85.754l-9.834-17.31 9.834-17.302h19.685zm-59.02 0l9.833 17.301-9.834 17.311H26.734L16.9 55.318l9.834-17.302h19.685zm9.814-17.301l-9.833-17.33L48.332 0h35.49l1.932 3.385-9.834 17.33H56.234zm-29.5-17.33l-9.862 17.33H0V7.543C0 3.375 3.324 0 7.429 0h17.373l1.932 3.385zm88.567 17.33l-9.834-17.33L107.38 0h35.509l1.931 3.385-9.834 17.33h-19.685zm59.02 0l-9.834-17.33L166.42 0h34.152c.483 0 .966.047 1.421.141l1.848 3.244-9.834 17.33h-19.685zM56.234 89.949H75.92l9.834 17.31-9.834 17.302H56.234l-9.833-17.302 9.833-17.31zm-29.5 17.31l-9.862 17.302H0V89.949h16.872l9.862 17.31zM115.3 89.95h19.685l9.834 17.31-9.834 17.302h-19.685l-9.834-17.302 9.834-17.31zm59.02 0h19.685l9.834 17.31-9.834 17.302h-19.685l-9.834-17.302 9.834-17.31zm-9.834-17.32h-19.695l-9.852-17.312 9.852-17.301h19.695l9.852 17.301-9.852 17.311zm39.353-34.613l4.16-.028v34.64h-4.16l-9.852-17.31 9.852-17.302z"/>
        <path fill="#FFF" d="M188.667 57.5a.938.938 0 0 1 .186-1.282.898.898 0 0 1 1.253.187c.307.458.585.926.753 1.478.195.524.287 1.104.287 1.694 0 .59-.102 1.188-.287 1.712a4.536 4.536 0 0 1-.753 1.479.898.898 0 0 1-1.253.187c-.4-.29-.474-.861-.186-1.263.204-.281.372-.618.492-.974.112-.364.186-.72.186-1.122 0-.384-.065-.768-.186-1.123a3.306 3.306 0 0 0-.492-.973zm3.074-1.694c-.26-.402-.121-.973.288-1.254a.878.878 0 0 1 1.225.29 9.149 9.149 0 0 1 1.328 4.744c0 1.74-.501 3.36-1.328 4.744a.892.892 0 0 1-1.225.29.907.907 0 0 1-.288-1.235 7.119 7.119 0 0 0 1.068-3.79 7.376 7.376 0 0 0-1.068-3.789zM195 54.112c-.26-.449-.12-1 .316-1.254a.917.917 0 0 1 1.225.337c1.115 1.881 1.728 4.08 1.728 6.41 0 2.34-.641 4.529-1.728 6.41-.26.43-.798.598-1.225.336a.93.93 0 0 1-.335-1.235 10.954 10.954 0 0 0 1.486-5.502c0-2.02-.52-3.883-1.467-5.502zm3.24-1.74c-.24-.421-.092-.973.354-1.254a.863.863 0 0 1 1.207.337 16.556 16.556 0 0 1 2.126 8.122c0 2.957-.78 5.736-2.126 8.122a.915.915 0 0 1-1.226.337.93.93 0 0 1-.334-1.235 14.549 14.549 0 0 0 1.894-7.215c0-2.62-.687-5.09-1.894-7.214z"/>
        <g fill="#FFF">
            <path d="M19.732 109.9c0-.187-.093-.356-.26-.496s-.38-.187-.594-.187c-.492 0-.827.29-1.012.832a5.499 5.499 0 0 0-.288 1.76c0 .645.093 1.263.288 1.805.185.571.52.833 1.012.833a.98.98 0 0 0 .613-.215.712.712 0 0 0 .26-.552h1.04c0 .496-.186.926-.567 1.263-.38.337-.808.477-1.328.477-.854 0-1.467-.355-1.847-1.076-.381-.72-.567-1.544-.567-2.498 0-1.001.186-1.834.548-2.545.38-.711.994-1.076 1.848-1.076.492 0 .947.168 1.328.477.38.309.566.711.566 1.216h-1.04v-.018z"/>
            <path fill-rule="nonzero" d="M23.846 113.324l-.492 2.022h-1.068l1.913-7.028h1.346l1.913 7.028H26.39l-.492-2.022h-2.052zm1.04-4.023l-.78 3.05h1.532l-.752-3.05zM30.086 115.355h-1.068v-7.027h2.033c.66 0 1.208.168 1.635.524.427.355.613.86.613 1.544 0 .477-.121.86-.353 1.216-.232.337-.595.552-1.04.646l1.82 3.116h-1.207l-1.607-2.91h-.854v2.882l.028.009zm.78-3.883c.473 0 .808-.075 1.04-.234.232-.169.334-.45.334-.908 0-.43-.12-.711-.353-.833-.232-.14-.594-.215-1.04-.215h-.78v2.17h.808l-.01.02zM35.36 108.3h.66c1.04 0 1.912.355 2.627 1.048.687.692 1.04 1.572 1.04 2.62s-.334 1.88-.966 2.48c-.64.598-1.485.907-2.553.907h-.808V108.3zm1.068 6.072c.66 0 1.207-.234 1.606-.692.4-.45.595-1.02.595-1.712 0-.693-.214-1.282-.613-1.834a1.877 1.877 0 0 0-1.588-.814v5.052z"/>
            <path d="M42.473 112.183v3.172h-1.059v-7.027h1.068v2.91h2.312v-2.91h1.068v7.027h-1.068v-3.172z"/>
            <path fill-rule="nonzero" d="M52.353 111.827a5.16 5.16 0 0 1-.613 2.48c-.427.758-1.04 1.123-1.848 1.123-.826 0-1.44-.384-1.848-1.123-.427-.74-.613-1.572-.613-2.498 0-.861.214-1.694.641-2.452.427-.758 1.04-1.142 1.848-1.142s1.42.384 1.848 1.17c.371.777.585 1.581.585 2.442zm-3.872.047c0 .646.093 1.235.306 1.787.214.552.567.814 1.114.814.52 0 .901-.29 1.115-.832a4.836 4.836 0 0 0 .306-1.76c0-.664-.093-1.282-.306-1.834-.186-.552-.567-.832-1.115-.832-.547 0-.9.29-1.114.832-.213.562-.306 1.18-.306 1.825z"/>
            <path d="M58.76 114.372v.974h-4.634v-7.028h1.068v6.073h3.566v-.019z"/>
            <path fill-rule="nonzero" d="M60.394 108.3h.66c1.04 0 1.912.355 2.627 1.048.688.692 1.04 1.572 1.04 2.62s-.334 1.88-.965 2.48c-.641.598-1.486.907-2.554.907h-.808V108.3zm1.059 6.072c.66 0 1.207-.234 1.606-.692.4-.45.595-1.02.595-1.712 0-.693-.214-1.282-.613-1.834a1.877 1.877 0 0 0-1.588-.814v5.052z"/>
            <path d="M67.72 111.182h2.721v.973h-2.72v2.217h3.24v.974h-4.299v-7.028h4.188v.973h-3.12c-.01.01-.01 1.89-.01 1.89z"/>
            <path fill-rule="nonzero" d="M73.868 115.355H72.8v-7.027h2.034c.659 0 1.207.168 1.634.524.427.355.613.86.613 1.544 0 .477-.121.86-.353 1.216-.232.337-.594.552-1.04.646l1.82 3.116H76.3l-1.607-2.91h-.854v2.882l.028.009zm.78-3.883c.473 0 .808-.075 1.04-.234.232-.169.334-.45.334-.908 0-.43-.12-.711-.353-.833-.232-.14-.594-.215-1.04-.215h-.78v2.17h.808v.02h-.01z"/>
            <path d="M88.753 108.3h.966v7.027h-1.161l-2.48-5.334-.027 5.334h-.966V108.3h1.226l2.414 5.1z"/>
            <path fill-rule="nonzero" d="M92.634 113.324l-.492 2.022h-1.068l1.913-7.028h1.347l1.912 7.028H95.18l-.493-2.022h-2.052zm1.04-4.023l-.78 3.05h1.532l-.752-3.05z"/>
            <path d="M100.74 108.3h1.635v7.027h-1.068v-5.858l-.966 3.593h-.854l-.947-3.574-.028 5.858h-1.068v-7.028h1.635l.807 2.714zM105.254 111.182h2.72v.973h-2.72v2.217h3.24v.974h-4.299v-7.028h4.188v.973h-3.12v1.89h-.01z"/>
            <g>
                <path d="M67.34 95.246H68l.919 2.93.947-2.93h.659l-1.254 3.696h-.733z"/>
                <path fill-rule="nonzero" d="M71.88 95.246h.688l1.42 3.696h-.705l-.353-.973h-1.467l-.353.973h-.66l1.43-3.696zm-.24 2.246h1.114l-.548-1.6h-.028l-.539 1.6z"/>
                <path d="M74.314 95.246h.64v3.144h1.867v.552h-2.507v-3.696zM77.266 95.246h.641v3.696h-.64z"/>
                <path fill-rule="nonzero" d="M78.706 95.246h1.513c.288 0 .52.047.734.14.213.094.38.235.492.403.14.169.232.356.288.599.074.215.093.477.093.711 0 .262-.028.496-.093.711a2.38 2.38 0 0 1-.288.6c-.14.168-.306.308-.492.401-.214.094-.446.14-.734.14h-1.513v-3.705zm.64 3.191h.641c.26 0 .446-.028.613-.093a.942.942 0 0 0 .38-.29c.094-.122.14-.262.186-.43.028-.17.047-.338.047-.525s-.028-.355-.047-.524a.942.942 0 0 0-.566-.72c-.167-.075-.353-.094-.613-.094h-.64v2.676z"/>
                <path d="M67.386 100.44h2.981v.57h-1.16v3.144h-.641v-3.144h-1.152v-.57zM70.794 100.44h.641v1.478h1.68v-1.478h.641v3.696h-.64v-1.666h-1.681v1.666h-.64z"/>
                <path fill-rule="nonzero" d="M74.5 100.44h1.745c.4 0 .706.093.92.262.213.168.306.43.306.739 0 .168-.028.337-.075.43a.971.971 0 0 1-.185.29.47.47 0 0 1-.214.14c-.074.029-.12.047-.14.076.047 0 .122.028.187.046.065.019.12.075.185.14.047.076.093.141.14.235.046.093.046.215.046.355 0 .215.028.403.046.599a.974.974 0 0 0 .14.384h-.687a.798.798 0 0 1-.093-.262c0-.094-.028-.187-.028-.29 0-.169 0-.31-.028-.43-.028-.122-.046-.216-.12-.31a.529.529 0 0 0-.214-.187c-.093-.047-.214-.047-.353-.047h-.947v1.526h-.641l.01-3.696c-.01 0 0 0 0 0zm.668 1.693h1.068c.213 0 .353-.047.473-.14a.607.607 0 0 0 .167-.45c0-.12-.027-.214-.046-.29-.028-.074-.074-.14-.14-.168-.074-.047-.12-.075-.213-.075-.074-.028-.167-.028-.232-.028h-1.068l-.01 1.151z"/>
                <path d="M78.093 100.44h.64v2.17c0 .122 0 .262.028.384 0 .122.047.234.093.337.047.094.14.187.26.262.121.075.288.094.492.094.214 0 .381-.029.493-.094a.701.701 0 0 0 .352-.599c.028-.122.028-.262.028-.384v-2.17h.641v2.358c0 .234-.046.449-.12.617-.075.169-.168.337-.307.45-.14.12-.288.215-.474.261-.185.047-.399.094-.613.094a1.87 1.87 0 0 1-.612-.094 1.024 1.024 0 0 1-.474-.262 1.104 1.104 0 0 1-.306-.449 1.555 1.555 0 0 1-.121-.617v-2.358z"/>
            </g>
            <g>
                <path fill-rule="nonzero" d="M95.847 98.372c0 .402-.12.71-.334 1-.232.263-.548.525-.947.815.492.234.9.552 1.16.908.26.355.4.786.4 1.31 0 .71-.232 1.235-.687 1.6-.474.337-1.068.496-1.793.496-.752 0-1.346-.169-1.82-.496-.445-.337-.687-.861-.687-1.6 0-.524.14-.974.4-1.31.26-.356.659-.646 1.16-.908-.52-.337-.854-.646-1.012-.908a1.734 1.734 0 0 1-.26-.88c0-.551.214-.972.66-1.262.445-.29.947-.403 1.56-.403.594 0 1.114.14 1.56.403.399.252.64.683.64 1.235zm-.78 3.93c0-.43-.14-.758-.446-.973a9.442 9.442 0 0 0-.993-.618c-.492.262-.854.496-1.087.711-.232.215-.352.524-.352.88 0 .402.139.71.427.907.288.216.613.31 1.012.31.4 0 .733-.094 1.012-.31.288-.196.427-.505.427-.907zm-2.6-3.837c0 .262.12.496.353.693.232.187.492.355.808.477.306-.122.566-.29.808-.477.232-.187.353-.43.353-.693 0-.29-.121-.496-.335-.617-.232-.122-.492-.169-.808-.169-.306 0-.566.075-.807.187-.251.122-.372.31-.372.6zM102.087 98.372c0 .402-.12.71-.334 1-.232.263-.548.525-.947.815.492.234.9.552 1.16.908.26.355.4.786.4 1.31 0 .71-.232 1.235-.687 1.6-.474.337-1.068.496-1.793.496-.752 0-1.346-.169-1.82-.496-.445-.337-.687-.861-.687-1.6 0-.524.14-.974.4-1.31.26-.356.659-.646 1.16-.908-.52-.337-.854-.646-1.012-.908a1.648 1.648 0 0 1-.26-.88c0-.551.214-.972.66-1.262.445-.29.947-.403 1.56-.403.594 0 1.114.14 1.56.403.427.252.64.683.64 1.235zm-.78 3.93c0-.43-.14-.758-.446-.973a9.442 9.442 0 0 0-.993-.618c-.492.262-.854.496-1.087.711-.232.215-.352.496-.352.88 0 .402.139.71.427.907.288.216.613.31 1.012.31.4 0 .733-.094 1.012-.31.306-.196.427-.505.427-.907zm-2.581-3.837c0 .262.12.496.353.693.232.187.492.355.807.477.307-.122.567-.29.808-.477.232-.187.353-.43.353-.693 0-.29-.12-.496-.334-.617-.232-.122-.492-.169-.808-.169-.316 0-.566.075-.808.187-.25.122-.371.31-.371.6z"/>
                <path d="M108.188 96.706l-3.092 7.673h-1.04l3.073-7.673z"/>
                <path fill-rule="nonzero" d="M114.586 98.372c0 .402-.121.71-.335 1-.232.263-.547.525-.947.815.492.234.901.552 1.161.908.26.355.4.786.4 1.31 0 .71-.233 1.235-.688 1.6-.473.337-1.068.496-1.792.496-.752 0-1.346-.169-1.82-.496-.446-.337-.687-.861-.687-1.6 0-.524.14-.974.4-1.31.26-.356.658-.646 1.16-.908-.52-.337-.854-.646-1.012-.908a1.734 1.734 0 0 1-.26-.88c0-.551.213-.972.659-1.262.446-.29.947-.403 1.56-.403.594 0 1.114.14 1.56.403.427.252.64.683.64 1.235zm-.752 3.93c0-.43-.14-.758-.446-.973a9.442 9.442 0 0 0-.994-.618c-.492.262-.854.496-1.086.711-.232.215-.353.496-.353.88 0 .402.14.71.427.907.288.216.613.31 1.012.31.4 0 .734-.094 1.012-.31.288-.196.428-.505.428-.907zm-2.6-3.837c0 .262.12.496.352.693.233.187.493.355.808.477.307-.122.567-.29.808-.477.232-.187.353-.43.353-.693 0-.29-.12-.496-.334-.617-.232-.122-.492-.169-.808-.169-.307 0-.567.075-.808.187-.25.122-.371.31-.371.6zM120.854 98.372c0 .402-.121.71-.335 1-.232.263-.548.525-.947.815.492.234.9.552 1.16.908.26.355.4.786.4 1.31 0 .71-.232 1.235-.687 1.6-.474.337-1.068.496-1.792.496-.752 0-1.347-.169-1.82-.496-.446-.337-.687-.861-.687-1.6 0-.524.139-.974.399-1.31.26-.356.66-.646 1.16-.908-.52-.337-.854-.646-1.011-.908a1.648 1.648 0 0 1-.26-.88c0-.551.213-.972.659-1.262.446-.29.947-.403 1.56-.403.594 0 1.114.14 1.56.403.427.252.64.683.64 1.235zm-.78 3.93c0-.43-.14-.758-.446-.973a9.442 9.442 0 0 0-.994-.618c-.492.262-.854.496-1.086.711-.232.215-.353.496-.353.88 0 .402.14.71.427.907.288.216.613.31 1.012.31.4 0 .734-.094 1.012-.31.288-.196.428-.505.428-.907zm-2.582-3.837c0 .262.12.496.353.693.232.187.492.355.808.477.306-.122.566-.29.808-.477.232-.187.353-.43.353-.693 0-.29-.121-.496-.335-.617-.232-.122-.492-.169-.808-.169-.306 0-.566.075-.807.187-.27.122-.372.31-.372.6z"/>
            </g>
            <g>
                <path fill-rule="nonzero" d="M24.06 90.699a.837.837 0 0 0-.214-.477.67.67 0 0 0-.492-.188c-.14 0-.26.029-.381.075a.801.801 0 0 0-.26.216 3.305 3.305 0 0 0-.14.308 1.675 1.675 0 0 0-.092.356 1.607 1.607 0 0 0-.047.384c0 .121-.028.233-.028.336l.028.028c.093-.187.26-.336.427-.43.186-.094.381-.14.595-.14.232 0 .445.046.64.121.186.075.353.187.474.337.14.14.232.309.306.524.075.187.093.403.093.646 0 .234-.046.449-.12.645a1.483 1.483 0 0 1-.335.524 1.9 1.9 0 0 1-.492.356 1.73 1.73 0 0 1-.66.122 1.98 1.98 0 0 1-.872-.187c-.232-.14-.4-.31-.548-.553-.14-.233-.213-.495-.26-.814a6.754 6.754 0 0 1-.074-1c0-.29.028-.572.093-.88.074-.29.167-.571.306-.814.14-.234.334-.43.567-.6.232-.14.52-.233.854-.233.186 0 .38.028.548.093.167.075.306.14.445.262.14.122.233.262.307.403.074.168.12.337.14.552h-.809v.028zm-.734 3.05c.139 0 .26-.028.38-.093.093-.047.186-.14.26-.216.075-.093.121-.187.168-.308.027-.122.046-.234.046-.384s-.028-.262-.046-.384a.768.768 0 0 0-.168-.308.801.801 0 0 0-.26-.216.89.89 0 0 0-.38-.074c-.14 0-.26.028-.381.074a.59.59 0 0 0-.26.216c-.074.093-.12.187-.167.308-.047.122-.047.234-.047.384s.028.262.047.384a.662.662 0 0 0 .167.308.801.801 0 0 0 .26.216.72.72 0 0 0 .38.093z"/>
                <path d="M28.72 94.32h-3.286c0-.402.092-.758.287-1.048.186-.309.446-.552.753-.786.167-.122.306-.234.492-.337.167-.121.334-.215.473-.355.14-.122.26-.262.353-.403a.885.885 0 0 0 .14-.496c0-.093 0-.187-.028-.29-.028-.093-.075-.187-.121-.29a.72.72 0 0 0-.232-.215.898.898 0 0 0-.4-.094c-.167 0-.287.028-.38.094-.093.075-.186.14-.232.262a.908.908 0 0 0-.14.384c-.028.14-.046.308-.046.477h-.827c0-.262.028-.524.093-.74.075-.233.167-.43.307-.598.139-.169.306-.29.52-.384a1.73 1.73 0 0 1 .705-.14c.288 0 .548.047.734.14.186.094.353.215.474.356.12.14.213.308.26.477.046.168.074.337.074.496 0 .187-.028.355-.093.524a2.07 2.07 0 0 1-.232.43c-.093.14-.214.262-.353.356-.12.121-.26.215-.4.309-.139.093-.287.187-.399.29-.139.093-.26.168-.38.262-.121.093-.214.168-.307.262a.808.808 0 0 0-.185.308h2.34v.74h.037v.009z"/>
                <path fill-rule="nonzero" d="M30.086 93.085a.837.837 0 0 0 .213.477.67.67 0 0 0 .492.187c.205 0 .381-.047.493-.168.12-.122.213-.262.287-.43.075-.17.121-.356.14-.553.028-.187.046-.355.046-.524l-.028-.028c-.093.187-.26.337-.427.43-.167.122-.353.17-.594.17-.242 0-.427-.048-.613-.123a1.16 1.16 0 0 1-.474-.336 1.433 1.433 0 0 1-.306-.496 1.879 1.879 0 0 1-.12-.665c0-.234.046-.449.12-.645.074-.187.186-.384.334-.524.14-.14.307-.262.52-.356.214-.075.446-.122.706-.122.334 0 .613.075.826.188.214.14.4.308.52.552.121.234.214.496.26.814.047.309.075.645.075.973 0 .29-.028.57-.093.88-.074.29-.167.57-.307.814-.139.233-.334.43-.566.598-.232.14-.52.234-.854.234-.186 0-.381-.028-.548-.093a1.647 1.647 0 0 1-.446-.262 1.362 1.362 0 0 1-.306-.403 1.66 1.66 0 0 1-.14-.552h.78l.01-.037zm.761-3.05c-.14 0-.26.028-.38.074a.801.801 0 0 0-.26.216c-.075.093-.121.187-.168.308a1.607 1.607 0 0 0-.046.384c0 .14.028.262.046.384a.662.662 0 0 0 .167.308.801.801 0 0 0 .26.216.878.878 0 0 0 .381.093.92.92 0 0 0 .38-.075.59.59 0 0 0 .26-.215c.075-.093.122-.215.168-.337.046-.121.046-.262.046-.383 0-.122-.027-.262-.046-.384a1.092 1.092 0 0 0-.167-.309.801.801 0 0 0-.26-.215.927.927 0 0 0-.38-.066z"/>
                <path d="M33.16 90.268c.166 0 .334-.028.473-.046.167-.028.306-.075.427-.14.12-.076.232-.141.334-.235.093-.093.14-.215.167-.383h.641V94.3h-.854v-3.406h-1.18c-.009-.01-.009-.627-.009-.627z"/>
            </g>
            <g>
                <path fill-rule="nonzero" d="M21.933 74.268l1.068.028c.074 0 .139.047.185.093l.028 4.595.186.046 3.5.029.428.121.334.215.353.45.186.645v3.238l-.121.402-.186.337-.26.29-.473.337-.195.056h-3.78l-.492-.094-.334-.215-.26-.309-.353-.71v-8.955l.047-.496.139-.103zm1.866 6.194l-.473.384-.112.327-.046.384v1.497l.213.402.26.169.353.047 2.08.028c.093-.028.186-.047.288-.122l.232-.187.075-.356v-1.927l-.233-.384-.26-.187-.352-.075h-2.025z"/>
                <path d="M31.813 74.268h3.426l.752.121.548.31.353.495.186.692v2.957l-.074.43-.14.29-.38.478-.548.309-.353.075-2.554.028-.353.075-.26.168a.592.592 0 0 0-.185.234l-.121.309v2.433h4.42l.4.028c.074.093.12.187.12.308v.861a.727.727 0 0 1-.167.29h-5.98a.445.445 0 0 1-.232-.187l-.028-4.192.046-.43.121-.356.38-.496.233-.187.64-.234.381-.028 2.554-.028.288-.187.185-.234.121-.309.047-.383v-1.31l-.075-.337-.185-.262-.26-.187-.381-.075-2.554-.028-.26.187-.288.14-.38-.028-.335-.093a.477.477 0 0 1-.213-.216v-.692l.046-.122.186-.234.548-.337.325-.046z"/>
                <path fill-rule="nonzero" d="M41.08 74.22h3.807l.38.17.307.233.26.29.186.356.093.43.028 9.264-.121.168-.232.047h-.827l-.185-.047-.093-.187-.028-4.5h-3.38l-.232-.047-.38-.122-.493-.309-.12-.14-.26-.571-.094-.45-.027-2.45.046-.787.353-.71.288-.29.334-.216.39-.131zm.66 1.451l-.26.187-.186.216-.121.308-.047.403v1.525l.26.356.26.168.734.122h1.7l.26-.188.185-.215.12-.29.029-1.927-.047-.122-.186-.262-.232-.187-.353-.094H41.74z"/>
                <path d="M51.452 74.268h.567l.287.29.047.234.046.496V83.7l.214.046 2.22.029.073.215v.86l-.046.235-.186.093h-5.859l-.26-.047-.093-.187v-.86l.047-.235.185-.093h2.22l.027-7.57-.232-.047-.213-.075-.121-.168-.046-.234.027-.234.168-.384.733-.664zM65.706 74.24h5.905l.168.046.027.29v.88a.727.727 0 0 1-.167.29h-4.605v3.266h3.24l.734.14.52.337.353.524.12.337.047.355-.028 3.004-.074.356-.288.57-.26.188-.548.308-.353.075-3.686.028-.446-.121-.548-.31a.628.628 0 0 1-.186-.233l-.027-.43.046-.384.232-.187.307-.187.352.046.641.234.38.047h2.127l.353-.075.26-.168.186-.234.046-.356.028-1.712-.306-.552-.706-.14-3.854-.029a.44.44 0 0 1-.12-.308v-5.577a.855.855 0 0 1 .13-.318zM74.592 74.24h5.906l.167.046.028.29v.88a.727.727 0 0 1-.167.29H75.92v3.266h3.24l.734.14.52.337.353.524.12.337.047.355-.028 3.004-.074.356-.288.57-.26.188-.548.308-.352.075-3.687.028-.446-.121-.547-.31a.628.628 0 0 1-.186-.233l-.028-.43.046-.384.233-.187.334-.187.353.046.64.234.381.047h2.127l.352-.075.26-.168.186-.234.047-.356.027-1.712-.306-.552-.706-.14-3.853-.029a.44.44 0 0 1-.121-.308v-5.577a.676.676 0 0 1 .102-.318z"/>
                <path fill-rule="nonzero" d="M84.946 74.268h3.5l.4.121.334.234.26.29.214.337.074.187.093.45-.028 7.785-.047.215-.26.552-.12.168-.288.262-.38.169-.428.093h-3.5l-.4-.14-.446-.356-.12-.168-.288-.524-.047-.215-.046-3.481.046-4.576.093-.43.12-.187.354-.43.167-.094.38-.187.363-.075zm.473 1.45l-.26.094-.167.187-.167.552v6.475l.306.43.233.122.287.075h2.127l.288-.075.167-.187.093-.234.046-.337v-6.475l-.26-.43-.232-.14-.306-.029h-2.155v-.028z"/>
                <path d="M95.234 74.268h.567l.288.29.046.234.046.496V83.7l.214.046 2.22.029.074.215v.86l-.047.235-.186.093h-5.859l-.26-.047-.093-.187v-.86l.047-.235.185-.093h2.22l.018-7.589-.232-.047-.213-.074-.121-.169-.047-.234.028-.234.167-.383.734-.665z"/>
                <path fill-rule="nonzero" d="M110.806 74.22l3.473.029.26.047.427.187.353.29.26.402.14.496.027.262.028 1.91-.167.476-.288.356-.808.786-.213.29 1.18 1.188.26.384.046.262v1.928l-.047.29-.074.262-.353.598-.167.169-.186.122-.706.233-3.166.029-.566-.075-.428-.187-.352-.262-.233-.43-.167-.478-.046-1.88.093-.553.093-.215.139-.187 1.18-1.217-1.04-1.02-.289-.355-.12-.215-.047-.262v-1.91l.093-.551.353-.6.167-.168.38-.262.511-.168zm.595 1.47l-.288.168-.214.188-.093.336-.027.712.092.402 1.04 1.02.26.14.307.094h.213l.613-.403.827-.832.12-.29.047-.356v-.337l-.093-.43-.186-.216-.232-.187-.334-.028H111.4v.019zm1.012 4.79l-.706.572-.613.645-.185.234-.093.337v.814l.167.29.213.169.288.14h2.08c.121 0 .232-.028.353-.094l.214-.215.139-.262.074-.355v-.43l-.093-.338-.139-.29-.186-.234-.64-.645-.492-.356-.381.019zM119.767 74.22l3.473.029.26.047.427.187.353.29.26.402.14.496.027.262.028 1.91-.167.476-.288.356-.808.786-.213.29 1.179 1.188.26.384.046.262v1.928l-.046.29-.074.262-.353.598-.167.169-.186.122-.706.233-3.166.029-.567-.075-.427-.187-.353-.262-.232-.43-.167-.478-.046-1.88.092-.553.093-.215.14-.187 1.179-1.217-1.04-1.02-.288-.355-.12-.215-.047-.262v-1.91l.093-.551.353-.6.167-.168.38-.262.511-.168zm.613 1.47l-.288.168-.213.188-.093.336-.028.712.093.402 1.04 1.02.26.14.306.094h.214l.613-.403.826-.832.12-.29.047-.356v-.337l-.093-.43-.185-.216-.233-.187-.38-.028c0 .019-2.006.019-2.006.019zm.994 4.79l-.706.572-.613.645-.186.234-.093.337v.814l.168.29.213.169.288.14h2.08c.12 0 .232-.028.353-.094l.213-.215.14-.262.074-.355v-.43l-.093-.338-.14-.29-.185-.234-.64-.645-.493-.356-.38.019zM128.746 74.22l3.473.029.26.047.427.187.353.29.26.402.14.496.027.262.028 1.91-.167.476-.288.356-.808.786-.213.29 1.18 1.188.26.384.046.262v1.928l-.047.29-.074.262-.353.598-.167.169-.186.122-.706.233-3.166.029-.566-.075-.428-.187-.352-.262-.233-.43-.167-.478-.046-1.88.093-.553.093-.215.139-.187 1.18-1.217-1.04-1.02-.289-.355-.12-.215-.047-.262v-1.91l.093-.551.353-.6.167-.168.38-.262.511-.168zm.595 1.47l-.288.168-.214.188-.093.336-.027.712.092.402 1.04 1.02.26.14.307.094h.213l.613-.403.827-.832.12-.29.047-.356v-.337l-.093-.43-.186-.216-.232-.187-.38-.028c0 .019-2.006.019-2.006.019zm1.012 4.79l-.706.572-.613.645-.185.234-.093.337v.814l.167.29.213.169.288.14h2.08c.121 0 .232-.028.353-.094l.214-.215.139-.262.074-.355v-.43l-.093-.338-.139-.29-.186-.234-.64-.645-.492-.356-.381.019zM137.707 74.22l3.473.029.26.047.427.187.353.29.26.402.14.496.027.262.028 1.91-.167.476-.288.356-.808.786-.213.29 1.179 1.188.26.384.046.262v1.928l-.046.29-.074.262-.353.598-.167.169-.186.122-.706.233-3.166.029-.567-.075-.427-.187-.353-.262-.232-.43-.167-.478-.046-1.88.092-.553.093-.215.14-.187 1.179-1.217-1.04-1.02-.288-.355-.12-.215-.047-.262v-1.91l.093-.551.353-.6.167-.168.38-.262.511-.168zm.585 1.47l-.288.168-.213.188-.093.336-.028.712.093.402 1.04 1.02.26.14.306.094h.214l.613-.403.826-.832.12-.29.047-.356v-.337l-.093-.43-.185-.216-.232-.187-.381-.028c.01.019-2.006.019-2.006.019zm1.022 4.79l-.706.572-.613.645-.186.234-.093.337v.814l.168.29.213.169.288.14h2.08c.12 0 .232-.028.353-.094l.213-.215.14-.262.074-.355v-.43l-.093-.338-.14-.29-.185-.234-.64-.645-.474-.31-.4-.027zM154.746 74.22l3.473.029.26.047.427.187.353.29.26.402.14.496.027.262.028 1.91-.167.476-.288.356-.808.786-.213.29 1.18 1.188.26.384.046.262v1.928l-.047.29-.074.262-.353.598-.167.169-.186.122-.706.233-3.166.029-.566-.075-.428-.187-.352-.262-.233-.43-.167-.478-.046-1.88.093-.553.093-.215.139-.187 1.18-1.217-1.04-1.02-.289-.355-.12-.215-.047-.262v-1.91l.093-.551.353-.6.167-.168.38-.262.511-.168zm.595 1.47l-.288.168-.214.188-.093.336-.027.712.092.402 1.04 1.02.26.14.307.094h.213l.613-.403.827-.832.12-.29.047-.356v-.337l-.093-.43-.186-.216-.232-.187-.38-.028c0 .019-2.006.019-2.006.019zm1.012 4.79l-.706.572-.613.645-.185.234-.093.337v.814l.167.29.213.169.288.14h2.08c.121 0 .232-.028.353-.094l.214-.215.139-.262.074-.355v-.43l-.093-.338-.139-.29-.186-.234-.64-.645-.492-.356-.381.019zM163.707 74.22l3.473.029.26.047.427.187.353.29.26.402.14.496.027.262.028 1.91-.167.476-.288.356-.808.786-.213.29 1.179 1.188.26.384.046.262v1.928l-.046.29-.074.262-.353.598-.167.169-.186.122-.706.233-3.166.029-.567-.075-.427-.187-.353-.262-.232-.43-.167-.478-.046-1.88.092-.553.093-.215.14-.187 1.179-1.217-1.04-1.02-.288-.355-.12-.215-.047-.262v-1.91l.093-.551.353-.6.167-.168.38-.262.511-.168zm.613 1.47l-.288.168-.213.188-.093.336-.028.712.093.402 1.04 1.02.26.14.306.094h.214l.613-.403.826-.832.12-.29.047-.356v-.337l-.093-.43-.185-.216-.233-.187-.38-.028c0 .019-2.006.019-2.006.019zm.994 4.79l-.706.572-.613.645-.186.234-.093.337v.814l.168.29.213.169.288.14h2.08c.12 0 .232-.028.353-.094l.213-.215.14-.262.074-.355v-.43l-.093-.338-.14-.29-.185-.234-.64-.645-.493-.356-.38.019zM172.686 74.22l3.473.029.26.047.427.187.353.29.26.402.14.496.027.262.028 1.91-.167.476-.288.356-.808.786-.213.29 1.18 1.188.26.384.046.262v1.928l-.047.29-.074.262-.353.598-.167.169-.186.122-.706.233-3.166.029-.566-.075-.428-.187-.352-.262-.233-.43-.167-.478-.046-1.88.093-.553.093-.215.139-.187 1.18-1.217-1.04-1.02-.289-.355-.12-.215-.047-.262v-1.91l.093-.551.353-.6.167-.168.38-.262.511-.168zm.595 1.47l-.288.168-.214.188-.093.336-.027.712.092.402 1.04 1.02.26.14.307.094h.213l.613-.403.827-.832.12-.29.047-.356v-.337l-.093-.43-.186-.216-.232-.187-.38-.028c0 .019-2.006.019-2.006.019zm1.012 4.79l-.706.572-.613.645-.185.234-.093.337v.814l.167.29.213.169.288.14h2.08c.121 0 .232-.028.353-.094l.214-.215.139-.262.074-.355v-.43l-.093-.338-.139-.29-.186-.234-.64-.645-.474-.31-.4-.027zM181.647 74.22l3.473.029.26.047.427.187.353.29.26.402.14.496.027.262.028 1.91-.167.476-.288.356-.808.786-.213.29 1.179 1.188.26.384.046.262v1.928l-.046.29-.074.262-.353.598-.167.169-.186.122-.706.233-3.166.029-.567-.075-.427-.187-.353-.262-.232-.43-.167-.478-.046-1.88.092-.553.093-.215.14-.187 1.179-1.217-1.04-1.02-.288-.355-.12-.215-.047-.262v-1.91l.093-.551.353-.6.167-.168.38-.262.511-.168zm.585 1.47l-.288.168-.213.188-.093.336-.028.712.093.402 1.04 1.02.26.14.306.094h.214l.613-.403.826-.832.12-.29.047-.356v-.337l-.093-.43-.185-.216-.232-.187-.381-.028c.01.019-2.006.019-2.006.019zm1.022 4.79l-.706.572-.613.645-.186.234-.093.337v.814l.168.29.213.169.288.14h2.08c.12 0 .232-.028.353-.094l.213-.215.14-.262.074-.355v-.43l-.093-.338-.14-.29-.185-.234-.64-.645-.493-.356-.38.019z"/>
            </g>
        </g>
        <g fill="#FFF">
            <path d="M61.778 18.05c.492.309.873.758 1.133 1.282s.38 1.123.38 1.74a.823.823 0 0 1-.213.552.775.775 0 0 1-.567.216h-4.299c.093.496.288.88.613 1.17.353.308.873.476 1.514.476.352 0 .659-.028.947-.093.26-.075.52-.169.78-.29.26-.122.566-.094.78.121.139.122.213.29.213.496 0 .262-.139.478-.427.618-.353.187-.706.356-1.068.45-.362.093-.808.14-1.346.14-1.114 0-2.006-.337-2.628-.974-.64-.645-.947-1.572-.947-2.713 0-.646.12-1.263.353-1.806a3.046 3.046 0 0 1 1.114-1.357c.492-.356 1.114-.524 1.848-.524.706 0 1.318.168 1.82.496zm0 2.48c-.047-.337-.14-.618-.307-.833-.185-.262-.399-.477-.659-.6-.548-.261-1.114-.261-1.634 0a1.62 1.62 0 0 0-.66.6c-.139.234-.26.524-.287.86h3.547v-.027zm-7.113-2.789c.306-.215.706-.14.947.094.14.14.214.337.214.552 0 .093-.028.215-.075.337l-2.293 5.548a1.036 1.036 0 0 1-.353.43.842.842 0 0 1-.52.17h-.14a.842.842 0 0 1-.52-.17 1.201 1.201 0 0 1-.352-.43l-2.294-5.548a.964.964 0 0 1-.074-.337c0-.215.074-.384.214-.552a.716.716 0 0 1 .947-.094c.12.094.213.187.288.309l1.894 4.81 1.866-4.81c.037-.112.13-.206.251-.309zm-7.521-2.854a.91.91 0 0 1 .594.234c.167.169.232.356.232.599v.047c0 .234-.074.43-.232.599-.158.168-.353.234-.594.234h-.075a.824.824 0 0 1-.594-.234c-.167-.169-.232-.356-.232-.6v-.046c0-.234.093-.43.232-.599a.774.774 0 0 1 .594-.234h.075zm-.595 2.976c.288-.309.808-.29 1.087 0 .139.14.213.337.213.552v5.717a.732.732 0 0 1-.232.552.761.761 0 0 1-.548.215.777.777 0 0 1-.548-.215.773.773 0 0 1-.213-.552v-5.717c.037-.215.102-.412.241-.552zm-3.38.075c.381.234.687.599.873 1 .186.431.307.88.307 1.386v3.79a.732.732 0 0 1-.233.551.761.761 0 0 1-.547.216.777.777 0 0 1-.548-.216.773.773 0 0 1-.214-.552v-3.64c0-1-.4-1.478-1.3-1.478-.4 0-.78.122-1.086.309a3.61 3.61 0 0 0-.92.86v3.959a.732.732 0 0 1-.232.552.764.764 0 0 1-1.068 0 .773.773 0 0 1-.213-.552v-8.646a.79.79 0 0 1 .213-.552.753.753 0 0 1 1.087 0c.14.14.213.337.213.552v3.097c.26-.262.548-.477.855-.646.399-.234.9-.355 1.439-.355.548-.019 1.003.103 1.374.365zm-15.052-8.6l4.448 7.739-4.448 7.738h-8.886l-4.42-7.738 4.448-7.739h8.858zM23.67 21.746c.855 0 1.532-.692 1.532-1.544a1.54 1.54 0 0 0-1.532-1.544 1.54 1.54 0 0 0-1.532 1.544 1.54 1.54 0 0 0 1.532 1.544zM75.39 15.954c1.161.075 1.941.094 2.34.094a.307.307 0 0 0 .233-.094.359.359 0 0 0 .093-.234v-.57h-1.467c-.446 0-.753-.094-.966-.31-.186-.187-.307-.524-.307-.973V13.7c0-.45.093-.758.307-.973.186-.187.52-.31.966-.31h2.219v.88h-1.96c-.26 0-.38.122-.38.384v.14c0 .263.12.384.38.384h1.133c.4 0 .706.094.92.29.185.187.288.496.288.927v.308c0 .403-.093.712-.288.927-.186.187-.492.29-.92.29-.213 0-.445 0-.687-.028l-.594-.028c-.427-.028-.873-.047-1.328-.094.019 0 .019-.842.019-.842zm-1.634-2.068c0-.384-.185-.57-.566-.57h-1.068v2.666h1.068c.38 0 .566-.187.566-.57v-1.526zm-.306-1.478c.474 0 .826.121 1.086.383.233.234.381.618.381 1.095v1.525c0 .477-.12.833-.38 1.095-.233.234-.613.384-1.087.384h-2.46v-4.482h2.46zm-3.092 4.36c-.994.094-1.894.168-2.72.168-.4 0-.707-.093-.92-.29-.186-.187-.288-.496-.288-.926v-2.021c0-.45.093-.758.306-.973.214-.215.52-.31.966-.31h2.266v.88h-2.034c-.26 0-.38.122-.38.384v2.05c0 .093.027.168.092.233.047.047.14.094.233.094.492 0 .919 0 1.327-.028v-.955h-.826v-.758h1.96c.018 0 .018 2.452.018 2.452z"/>
        </g>
        <path fill="#FFF" d="M178.24 113.586l.13-.402h2.08l-.14.402h-.046c-.047 0-.112-.028-.233 0h-1.792zm.24-.804l.28-1.02h2.107l-.14.496s-.965 0-1.132.028c-.715.112-1.114.496-1.114.496zm5.48-9.6h-.01v-.104l.186.028s.965.094.993.094c.381.14.548.552.427 1.048-.092.477-.399.86-.78 1.048-.306.168-.687.168-1.086.168h-.26l.028-.093.473-2.068.028-.122zm-10.373 3.93c.14-.693.325-1.236.77-1.245.372 0 .4.43.233 1.095-.028.168-.167.72-.334.954-.121.196-.26.29-.427.29-.047 0-.335 0-.335-.43 0-.216.047-.43.093-.665zm10.066 9.29l.306-1.047h1.068l-.306 1.048h-1.068zm4.253-9.216c.167-.646.334-1.216.789-1.226.279 0 .427.29.4.74-.029.121-.047.243-.075.383-.046.197-.093.412-.14.599-.046.122-.092.243-.166.337-.121.168-.4.262-.567.262-.046 0-.334 0-.334-.43 0-.216.046-.431.093-.665zm-3.213 5.764l.353-1.17h1.068l-.26.861s-.335 0-.548.075c-.214.047-.613.234-.613.234zm-4.634 2.208l-.009-.018h-.306l.027-.524h-1.225l-.047 2.498c0 .168.019.28.14.356.12.093.52.121 1.067.121h.78l.288-.926-.687.047-.213.028c-.019-.028-.065-.047-.093-.075-.028-.019-.075 0-.075-.187v-.646l.706-.028c.38 0 .548-.112.687-.234.14-.122.186-.262.232-.43l.121-.571h-.966l-.12.402c-.019.066-.047.113-.093.14-.047.047-.12.047-.214.047zm-6.871-2.31l-.279.907h.827l-.214.739h-.826l-.288.926h.826l-.473 1.6c-.047.197.046.29.093.384.074.094.12.16.26.187.148.019.241.047.38.047h1.681l.306-1.001-.733.093c-.14 0-.539 0-.492-.14l.353-1.216h1.485l.26-.908h-1.485l.232-.74h1.467l.26-.879h-3.64zm13.752 3.864a.876.876 0 0 0-.25.121h-.381l-.26.88h.993c.492 0 .808-.243 1.04-.552l.706-.973.14 1c.046.17.166.29.26.338.092.047.203.112.352.14.149.028.26.028.334.028h.492l.288-.973h-.185c-.121 0-.307-.019-.335-.047-.018-.047-.018-.121-.046-.215l-.167-1.001h-.641l.288-.337h1.56l.232-.814h-1.44l.233-.74h1.44l.26-.907h-4.3l-.26.908h1.532l-.214.71h-1.56l-.232.787h1.375l-1.04 1.478a.483.483 0 0 1-.214.169zm-2.628.926h1.29l.094-.309h.38l.288-.954h-.38l1.392-4.641h.474l.14-.478.027.524c0 .337.232.618.92.571h.78l.26-.907h-.288c-.158 0-.233-.028-.233-.122l-.027-.552h-1.44c-.445 0-1.838.047-2.126.122-.334.093-.687.355-.687.355l.139-.477h-1.346l-.288.954-1.421 4.716H182l-.288.908h2.693l-.093.29zm-7.113 0l.966.028.306-1.02-.872.075c-.093 0-.168-.047-.168-.047-.027-.047 0-.121.047-.309l.566-1.862h1.987c.307 0 .502 0 .641-.028a1.61 1.61 0 0 0 .474-.168c.185-.122.278-.215.353-.337.074-.122.213-.384.334-.786l.706-2.358h-2.053s-.631.094-.919.187c-.288.094-.687.43-.687.43l.186-.645h-1.272L176 116.749c-.074.234-.12.402-.12.496 0 .103.139.215.232.29.093.075.26.047.4.075.138.028.38.028.686.028zm-3.38-5.886c-.065.028-.167.047-.334.02h-.214l-.26.879h.66c.306 0 .538-.122.659-.169.14-.075.167-.028.26-.121l.214-.188h2.033l.288-.907h-1.486l.26-.496h-1.485l-.381.692c-.074.15-.14.244-.214.29zm-4.438-2.732l.065.038c.325-.029.538-.029.752-.029h.78l.028-.028.028-.028c.046-.29.065-.383.092-.524.028-.14.093-.383.214-.954.065-.28.111-.543.186-.833.074-.28.139-.543.213-.833l-.028-.028-.027-.028c-.363.066-.576.112-.808.14-.214.047-.427.075-.78.122l-.028.028-.028.028c-.046.262-.074.478-.12.74-.047.262-.121.57-.214 1.02-.075.336-.121.449-.167.57-.047.122-.093.234-.186.571l.028.028zm19.973-3.696c-.028.047-.028.122-.083.225-.093-.197-.26-.337-.492-.43-.307-.113-1.022.027-1.635.598-.418.402-.631.973-.752 1.497-.14.524-.288 1.507.613 1.862.288.113.548.14.808.14.278-.018.52-.168.752-.355-.028.066-.046.16-.074.234l.046.047c.632-.028.845-.028 1.532-.028l.075-.047c.12-.59.213-1.188.473-2.33.14-.552.279-1.095.4-1.647l-.028-.075c-.715.14-.901.169-1.588.262l-.047.047zm-16.668 3.621c.288.122.688.169.892.16.668 0 1.356-.16 1.848-.712.408-.449.566-1.095.64-1.357.214-.907.047-1.31-.139-1.572-.306-.374-.826-.496-1.374-.496-.334 0-1.114.029-1.727.6-.418.402-.632.972-.752 1.496-.14.524-.288 1.526.612 1.881zm17.328 3.406l.854.047c.52 0 .826-.234 1.012-.57l.566-.955.075-.075c.353-.805 3.213-5.736 3.213-5.736l-.047-.075c-.706.14-.826.169-1.486.262l-.046.047v.028c-.492 1.114-.474.88-.873 1.76v-.122l-.093-1.928-.074-.075c-.734.14-.752.169-1.44.262l-.046.047v.103c.065.449.047.355.14 1.048.046.327.092.683.139 1.02.065.552.111.833.186 1.693-.465.768-.567 1.076-1.013 1.74l-.306.497a.527.527 0 0 1-.12.093c-.047.028-.121.028-.214.028h-.167l-.26.861zm-13.808-3.359l-.019.056c.66-.028.873-.028 1.467-.028l.047-.047c.074-.383.093-.477.26-1.263.074-.355.26-1.188.334-1.478.14-.066.288-.14.427-.14.334 0 .316.28.288.402-.028.196-.14.832-.26 1.385l-.093.355c-.065.262-.14.496-.186.758l.028.047c.66-.028.873-.028 1.44-.028l.074-.047c.093-.599.12-.767.306-1.647l.093-.402c.186-.786.279-1.189.14-1.525-.15-.356-.502-.45-.808-.45a2.17 2.17 0 0 0-.92.216c-.12.074-.232.14-.353.215l.121-.403-.046-.074c-.706.14-.873.168-1.532.262l-.047.046c-.074.627-.14 1.123-.427 2.386-.102.478-.214.927-.334 1.404zm-11.394-.028l-.018.037c.659-.028.872-.028 1.467-.028l.046-.046c.074-.384.093-.478.26-1.264.102-.355.26-1.188.334-1.478.14-.066.288-.14.428-.14.334 0 .287.28.287.402-.027.196-.139.833-.26 1.385l-.092.355c-.065.262-.112.496-.186.758l.028.047c.659-.028.873-.028 1.439-.028l.074-.047c.121-.599.149-.767.335-1.647l.092-.402c.186-.786.279-1.188.14-1.525-.149-.356-.502-.45-.808-.45a2.17 2.17 0 0 0-.92.216c-.12.075-.232.14-.352.215l.12-.402-.074-.075c-.706.14-.873.168-1.532.262l-.046.047c-.075.645-.14 1.141-.428 2.404-.102.478-.213.927-.334 1.404zm5.488-3.378c.12.094.288.122.464.094.288 0 .576-.066.808-.234.38-.281.427-.646.12-.833-.324-.197-.89-.122-1.271.14-.409.262-.455.646-.121.833zm11.746-1.17s-1.058 4.436-1.114 4.65c1.087-.027 1.514-.027 1.7 0 .046-.196.306-1.43.306-1.43s.204-.9.232-.927c0 0 .065-.094.14-.14h.092c.92 0 1.987 0 2.814-.618.548-.402.947-1.03 1.114-1.787.028-.169.074-.403.074-.618 0-.318-.065-.599-.232-.814-.427-.59-1.253-.617-2.22-.617h-.473c-1.235 0-1.727 0-1.94-.029-.019.094-.047.262-.047.262l-.446 2.068zm-21.032 4.623c.799 0 1.56-.169 2.034-.45.882-.551 1.114-1.356 1.328-2.095l.093-.384s.872-3.48 1.012-3.93c.028-.019.028-.047.028-.047-1.189.019-1.514 0-1.635-.028a1024.8 1024.8 0 0 0-.854 3.883c-.158.74-.279 1.282-.706 1.62-.26.196-.52.29-.854.29-.52 0-.826-.263-.873-.759v-.168l.167-1.001s.855-3.36.994-3.809v-.046c-1.607.018-1.885 0-1.913-.029 0 .02-.046.234-.046.234l-.855 3.79-.074.309-.14 1.048c0 .309.066.57.186.786.381.692 1.495.786 2.108.786zm-2.033-11.388c.371-1.619 1.987-2.929 3.538-2.92l8.654.029c-1.059.57-1.932 1.59-2.22 2.807l-1.439 6.194c.112-.028.465-.046.752-.074l1.393-5.998c.372-1.62 1.978-2.93 3.566-2.93l10.493.029c-1.059.57-1.932 1.59-2.22 2.807l-1.439 6.194c.186 0 .52 0 .706.122l1.44-6.194c.37-1.62 1.977-2.93 3.565-2.93l11.18.029c1.588 0 2.581 1.31 2.2 2.929l-5.339 23.009c-.371 1.6-1.977 2.91-3.565 2.91l-11.18-.028c-1.588 0-2.582-1.329-2.201-2.929l.446-1.927h-.734l-.427 1.806c-.214.954-.046 1.834.474 2.498.167.215.38.412.594.552l-10.688-.028c-1.588 0-2.581-1.31-2.2-2.929l2.386-10.311h-.734l-2.368 10.218c-.213.935-.046 1.815.474 2.48.167.214.38.41.594.551l-8.84-.028c-1.588 0-2.581-1.329-2.2-2.929l5.339-23.009zm25.145 17.105l.4-1.244h1.068l-.26.86s-.353.047-.567.094c-.241.075-.64.29-.64.29z"/>
        <g fill="#FFF">
            <path d="M139.694 64.714c-.353 0-.687.094-.993.234-.734.384-1.532.664-2.34.88-.901.215-1.82.308-2.74.308a6.67 6.67 0 0 1-4.494-1.385 5.682 5.682 0 0 1-1.746-3.359h12.768a2.349 2.349 0 0 0 1.792-.71 2.392 2.392 0 0 0 .66-1.741c.028-1.834-.381-3.64-1.18-5.315a9.464 9.464 0 0 0-3.352-3.93 10.716 10.716 0 0 0-11.105 0c-1.486 1.02-2.647 2.48-3.353 4.164a13.558 13.558 0 0 0-1.114 5.502 11.423 11.423 0 0 0 2.907 8.262 10.794 10.794 0 0 0 8.06 2.976c1.374.028 2.739-.14 4.085-.478a14.336 14.336 0 0 0 3.352-1.384 2.336 2.336 0 0 0 1.375-2.05 2.007 2.007 0 0 0-.706-1.618 2.25 2.25 0 0 0-1.876-.356zm-11.56-9.722a4.776 4.776 0 0 1 1.94-1.712 5.473 5.473 0 0 1 4.801 0c.78.383 1.467.973 1.94 1.712a5.26 5.26 0 0 1 .827 2.264h-10.307a5.516 5.516 0 0 1 .799-2.264zM116.86 48.564l.168-.029c-.474 0-.947.14-1.347.403-.38.262-.705.617-.9 1.048l-5.488 13.98-5.646-13.933a2.735 2.735 0 0 0-.9-1.048 2.436 2.436 0 0 0-3.092.337c-.474.477-.706 1.122-.706 1.787 0 .383.092.739.232 1.076l6.927 16.796a2.997 2.997 0 0 0 1.114 1.338 3.277 3.277 0 0 0 1.7.552h.399c.594 0 1.179-.187 1.68-.552a3.614 3.614 0 0 0 1.115-1.338l6.973-16.796a2.87 2.87 0 0 0 .232-1.076 2.4 2.4 0 0 0-.705-1.788 2.464 2.464 0 0 0-1.755-.757zM92.012 48.517c-.66 0-1.272.262-1.746.739-.473.477-.705 1.123-.705 1.787v17.152c0 .645.232 1.282.705 1.74.446.477 1.087.711 1.746.711a2.41 2.41 0 0 0 1.746-.71c.473-.45.752-1.096.733-1.741V51.043a2.4 2.4 0 0 0-.705-1.787c-.474-.477-1.105-.758-1.774-.74zM92.18 40.32h-.26c-.706-.028-1.394.29-1.867.814a2.635 2.635 0 0 0-.808 1.909c0 .711.288 1.403.808 1.909.473.524 1.16.814 1.866.814h.26c.706.028 1.393-.29 1.867-.814.52-.496.808-1.189.808-1.91 0-.71-.288-1.403-.808-1.908a2.504 2.504 0 0 0-1.867-.814zM79.56 49.378v.093a7.864 7.864 0 0 0-4.188-1.141 8.696 8.696 0 0 0-4.448 1.122A10.664 10.664 0 0 0 68.66 51.1v-8.833c0-1.385-1.133-2.526-2.508-2.526-.659 0-1.272.262-1.745.739-.474.477-.706 1.123-.706 1.787v25.938a2.4 2.4 0 0 0 .706 1.787c.947.861 2.386.861 3.352 0 .492-.449.78-1.094.78-1.787V56.452c.78-.927 1.653-1.788 2.646-2.48a5.742 5.742 0 0 1 3.352-.908c2.554 0 3.715 1.338 3.715 4.192v10.958c0 .664.26 1.31.733 1.787.446.477 1.087.71 1.746.71a2.41 2.41 0 0 0 1.746-.71c.492-.45.752-1.123.733-1.787V56.76a9.723 9.723 0 0 0-.9-4.238 7.841 7.841 0 0 0-2.749-3.144zM46.4 37.728H26.707l-9.834 17.17 9.834 17.18H46.4l9.833-17.18z"/>
        </g>
        <g>
            <path fill="url(#a)" d="M23.725 19.875H3.166c-1.42 0-2.572-1.17-2.572-2.592V3.463C.594 2.03 1.755.87 3.166.87H23.734c1.421 0 2.572 1.17 2.572 2.592v13.811c0 1.45-1.16 2.602-2.581 2.602z" transform="translate(23.214 44.914)"/>
            <g fill="#686867">
                <path d="M49.52 52.568v-.645h-7.846l-.093.14a6.12 6.12 0 0 0-.9 3.219c0 1.076.288 2.124.808 3.022a6.158 6.158 0 0 0-.808 3.023c0 1.123.306 2.236.873 3.19l.38.646.548-.337-.38-.645a5.496 5.496 0 0 1-.808-2.854c0-.955.232-1.91.705-2.714h7.494v-.645h-7.494a5.63 5.63 0 0 1-.705-2.695c0-.955.232-1.91.705-2.714 0 .01 7.522.01 7.522.01zM31.794 46.018l-.353-.617-.547.337.352.617c.52.861.808 1.834.808 2.854 0 .955-.232 1.91-.705 2.714h-7.494v.645h7.494a5.63 5.63 0 0 1 .705 2.695c0 .955-.232 1.91-.705 2.714h-7.494v.646h7.494c.473.814.705 1.74.705 2.694 0 1.02-.288 2.022-.808 2.854l-.445.646.52.384.445-.665c.595-.954.901-2.068.901-3.219a6.053 6.053 0 0 0-.808-3.022c.52-.926.808-1.956.808-3.022a6.053 6.053 0 0 0-.808-3.023c.52-.926.808-1.955.808-3.022 0-1.16-.306-2.255-.873-3.21z"/>
            </g>
        </g>
    </g>
</svg>
