<svg xmlns="http://www.w3.org/2000/svg" width="26" height="26" viewBox="0 0 26 26">
    <g fill="none" fill-rule="evenodd" stroke="#FFAD00" stroke-linecap="round" stroke-linejoin="round" stroke-width="2" transform="translate(1 1)">
        <path d="M19.934 8c.044.264.066.532.066.8v10.4a4.8 4.8 0 0 1-4.8 4.8H4.8A4.8 4.8 0 0 1 0 19.2V8.8A4.8 4.8 0 0 1 4.8 4h10.4c.268 0 .536.022.8.066"/>
        <circle cx="20" cy="4" r="4"/>
    </g>
</svg>
