<?xml version="1.0" encoding="UTF-8"?>
<svg width="18px" height="18px" viewBox="0 0 18 18" version="1.1" xmlns="http://www.w3.org/2000/svg" xmlns:xlink="http://www.w3.org/1999/xlink">
    <!-- Generator: Sketch 53.2 (72643) - https://sketchapp.com -->
    <title>icon / info copy 3</title>
    <desc>Created with Sketch.</desc>
    <defs>
        <path d="M9,0 C4.02926087,0 0,4.02926087 0,9 C0,13.9707391 4.02926087,18 9,18 C13.9707391,18 18,13.9707391 18,9 C18,4.02926087 13.9707391,0 9,0 Z M9,3.52173913 C9.6483913,3.52173913 10.173913,4.04726087 10.173913,4.69565217 C10.173913,5.34404348 9.6483913,5.86956522 9,5.86956522 C8.3516087,5.86956522 7.82608696,5.34404348 7.82608696,4.69565217 C7.82608696,4.04726087 8.3516087,3.52173913 9,3.52173913 Z M10.5652174,14.0869565 L9.7826087,14.0869565 L8.2173913,14.0869565 L7.43478261,14.0869565 L7.43478261,13.3043478 L8.2173913,13.3043478 L8.2173913,8.2173913 L7.43478261,8.2173913 L7.43478261,7.43478261 L8.2173913,7.43478261 L9.7826087,7.43478261 L9.7826087,8.2173913 L9.7826087,13.3043478 L10.5652174,13.3043478 L10.5652174,14.0869565 Z" id="path-1"></path>
    </defs>
    <g id="Форма" stroke="none" stroke-width="1" fill="none" fill-rule="evenodd">
        <g id="Hive_Step_2" transform="translate(-540.000000, -230.000000)">
            <g id="icon-/-info-copy-3" transform="translate(540.000000, 230.000000)">
                <circle id="Oval" fill="#FFFFFF" cx="9" cy="9" r="9"></circle>
                <mask id="mask-2" fill="white">
                    <use xlink:href="#path-1"></use>
                </mask>
                <use id="Mask" fill="#999999" fill-rule="nonzero" xlink:href="#path-1"></use>
            </g>
        </g>
    </g>
</svg>