<svg xmlns="http://www.w3.org/2000/svg" xmlns:xlink="http://www.w3.org/1999/xlink" width="24" height="24" viewBox="0 0 24 24">
    <defs>
        <path id="a" d="M4 17h16a1 1 0 0 1 0 2H4a1 1 0 0 1 0-2zm0-6h16a1 1 0 0 1 0 2H4a1 1 0 0 1 0-2zm0-6h16a1 1 0 0 1 0 2H4a1 1 0 1 1 0-2z"/>
    </defs>
    <use fill="#fff" fill-rule="evenodd" xlink:href="#a"/>
</svg>
