<svg xmlns="http://www.w3.org/2000/svg" width="40" height="40" viewBox="0 0 40 40">
    <g fill="none" fill-rule="evenodd" transform="translate(0 -.016)">
        <circle cx="20" cy="20" r="19" stroke="#F6F6F6" stroke-width="2"/>
        <g fill="#0092CE">
            <path d="M28 23.308c0 1.384-.483 2.587-1.328 3.429-.846.842-2.053 1.263-3.381 1.263h-6.582c-1.328 0-2.535-.421-3.38-1.263-.906-.842-1.329-2.045-1.329-3.429v-6.616C12 13.925 13.872 12 16.71 12h6.64c1.39 0 2.537.481 3.382 1.323.845.842 1.268 1.985 1.268 3.369v6.616zM23.014 14H16.93c-.885 0-1.66.276-2.157.774-.498.498-.774 1.272-.774 2.157v6.083c0 .885.276 1.659.83 2.212.552.498 1.271.774 2.156.774h6.028c.885 0 1.659-.276 2.157-.774.553-.498.829-1.272.829-2.157v-6.083c0-.885-.276-1.604-.774-2.157-.553-.553-1.272-.829-2.212-.829z"/>
            <path d="M24 17c-.563 0-1-.438-1-1 0-.563.438-1 1-1 .563 0 1 .438 1 1 0 .563-.438 1-1 1zm-4.03 7C17.753 24 16 22.176 16 20c0-2.235 1.81-4 3.97-4 2.161 0 4.03 1.765 4.03 4 0 2.235-1.81 4-4.03 4zm.03-2a2 2 0 1 0 0-4 2 2 0 0 0 0 4z"/>
        </g>
    </g>
</svg>
