<svg xmlns="http://www.w3.org/2000/svg" width="32" height="32" viewBox="0 0 32 32">
    <g fill="none" fill-rule="evenodd" stroke-linecap="round" stroke-width="1.3">
        <path stroke="#00B955" d="M5 31h22a4 4 0 0 0 4-4V1H9v4"/>
        <path stroke="#00B955" d="M9 27a4 4 0 1 1-8 0V5h8v22z"/>
        <path stroke="#43DF00" d="M27 5H13h14zm0 16H13h14zm0 4H13h14zM21 9h6v8h-6V9zm-4 0h-3 3zm0 4h-4 4zm0 4h-4 4z"/>
    </g>
</svg>
