<?xml version="1.0" encoding="UTF-8"?>
<svg version="1.1" viewBox="0 0 28 28" xmlns="http://www.w3.org/2000/svg">
    <defs>
        <linearGradient id="a" y1="50%" y2="50%">
            <stop stop-color="#AFE424" offset="0"/>
            <stop stop-color="#B0E429" offset=".19789"/>
            <stop stop-color="#98D559" offset=".19791"/>
            <stop stop-color="#98D459" offset=".39981"/>
            <stop stop-color="#84C787" offset=".39983"/>
            <stop stop-color="#84C788" offset=".60108"/>
            <stop stop-color="#72BBB2" offset=".60187"/>
            <stop stop-color="#71BBB2" offset=".79872"/>
            <stop stop-color="#5DADE0" offset=".79993"/>
            <stop stop-color="#5DADE2" offset="1"/>
        </linearGradient>
    </defs>
    <g fill="none" fill-rule="evenodd">
        <g transform="translate(-3705 -1800)" fill="url(#a)">
            <g transform="translate(3413 1550)">
                <path d="m306 250c7.732 0 14 6.268 14 14s-6.268 14-14 14-14-6.268-14-14 6.268-14 14-14zm0 2.8c-6.1856 0-11.2 5.0144-11.2 11.2s5.0144 11.2 11.2 11.2 11.2-5.0144 11.2-11.2-5.0144-11.2-11.2-11.2zm0 2.8c4.6392 0 8.4 3.7608 8.4 8.4s-3.7608 8.4-8.4 8.4-8.4-3.7608-8.4-8.4 3.7608-8.4 8.4-8.4zm-3.3501 1.6531c-1.3543 0.75418-2.424 1.939-3.0131 3.3633l3.4464 0.83888c0.32265-0.54274 0.79493-0.99032 1.3618-1.289zm3.4475-0.88951c-0.94354 0-1.8432 0.18305-2.6638 0.51472l1.8356 2.9785c0.26546-0.063181 0.54284-0.096677 0.82824-0.096677 0.62553 0 1.2125 0.1609 1.719 0.44339l2.0022-2.7898c-1.0764-0.6651-2.3527-1.0501-3.7212-1.0501z"/>
            </g>
        </g>
    </g>
</svg>
