^D:\STEGO\STEGOAPP\X64\DEBUG\DECRYPT.OBJ|D:\STEGO\STEGOAPP\X64\DEBUG\ELGAMAL.OBJ|D:\STEGO\STEGOAPP\X64\DEBUG\ENCRYPT.OBJ|D:\STEGO\STEGOAPP\X64\DEBUG\GOST.OBJ|D:\STEGO\STEGOAPP\X64\DEBUG\HISTOGRAM.OBJ|D:\STEGO\STEGOAPP\X64\DEBUG\RSA.OBJ|D:\STEGO\STEGOAPP\X64\DEBUG\STDAFX.OBJ|D:\STEGO\STEGOAPP\X64\DEBUG\STEGO.OBJ|D:\STEGO\STEGOAPP\X64\DEBUG\STEGOAPP.OBJ|D:\STEGO\STEGOAPP\X64\DEBUG\STEGOAPP.RES
C:\WINDOWS\GLOBALIZATION\SORTING\SORTDEFAULT.NLS
D:\STEGO\STEGOAPP\PACKAGES\CRYPTOPP.V140.WINDESKTOP.DYN.RT-STATIC.5.6.5.4\LIB\NATIVE\V140\WINDESKTOP\MSVCSTL\X64\DEBUG\MD\CRYPTLIB.LIB
C:\OPENCV\BUILD\X64\VC14\LIB\OPENCV_WORLD330.LIB
C:\OPENCV\BUILD\X64\VC14\LIB\OPENCV_WORLD330D.LIB
C:\PROGRAM FILES (X86)\WINDOWS KITS\8.1\LIB\WINV6.3\UM\X64\KERNEL32.LIB
C:\PROGRAM FILES (X86)\WINDOWS KITS\8.1\LIB\WINV6.3\UM\X64\USER32.LIB
C:\PROGRAM FILES (X86)\WINDOWS KITS\8.1\LIB\WINV6.3\UM\X64\GDI32.LIB
C:\PROGRAM FILES (X86)\WINDOWS KITS\8.1\LIB\WINV6.3\UM\X64\WINSPOOL.LIB
C:\PROGRAM FILES (X86)\WINDOWS KITS\8.1\LIB\WINV6.3\UM\X64\COMDLG32.LIB
C:\PROGRAM FILES (X86)\WINDOWS KITS\8.1\LIB\WINV6.3\UM\X64\ADVAPI32.LIB
C:\PROGRAM FILES (X86)\WINDOWS KITS\8.1\LIB\WINV6.3\UM\X64\SHELL32.LIB
C:\PROGRAM FILES (X86)\WINDOWS KITS\8.1\LIB\WINV6.3\UM\X64\OLE32.LIB
C:\PROGRAM FILES (X86)\WINDOWS KITS\8.1\LIB\WINV6.3\UM\X64\OLEAUT32.LIB
C:\PROGRAM FILES (X86)\WINDOWS KITS\8.1\LIB\WINV6.3\UM\X64\UUID.LIB
C:\PROGRAM FILES (X86)\WINDOWS KITS\8.1\LIB\WINV6.3\UM\X64\ODBC32.LIB
C:\PROGRAM FILES (X86)\WINDOWS KITS\8.1\LIB\WINV6.3\UM\X64\ODBCCP32.LIB
D:\STEGO\STEGOAPP\X64\DEBUG\STEGOAPP.RES
D:\STEGO\STEGOAPP\X64\DEBUG\DECRYPT.OBJ
D:\STEGO\STEGOAPP\X64\DEBUG\ELGAMAL.OBJ
D:\STEGO\STEGOAPP\X64\DEBUG\ENCRYPT.OBJ
D:\STEGO\STEGOAPP\X64\DEBUG\GOST.OBJ
D:\STEGO\STEGOAPP\X64\DEBUG\HISTOGRAM.OBJ
D:\STEGO\STEGOAPP\X64\DEBUG\RSA.OBJ
D:\STEGO\STEGOAPP\X64\DEBUG\STDAFX.OBJ
D:\STEGO\STEGOAPP\X64\DEBUG\STEGO.OBJ
D:\STEGO\STEGOAPP\X64\DEBUG\STEGOAPP.OBJ
C:\WINDOWS\SYSTEM32\TZRES.DLL
C:\PROGRAM FILES (X86)\MICROSOFT VISUAL STUDIO 14.0\VC\LIB\AMD64\MSVCPRTD.LIB
C:\PROGRAM FILES (X86)\WINDOWS KITS\8.1\LIB\WINV6.3\UM\X64\BCRYPT.LIB
C:\PROGRAM FILES (X86)\MICROSOFT VISUAL STUDIO 14.0\VC\LIB\AMD64\MSVCRTD.LIB
C:\PROGRAM FILES (X86)\MICROSOFT VISUAL STUDIO 14.0\VC\LIB\AMD64\OLDNAMES.LIB
C:\PROGRAM FILES (X86)\MICROSOFT VISUAL STUDIO 14.0\VC\LIB\AMD64\VCRUNTIMED.LIB
C:\PROGRAM FILES (X86)\WINDOWS KITS\10\LIB\10.0.10240.0\UCRT\X64\UCRTD.LIB
