^D:\STEGO\STEGOAPP\STDAFX.CPP
D:\STEGO\STEGOAPP\DEBUG\STEGOAPP.PCH
D:\STEGO\STEGOAPP\DEBUG\VC140.PDB
D:\STEGO\STEGOAPP\DEBUG\VC140.IDB
D:\STEGO\STEGOAPP\DEBUG\STDAFX.OBJ
^D:\STEGO\STEGOAPP\DECRYPT.CPP|D:\STEGO\STEGOAPP\ELGAMAL.CPP|D:\STEGO\STEGOAPP\ENCRYPT.CPP|D:\STEGO\STEGOAPP\RSA.CPP|D:\STEGO\STEGOAPP\STEGO.CPP|D:\STEGO\STEGOAPP\STEGOAPP.CPP
D:\STEGO\STEGOAPP\DEBUG\VC140.PDB
D:\STEGO\STEGOAPP\DEBUG\VC140.IDB
D:\STEGO\STEGOAPP\DEBUG\DECRYPT.OBJ
D:\STEGO\STEGOAPP\DEBUG\ELGAMAL.OBJ
D:\STEGO\STEGOAPP\DEBUG\ENCRYPT.OBJ
D:\STEGO\STEGOAPP\DEBUG\RSA.OBJ
D:\STEGO\STEGOAPP\DEBUG\STEGO.OBJ
D:\STEGO\STEGOAPP\DEBUG\STEGOAPP.OBJ
^D:\STEGO\STEGOAPP\DECRYPT.CPP
D:\STEGO\STEGOAPP\DEBUG\VC140.PDB
^D:\STEGO\STEGOAPP\ELGAMAL.CPP
D:\STEGO\STEGOAPP\DEBUG\VC140.PDB
^D:\STEGO\STEGOAPP\ENCRYPT.CPP
D:\STEGO\STEGOAPP\DEBUG\VC140.PDB
^D:\STEGO\STEGOAPP\RSA.CPP
D:\STEGO\STEGOAPP\DEBUG\VC140.PDB
^D:\STEGO\STEGOAPP\STEGO.CPP
D:\STEGO\STEGOAPP\DEBUG\VC140.PDB
^D:\STEGO\STEGOAPP\STEGOAPP.CPP
D:\STEGO\STEGOAPP\DEBUG\VC140.PDB
^D:\STEGO\STEGOAPP\DECRYPT.CPP|D:\STEGO\STEGOAPP\ELGAMAL.CPP|D:\STEGO\STEGOAPP\ENCRYPT.CPP|D:\STEGO\STEGOAPP\GOST.CPP|D:\STEGO\STEGOAPP\HISTOGRAM.CPP|D:\STEGO\STEGOAPP\RSA.CPP|D:\STEGO\STEGOAPP\STEGO.CPP|D:\STEGO\STEGOAPP\STEGOAPP.CPP
D:\STEGO\STEGOAPP\DEBUG\VC140.PDB
D:\STEGO\STEGOAPP\DEBUG\VC140.IDB
D:\STEGO\STEGOAPP\DEBUG\DECRYPT.OBJ
D:\STEGO\STEGOAPP\DEBUG\ELGAMAL.OBJ
D:\STEGO\STEGOAPP\DEBUG\ENCRYPT.OBJ
D:\STEGO\STEGOAPP\DEBUG\GOST.OBJ
D:\STEGO\STEGOAPP\DEBUG\HISTOGRAM.OBJ
D:\STEGO\STEGOAPP\DEBUG\RSA.OBJ
D:\STEGO\STEGOAPP\DEBUG\STEGO.OBJ
D:\STEGO\STEGOAPP\DEBUG\STEGOAPP.OBJ
^D:\STEGO\STEGOAPP\GOST.CPP
D:\STEGO\STEGOAPP\DEBUG\VC140.PDB
^D:\STEGO\STEGOAPP\HISTOGRAM.CPP
D:\STEGO\STEGOAPP\DEBUG\VC140.PDB
