{
    "id": "a49963c7-dbc6-4d6a-86ac-2e7ac8672178",
    "schema": "https://metadata.datadrivendiscovery.org/schemas/v0/pipeline.json",
    "created": "2019-05-17T23:20:03.369789Z",
    "inputs": [
        {
            "name": "inputs"
        }
    ],
    "outputs": [
        {
            "data": "steps.6.produce",
            "name": "final"
        }
    ],
    "steps": [
        {
            "type": "PRIMITIVE",
            "primitive": {
                "id": "dsbox-denormalize(from d3m)",
                "version": "1.5.0",
                "python_path": "d3m.primitives.normalization.denormalize.DSBOX",
                "name": "DSBox denormalize",
                "digest": "46dd84c1b84114e7f1d37d889c261c084ea31401e258b79f177a76a7279d07e0"
            },
            "arguments": {
                "inputs": {
                    "type": "CONTAINER",
                    "data": "inputs.0"
                }
            },
            "outputs": [
                {
                    "id": "produce"
                }
            ]
        },
        {
            "type": "PRIMITIVE",
            "primitive": {
                "id": "4b42ce1e-9b98-4a25-b68e-fad13311eb65",
                "version": "0.3.0",
                "python_path": "d3m.primitives.data_transformation.dataset_to_dataframe.Common",
                "name": "Extract a DataFrame from a Dataset",
                "digest": "e961af90b7d82dcc4900a01fc4bc0cf76c8ca050086cedc9ff043814d770fbb2"
            },
            "arguments": {
                "inputs": {
                    "type": "CONTAINER",
                    "data": "steps.0.produce"
                }
            },
            "outputs": [
                {
                    "id": "produce"
                }
            ]
        },
        {
            "type": "PRIMITIVE",
            "primitive": {
                "id": "4503a4c6-42f7-45a1-a1d4-ed69699cf5e1",
                "version": "0.2.0",
                "python_path": "d3m.primitives.data_transformation.extract_columns_by_semantic_types.DataFrameCommon",
                "name": "Extracts columns by semantic type",
                "digest": "7c7ca2febf05d3138438919635143b6ba2b15606400442ddcf1c7107fa7e8207"
            },
            "arguments": {
                "inputs": {
                    "type": "CONTAINER",
                    "data": "steps.1.produce"
                }
            },
            "outputs": [
                {
                    "id": "produce"
                }
            ],
            "hyperparams": {
                "semantic_types": {
                    "type": "VALUE",
                    "data": [
                        "https://metadata.datadrivendiscovery.org/types/PrimaryKey",
                        "https://metadata.datadrivendiscovery.org/types/Attribute"
                    ]
                }
            }
        },
        {
            "type": "PRIMITIVE",
            "primitive": {
                "id": "4503a4c6-42f7-45a1-a1d4-ed69699cf5e1",
                "version": "0.2.0",
                "python_path": "d3m.primitives.data_transformation.extract_columns_by_semantic_types.DataFrameCommon",
                "name": "Extracts columns by semantic type",
                "digest": "7c7ca2febf05d3138438919635143b6ba2b15606400442ddcf1c7107fa7e8207"
            },
            "arguments": {
                "inputs": {
                    "type": "CONTAINER",
                    "data": "steps.1.produce"
                }
            },
            "outputs": [
                {
                    "id": "produce"
                }
            ],
            "hyperparams": {
                "semantic_types": {
                    "type": "VALUE",
                    "data": [
                        "https://metadata.datadrivendiscovery.org/types/PrimaryKey",
                        "https://metadata.datadrivendiscovery.org/types/SuggestedTarget"
                    ]
                }
            }
        },
        {
            "type": "PRIMITIVE",
            "primitive": {
                "id": "7ddf2fd8-2f7f-4e53-96a7-0d9f5aeecf93",
                "version": "1.5.0",
                "python_path": "d3m.primitives.data_transformation.to_numeric.DSBOX",
                "name": "ISI DSBox To Numeric DataFrame",
                "digest": "c8a6dff4d8982c2b2ec772ff00fdeb66b353ce5fea992dabc4b3e3cf1dd07451"
            },
            "arguments": {
                "inputs": {
                    "type": "CONTAINER",
                    "data": "steps.2.produce"
                }
            },
            "outputs": [
                {
                    "id": "produce"
                }
            ]
        },
        {
            "type": "PRIMITIVE",
            "primitive": {
                "id": "7ddf2fd8-2f7f-4e53-96a7-0d9f5aeecf93",
                "version": "1.5.0",
                "python_path": "d3m.primitives.data_transformation.to_numeric.DSBOX",
                "name": "ISI DSBox To Numeric DataFrame",
                "digest": "c8a6dff4d8982c2b2ec772ff00fdeb66b353ce5fea992dabc4b3e3cf1dd07451"
            },
            "arguments": {
                "inputs": {
                    "type": "CONTAINER",
                    "data": "steps.3.produce"
                }
            },
            "outputs": [
                {
                    "id": "produce"
                }
            ]
        },
        {
            "type": "PRIMITIVE",
            "primitive": {
                "id": "c8d9e1b8-09f0-4b6a-b917-bfbc23f9d90b",
                "version": "1.5.0",
                "python_path": "d3m.primitives.time_series_forecasting.rnn_time_series.DSBOX",
                "name": "DSBox recurrent neural network for timeseries",
                "digest": "ee2b5540d419e04d2de4f2fb7678430d700793e09b594ced6e686537703749f8"
            },
            "arguments": {
                "inputs": {
                    "type": "CONTAINER",
                    "data": "steps.4.produce"
                },
                "outputs": {
                    "type": "CONTAINER",
                    "data": "steps.5.produce"
                }
            },
            "outputs": [
                {
                    "id": "produce"
                }
            ]
        }
    ],
    "digest": "cba885766de1c0ebcbf769af4211d1038accad296bbc0b25b09b148bdfa47e24"
}
