Partei_kurz:;"AG Inhalt"
Partei_lang:;"AG Inhalt"
Partei_Beschreibung:;"Die AG Inhalt kümmert sich um alle Inhalte (Texte, Bilder, Videos)"
Partei_URL:;"https://www"
Partei_Bild:;"data/appel.png"
0;"Technik ist zweitranging, wichtig ist der Inhalt!"
0;"Menschen sind ganz nett, aber hier geht es um Inhalte!"
0;"Informationen gibt es genug, hier geht es um die Darstellung!"
1;"Der Ton macht die Musik; den Text der Tonfall!."
1;"Ein Bild sagt mehr als tausend Worte!"
0;"Soziale Medien sind ganz nett, aber Inhalte sind Trumpf!"
#
Partei_kurz:;"AG Infrastruktur"
Partei_lang:;"AG Infrastruktur"
Partei_Beschreibung:;"Die AG Infrastruktur betreibt und wartet die Webseite, Kanäle, Accounts."
Partei_URL:;"https://www.banane.ba"
Partei_Bild:;"data/banane.jpg"
1;"Technik ist unser Leben!"
0;"Menschen sind doch die hinter dem Bildschirm?!"
1;"Halb gegoogelt ist ganz gewonnen!"
0;"Text wird überbewertet."
0;"Bilder liegen im Bilder-Ordner."
1;"Soziale Medien sind mein Treibstoff!"
#;
Partei_kurz:;"AG Öffentlichkeit"
Partei_lang:;"AG Öffentlichkeit"
Partei_Beschreibung:;"Die AG Öffentlichkeit betreibt die sozialen Medien."
Partei_URL:;"https://www.die-citronen.ca"
Partei_Bild:;"data/tbc.gif"
0;"Technik hat zu funktionieren"
1;"Menschen stehen hier im Mittelpunkt!"
0;"Wozu suchen? Wir haben etwas zu *sagen*!"
1;"Gut geframed ist halb gewonnen!"
0;"Bilder? Dafür haben wir unsere Leute!"
1;"Social Media ist mein zweiter und dritter Vorname!"
#;
Partei_kurz:;"AG Recherche"
Partei_lang:;"AG Recherche"
Partei_Beschreibung:;"Die AG Recherche sucht Informationen zu Petitionen"
Partei_URL:;"http://www.neutrale-partei.np"
Partei_Bild:;"data/egal.png"
0;"Technik ist halt da."
0;"Menschen, na gut."
1;"Informationen finden *uns*!"
1;"Finden ist gut, aufschreiben ist besser!"
0;"In Bildern sind manchmal Informationen versteckt. Wozu der Aufwand?"
0;"Soziale Medien - zu viel Meinung, zu wenig Information"
#;
Partei_kurz:;"AG Vernetzung"
Partei_lang:;"AG Vernetzung"
Partei_Beschreibung:;"Die AG Vernetzung stellt Kontakte her und erhält sich aufrecht"
Partei_URL:;"http://www.neutrale-partei.np"
Partei_Bild:;"data/egal.png"
0;"Technik - notwendiges Übel"
1;"Menschen sind das A und O."
1;"Gut vorbereitet ist halb vernetzt"
0;"Wozu texten wenn man reden kann?"
0;"Bilder braucht es höchstens im Adressbuch."
1;"I put the SOCIAL in SOCIAL MEDIA!"
#;
