[
  {
    Codigo: '1000-178-SE20',
    Nombre: 'Rep. de Maq. Dirección de Vialidad Prov. Biobío - Contrato servicio',
    CodigoEstado: 12,
    Estado: 'Recepción Conforme',
    CodigoLicitacion: '998-75-LE19',
    Descripcion: 'Rep. de Maq. Dirección de Vialidad Prov. Biobío - Contrato servicio',
    CodigoTipo: '8',
    Tipo: 'SE',
    TipoMoneda: 'CLP',
    CodigoEstadoProveedor: 7,
    EstadoProveedor: 'Recepción Conforme',
    Fechas: {
      FechaCreacion: '2020-08-03T14:14:38.077',
      FechaEnvio: '2020-08-03T14:17:53.537',
      FechaAceptacion: '2020-08-03T15:58:09.23',
      FechaCancelacion: null,
      FechaUltimaModificacion: '2020-08-03T14:17:00'
    },
    TieneItems: '1',
    PromedioCalificacion: 0,
    CantidadEvaluacion: 0,
    Descuentos: 0,
    Cargos: 0,
    TotalNeto: 543754,
    PorcentajeIva: 19,
    Impuestos: 103313,
    Total: 647067,
    Financiamiento: '04.31.02.004',
    Pais: 'CL',
    TipoDespacho: '12',
    FormaPago: '2',
    Comprador: {
      CodigoOrganismo: '7248',
      NombreOrganismo: 'MINISTERIO DE OBRAS PUBLICAS DIREC CION GRAL DE OO PP DCYF',
      RutUnidad: '61.202.000-0',
      CodigoUnidad: '1996',
      NombreUnidad: 'Dirección de Vialidad - VIII Región - Provincia Bio Bio',
      Actividad: 'GOBIERNO CENTRAL Y ADMINISTRACION PUBLICA',
      DireccionUnidad: 'Avda. Ricardo Vicuña Nº 243',
      ComunaUnidad: 'Los Angeles',
      RegionUnidad: 'Región del Biobío ',
      Pais: 'CL',
      NombreContacto: 'Ghislaine Bruning Cereceda',
      CargoContacto: 'Analista de Conservación',
      FonoContacto: '56-43-2532438',
      MailContacto: 'ghislaine.bruning@mop.gov.cl'
    },
    Proveedor: {
      Codigo: '1455379',
      Nombre: 'COMERCIAL WMC SPA',
      Actividad: 'COMERCIALIZADORA DE REPUESTOS Y TALLER MECANICO',
      CodigoSucursal: '859867',
      NombreSucursal: 'Comercial WMC SPA',
      RutSucursal: '76.502.565-6',
      Direccion: 'Camino a Coronel km 10 n°5580 modulo 9-E y 10-A',
      Comuna: 'San Pedro de La Paz',
      Region: 'Región del Biobío ',
      Pais: 'CL',
      NombreContacto: 'PABLO ELIAZAR AMAZA WORNER ',
      CargoContacto: 'Gerente GENERAL',
      FonoContacto: '56-41-3832889',
      MailContacto: 'pablo.amaza@wmc.cl'
    },
    Items: { Cantidad: 1, Listado: [Array] }
  }
]