2020-09-28T11:50:37.2511932-05:00 0HM33PQFVEK60:00000001 [INF] Request starting HTTP/1.1 GET http://localhost:8000/Tipos_activos/Create   (ca22a1cb)
2020-09-28T11:50:37.2875302-05:00 0HM33PQFVEK60:00000001 [WRN] Failed to determine the https port for redirect. (ca76cc21)
2020-09-28T11:50:37.2999159-05:00 0HM33PQFVEK60:00000001 [INF] No cached response available for this request. (4ce42171)
2020-09-28T11:50:37.6688769-05:00 0HM33PQFVEK60:00000001 [INF] Route matched with "{action = \"Create\", controller = \"Tipos_activos\"}". Executing controller action with signature "Microsoft.AspNetCore.Mvc.IActionResult Create()" on controller "Generic_appWeb.Controllers.Tipos_activosController" ("Generic_appWeb"). (122b2fdf)
2020-09-28T11:50:37.6805664-05:00 0HM33PQFVEK60:00000001 [INF] Executing action method "Generic_appWeb.Controllers.Tipos_activosController.Create (Generic_appWeb)" - Validation state: Valid (dad538d7)
2020-09-28T11:50:39.0838933-05:00 0HM33PQFVEK60:00000001 [INF] Executed action method "Generic_appWeb.Controllers.Tipos_activosController.Create (Generic_appWeb)", returned result "Microsoft.AspNetCore.Mvc.ViewResult" in 1399.8967ms. (50a9e262)
2020-09-28T11:50:39.1120828-05:00 0HM33PQFVEK60:00000001 [INF] Executing ViewResult, running view "Create". (c83d0e25)
2020-09-28T11:50:39.4247097-05:00 0HM33PQFVEK60:00000001 [INF] Executed ViewResult - view "Create" executed in 332.1006ms. (f66409e9)
2020-09-28T11:50:39.4252015-05:00 0HM33PQFVEK60:00000001 [INF] Executed action "Generic_appWeb.Controllers.Tipos_activosController.Create (Generic_appWeb)" in 1755.9891ms (afa2e885)
2020-09-28T11:50:39.4267860-05:00 0HM33PQFVEK60:00000001 [INF] The response could not be cached for this request. (64f94e2e)
2020-09-28T11:50:39.4331324-05:00 0HM33PQFVEK60:00000001 [INF] Request finished in 2187.03ms 200 text/html; charset=utf-8 (791a596a)
2020-09-28T11:50:39.6572379-05:00 0HM33PQFVEK60:00000002 [INF] Request starting HTTP/1.1 GET http://localhost:8000/Tipos_activos/Create   (ca22a1cb)
2020-09-28T11:50:39.6574340-05:00 0HM33PQFVEK60:00000002 [INF] No cached response available for this request. (4ce42171)
2020-09-28T11:50:39.6579091-05:00 0HM33PQFVEK60:00000002 [INF] Route matched with "{action = \"Create\", controller = \"Tipos_activos\"}". Executing controller action with signature "Microsoft.AspNetCore.Mvc.IActionResult Create()" on controller "Generic_appWeb.Controllers.Tipos_activosController" ("Generic_appWeb"). (122b2fdf)
2020-09-28T11:50:39.6583780-05:00 0HM33PQFVEK60:00000002 [INF] Executing action method "Generic_appWeb.Controllers.Tipos_activosController.Create (Generic_appWeb)" - Validation state: Valid (dad538d7)
2020-09-28T11:50:39.6628995-05:00 0HM33PQFVEK60:00000002 [INF] Executed action method "Generic_appWeb.Controllers.Tipos_activosController.Create (Generic_appWeb)", returned result "Microsoft.AspNetCore.Mvc.ViewResult" in 4.4241ms. (50a9e262)
2020-09-28T11:50:39.6631955-05:00 0HM33PQFVEK60:00000002 [INF] Executing ViewResult, running view "Create". (c83d0e25)
2020-09-28T11:50:39.6672897-05:00 0HM33PQFVEK60:00000002 [INF] Executed ViewResult - view "Create" executed in 4.2366ms. (f66409e9)
2020-09-28T11:50:39.6673690-05:00 0HM33PQFVEK60:00000002 [INF] Executed action "Generic_appWeb.Controllers.Tipos_activosController.Create (Generic_appWeb)" in 9.3377ms (afa2e885)
2020-09-28T11:50:39.6674018-05:00 0HM33PQFVEK60:00000002 [INF] The response could not be cached for this request. (64f94e2e)
2020-09-28T11:50:39.6675171-05:00 0HM33PQFVEK60:00000002 [INF] Request finished in 10.3137ms 200 text/html; charset=utf-8 (791a596a)
2020-09-28T11:50:44.5696359-05:00 0HM33PQFVEK60:00000003 [INF] Request starting HTTP/1.1 GET http://localhost:8000/Conjunto_datos_tecnicos/Create   (ca22a1cb)
2020-09-28T11:50:44.5697053-05:00 0HM33PQFVEK60:00000003 [INF] No cached response available for this request. (4ce42171)
2020-09-28T11:50:44.5718625-05:00 0HM33PQFVEK60:00000003 [INF] Route matched with "{action = \"Create\", controller = \"Conjunto_datos_tecnicos\"}". Executing controller action with signature "Microsoft.AspNetCore.Mvc.ActionResult Create()" on controller "Generic_appWeb.Controllers.Conjunto_datos_tecnicosController" ("Generic_appWeb"). (122b2fdf)
2020-09-28T11:50:44.5727804-05:00 0HM33PQFVEK60:00000003 [INF] Executing action method "Generic_appWeb.Controllers.Conjunto_datos_tecnicosController.Create (Generic_appWeb)" - Validation state: Valid (dad538d7)
2020-09-28T11:50:44.6662079-05:00 0HM33PQFVEK60:00000003 [INF] Executed action method "Generic_appWeb.Controllers.Conjunto_datos_tecnicosController.Create (Generic_appWeb)", returned result "Microsoft.AspNetCore.Mvc.ViewResult" in 93.3381ms. (50a9e262)
2020-09-28T11:50:44.6696031-05:00 0HM33PQFVEK60:00000003 [INF] Executing ViewResult, running view "Create". (c83d0e25)
2020-09-28T11:50:44.7752114-05:00 0HM33PQFVEK60:00000003 [INF] Executed ViewResult - view "Create" executed in 108.8637ms. (f66409e9)
2020-09-28T11:50:44.7752704-05:00 0HM33PQFVEK60:00000003 [INF] Executed action "Generic_appWeb.Controllers.Conjunto_datos_tecnicosController.Create (Generic_appWeb)" in 203.3258ms (afa2e885)
2020-09-28T11:50:44.7753019-05:00 0HM33PQFVEK60:00000003 [INF] The response could not be cached for this request. (64f94e2e)
2020-09-28T11:50:44.7753586-05:00 0HM33PQFVEK60:00000003 [INF] Request finished in 205.7868ms 200 text/html; charset=utf-8 (791a596a)
2020-09-28T11:50:44.8033471-05:00 0HM33PQFVEK60:00000004 [INF] Request starting HTTP/1.1 GET http://localhost:8000/Js/Conjunto_datos_tecnicos_create.js   (ca22a1cb)
2020-09-28T11:50:44.8553686-05:00 0HM33PQFVEK60:00000004 [INF] Sending file. Request path: '"/Js/Conjunto_datos_tecnicos_create.js"'. Physical path: '"C:\Users\vicente.pinargote\Desktop\COPIA MODIFICACIONES CINDY\Sistema Riego\GenericApp_web\Generic_appWeb\wwwroot\Js\Conjunto_datos_tecnicos_create.js"' (27b0a520)
2020-09-28T11:50:44.8574365-05:00 0HM33PQFVEK60:00000004 [INF] Request finished in 54.1039ms 200 application/javascript (791a596a)
2020-09-28T11:50:53.2744305-05:00 0HM33PQFVEK60:00000005 [INF] Request starting HTTP/1.1 GET http://localhost:8000/Inv_datos_tecnicos/PartialIndex_multiSelect?grupo_datos_tecnicos_id=0&categoria_datos_tecnicos_id=0&tipos_datos_tecnicos_id=0 application/json; charset=utf-8  (ca22a1cb)
2020-09-28T11:50:53.2746479-05:00 0HM33PQFVEK60:00000005 [INF] No cached response available for this request. (4ce42171)
2020-09-28T11:50:53.2932574-05:00 0HM33PQFVEK60:00000005 [INF] Route matched with "{action = \"PartialIndex_multiSelect\", controller = \"Inv_datos_tecnicos\"}". Executing controller action with signature "Microsoft.AspNetCore.Mvc.IActionResult PartialIndex_multiSelect(System.Nullable`1[System.Int32], System.Nullable`1[System.Int32], System.Nullable`1[System.Int32])" on controller "Generic_appWeb.Controllers.Inv_datos_tecnicosController" ("Generic_appWeb"). (122b2fdf)
2020-09-28T11:50:53.3099742-05:00 0HM33PQFVEK60:00000005 [INF] Executing action method "Generic_appWeb.Controllers.Inv_datos_tecnicosController.PartialIndex_multiSelect (Generic_appWeb)" - Validation state: Valid (dad538d7)
2020-09-28T11:50:53.7277613-05:00 0HM33PQFVEK60:00000005 [INF] Executed action method "Generic_appWeb.Controllers.Inv_datos_tecnicosController.PartialIndex_multiSelect (Generic_appWeb)", returned result "Microsoft.AspNetCore.Mvc.PartialViewResult" in 417.656ms. (50a9e262)
2020-09-28T11:50:53.7331597-05:00 0HM33PQFVEK60:00000005 [INF] Executing PartialViewResult, running view "PartialIndex_multiSelect". (1d3d4b21)
2020-09-28T11:50:53.8012861-05:00 0HM33PQFVEK60:00000005 [INF] Executed PartialViewResult - view null executed in 71.3703ms. (6f83ade2)
2020-09-28T11:50:53.8013490-05:00 0HM33PQFVEK60:00000005 [INF] Executed action "Generic_appWeb.Controllers.Inv_datos_tecnicosController.PartialIndex_multiSelect (Generic_appWeb)" in 508.0373ms (afa2e885)
2020-09-28T11:50:53.8013718-05:00 0HM33PQFVEK60:00000005 [INF] The response could not be cached for this request. (64f94e2e)
2020-09-28T11:50:53.8014335-05:00 0HM33PQFVEK60:00000005 [INF] Request finished in 527.1367ms 200 text/html; charset=utf-8 (791a596a)
2020-09-28T12:26:52.6759615-05:00 0HM33PQFVEK63:00000001 [INF] Request starting HTTP/1.1 GET http://localhost:8000/Inv_datos_tecnicos/PartialIndex_multiSelect?grupo_datos_tecnicos_id=0&categoria_datos_tecnicos_id=0&tipos_datos_tecnicos_id=0 application/json; charset=utf-8  (ca22a1cb)
2020-09-28T12:26:52.6761861-05:00 0HM33PQFVEK63:00000001 [INF] No cached response available for this request. (4ce42171)
2020-09-28T12:26:52.6764512-05:00 0HM33PQFVEK63:00000001 [INF] Route matched with "{action = \"PartialIndex_multiSelect\", controller = \"Inv_datos_tecnicos\"}". Executing controller action with signature "Microsoft.AspNetCore.Mvc.IActionResult PartialIndex_multiSelect(System.Nullable`1[System.Int32], System.Nullable`1[System.Int32], System.Nullable`1[System.Int32])" on controller "Generic_appWeb.Controllers.Inv_datos_tecnicosController" ("Generic_appWeb"). (122b2fdf)
2020-09-28T12:26:52.6771877-05:00 0HM33PQFVEK63:00000001 [INF] Executing action method "Generic_appWeb.Controllers.Inv_datos_tecnicosController.PartialIndex_multiSelect (Generic_appWeb)" - Validation state: Valid (dad538d7)
2020-09-28T12:26:52.7425299-05:00 0HM33PQFVEK63:00000001 [INF] Executed action method "Generic_appWeb.Controllers.Inv_datos_tecnicosController.PartialIndex_multiSelect (Generic_appWeb)", returned result "Microsoft.AspNetCore.Mvc.PartialViewResult" in 65.2533ms. (50a9e262)
2020-09-28T12:26:52.7437070-05:00 0HM33PQFVEK63:00000001 [INF] Executing PartialViewResult, running view "PartialIndex_multiSelect". (1d3d4b21)
2020-09-28T12:26:52.7603975-05:00 0HM33PQFVEK63:00000001 [INF] Executed PartialViewResult - view null executed in 17.5722ms. (6f83ade2)
2020-09-28T12:26:52.7604758-05:00 0HM33PQFVEK63:00000001 [INF] Executed action "Generic_appWeb.Controllers.Inv_datos_tecnicosController.PartialIndex_multiSelect (Generic_appWeb)" in 83.966ms (afa2e885)
2020-09-28T12:26:52.7605083-05:00 0HM33PQFVEK63:00000001 [INF] The response could not be cached for this request. (64f94e2e)
2020-09-28T12:26:52.7605572-05:00 0HM33PQFVEK63:00000001 [INF] Request finished in 84.7797ms 200 text/html; charset=utf-8 (791a596a)
