2020-08-28T11:52:52.6339736-05:00 0HM2BEB6SKMID:00000001 [INF] Request starting HTTP/1.1 GET http://localhost:8000/Lugares/Index   (ca22a1cb)
2020-08-28T11:52:52.8160672-05:00 0HM2BEB6SKMID:00000001 [WRN] Failed to determine the https port for redirect. (ca76cc21)
2020-08-28T11:52:52.8695660-05:00 0HM2BEB6SKMID:00000001 [INF] No cached response available for this request. (4ce42171)
2020-08-28T11:52:53.6623105-05:00 0HM2BEB6SKMID:00000001 [INF] Route matched with "{action = \"Index\", controller = \"Lugares\"}". Executing controller action with signature "Microsoft.AspNetCore.Mvc.IActionResult Index()" on controller "Generic_appWeb.Controllers.LugaresController" ("Generic_appWeb"). (122b2fdf)
2020-08-28T11:52:53.6829830-05:00 0HM2BEB6SKMID:00000001 [INF] Executing action method "Generic_appWeb.Controllers.LugaresController.Index (Generic_appWeb)" - Validation state: Valid (dad538d7)
2020-08-28T11:52:55.5439320-05:00 0HM2BEB6SKMID:00000001 [INF] Executed action method "Generic_appWeb.Controllers.LugaresController.Index (Generic_appWeb)", returned result "Microsoft.AspNetCore.Mvc.ViewResult" in 1849.2153ms. (50a9e262)
2020-08-28T11:52:55.6036972-05:00 0HM2BEB6SKMID:00000001 [INF] Executing ViewResult, running view "Index". (c83d0e25)
2020-08-28T11:52:55.8751766-05:00 0HM2BEB6SKMID:00000001 [INF] Executed ViewResult - view "Index" executed in 316.26ms. (f66409e9)
2020-08-28T11:52:55.8756674-05:00 0HM2BEB6SKMID:00000001 [INF] Executed action "Generic_appWeb.Controllers.LugaresController.Index (Generic_appWeb)" in 2213.0432ms (afa2e885)
2020-08-28T11:52:55.8775011-05:00 0HM2BEB6SKMID:00000001 [INF] The response could not be cached for this request. (64f94e2e)
2020-08-28T11:52:55.8969326-05:00 0HM2BEB6SKMID:00000001 [INF] Request finished in 3268.7816ms 200 text/html; charset=utf-8 (791a596a)
2020-08-28T11:53:06.4300521-05:00 0HM2BEB6SKMID:00000002 [INF] Request starting HTTP/1.1 GET http://localhost:8000/Lugares/Edit/1?gr_id=1&ca_id=1   (ca22a1cb)
2020-08-28T11:53:06.4302375-05:00 0HM2BEB6SKMID:00000002 [INF] No cached response available for this request. (4ce42171)
2020-08-28T11:53:06.4776545-05:00 0HM2BEB6SKMID:00000002 [INF] Route matched with "{action = \"Edit\", controller = \"Lugares\"}". Executing controller action with signature "Microsoft.AspNetCore.Mvc.IActionResult Edit(System.Nullable`1[System.Int32], Int32, Int32, Int32, Int32)" on controller "Generic_appWeb.Controllers.LugaresController" ("Generic_appWeb"). (122b2fdf)
2020-08-28T11:53:06.5133401-05:00 0HM2BEB6SKMID:00000002 [INF] Executing action method "Generic_appWeb.Controllers.LugaresController.Edit (Generic_appWeb)" - Validation state: Valid (dad538d7)
2020-08-28T11:53:06.7216790-05:00 0HM2BEB6SKMID:00000002 [INF] Executed action method "Generic_appWeb.Controllers.LugaresController.Edit (Generic_appWeb)", returned result "Microsoft.AspNetCore.Mvc.ViewResult" in 208.1321ms. (50a9e262)
2020-08-28T11:53:06.7437663-05:00 0HM2BEB6SKMID:00000002 [INF] Executing ViewResult, running view "Edit". (c83d0e25)
2020-08-28T11:53:07.2149560-05:00 0HM2BEB6SKMID:00000002 [INF] Executed ViewResult - view "Edit" executed in 493.0119ms. (f66409e9)
2020-08-28T11:53:07.2150857-05:00 0HM2BEB6SKMID:00000002 [INF] Executed action "Generic_appWeb.Controllers.LugaresController.Edit (Generic_appWeb)" in 737.4101ms (afa2e885)
2020-08-28T11:53:07.2151112-05:00 0HM2BEB6SKMID:00000002 [INF] The response could not be cached for this request. (64f94e2e)
2020-08-28T11:53:07.2152743-05:00 0HM2BEB6SKMID:00000002 [INF] Request finished in 785.3539ms 200 text/html; charset=utf-8 (791a596a)
