<?xml version="1.0" encoding="UTF-8" standalone="no"?>
<!-- Generator: Adobe Illustrator 24.2.3, SVG Export Plug-In . SVG Version: 6.00 Build 0)  -->

<svg
   version="1.1"
   id="Layer_1"
   x="0px"
   y="0px"
   viewBox="0 0 2835.0571 508.33936"
   xml:space="preserve"
   width="2835.0571"
   height="508.33936"
   xmlns="http://www.w3.org/2000/svg"
   xmlns:svg="http://www.w3.org/2000/svg"><defs
   id="defs178"><rect
     x="535.87592"
     y="-258.36066"
     width="3177.3076"
     height="1010.681"
     id="rect56100" /><rect
     x="540.62256"
     y="-63.932861"
     width="3178.4209"
     height="601.58636"
     id="rect38168" /><rect
     x="610.36981"
     y="110.64349"
     width="0.63669556"
     height="100.53669"
     id="rect25236" /><rect
     x="1587.8997"
     y="407.70001"
     width="120.64295"
     height="247.59006"
     id="rect22832" /><rect
     x="578.69977"
     y="59"
     width="3135.5002"
     height="434"
     id="rect9964" /></defs>
<style
   type="text/css"
   id="style144">
	.st0{fill:#4D4D4D;}
	.st1{fill:#0AC18E;}
	.st2{fill:#FFFFFF;}
</style>
<g
   id="g168"
   transform="translate(0,2.3393607)">
	
	
	
	
	
	
	
	
	
	
	
<text
   xml:space="preserve"
   id="text25234"
   style="font-style:normal;font-variant:normal;font-weight:bold;font-stretch:normal;font-size:533.333px;line-height:1.25;font-family:Ubuntu;-inkscape-font-specification:'Ubuntu Bold';letter-spacing:0px;word-spacing:0px;white-space:pre;shape-inside:url(#rect25236);fill:#000000;fill-opacity:1;stroke:none"
   transform="translate(1.6300764,188.78973)" /><text
   xml:space="preserve"
   id="text56098"
   style="font-style:normal;font-variant:normal;font-weight:bold;font-stretch:normal;font-size:600px;line-height:1.25;font-family:Ubuntu;-inkscape-font-specification:'Ubuntu Bold';letter-spacing:-35.02px;word-spacing:0px;white-space:pre;shape-inside:url(#rect56100);fill:#000000;fill-opacity:1;stroke:none"
   transform="translate(-25.093759,162.12665)"><tspan
     x="535.875"
     y="301.13399"
     id="tspan12553"><tspan
       style="fill:#4d4d4d"
       id="tspan12549">Cash</tspan><tspan
       style="fill:#0ac18e"
       id="tspan12551">RPC</tspan></tspan></text></g>
<g
   id="g173"
   transform="translate(0,2.3393607)">
	<circle
   class="st1"
   cx="249.5"
   cy="256.5"
   r="249.5"
   id="circle170" />
	<path
   id="symbol_1_"
   class="st2"
   d="m 327.10001,173 c -12.5,-28.39999 -41.20001,-34.3 -76.39999,-28.5 l -11.3,-43.7 -26.7,6.9 11.10001,43.7 c -7,1.8 -14.2,3.3 -21.3,5.3 l -11.2,-43.4 -26.7,6.9 11.3,43.8 c -5.7,1.60001 -53.7,14 -53.7,14 l 7.39999,28.5 c 0,0 19.60001,-5.5 19.39999,-5 10.8,-2.8 15.89999,2.60001 18.39999,7.7 l 31,120 c 0.39999,3.5 -0.2,9.5 -7.7,11.39999 0.39999,0.20001 -19.39999,5 -19.39999,5 L 174.2,378.8 c 0,0 47.5,-12.20001 53.8,-13.70001 l 11.5,44.29999 26.60001,-6.89998 -11.39999,-44.60001 c 7.39999,-1.70001 14.39999,-3.5 21.39999,-5.29999 L 287.5,397 314.20001,390.10001 302.80002,345.9 c 41,-10 70,-35.79999 64,-75.39999 -3.79999,-23.8 -29.79999,-43.39999 -51.5,-45.60001 13.29999,-12.1 20.09997,-29.29999 11.79999,-51.9 z m -12.80002,104.39999 c 5.29999,39.20001 -49.10001,44 -67.2,48.70001 l -15.7,-58.60001 c 18.20002,-4.7 74,-24.6 82.9,9.9 z M 281.5,197.7 c 5.60001,34.8 -40.89999,38.90001 -56,42.8 l -14.3,-53.2 c 15.1,-3.90001 58.90001,-21.90001 70.3,10.4 z" />
</g>
</svg>
