<svg id="Layer_1" width="350" height="350" data-name="Layer 1" xmlns="http://www.w3.org/2000/svg" viewBox="0 0 719.6 509.54">
  <defs>
    <style>
      .cls-1 {
        fill: #f7f7f7;
      }

      .cls-2 {
        fill: #f4f4f5;
      }

      .cls-17, .cls-3 {
        fill: #e6e7e8;
      }

      .cls-4 {
        fill: #f2f2f2;
      }

      .cls-5 {
        fill: #ececed;
      }

      .cls-19, .cls-6 {
        fill: #f8931f;
      }

      .cls-7 {
        fill: #fbbe78;
      }

      .cls-26, .cls-8 {
        fill: #f26b68;
      }

      .cls-9 {
        fill: #293748;
      }

      .cls-10, .cls-14, .cls-15, .cls-21, .cls-22, .cls-23, .cls-25 {
        fill: none;
      }

      .cls-10 {
        stroke: #90a4ae;
        stroke-width: 1.04px;
      }

      .cls-10, .cls-18, .cls-26 {
        stroke-miterlimit: 10;
      }

      .cls-11 {
        fill: #fff;
      }

      .cls-12 {
        fill: #7f7f7f;
      }

      .cls-12, .cls-13, .cls-14, .cls-15, .cls-16, .cls-17, .cls-18, .cls-19, .cls-20, .cls-22, .cls-23, .cls-25, .cls-26 {
        stroke: #333;
      }

      .cls-12, .cls-13, .cls-14, .cls-15, .cls-16, .cls-17, .cls-19, .cls-20, .cls-21, .cls-22, .cls-23, .cls-25 {
        stroke-linecap: round;
        stroke-linejoin: round;
      }

      .cls-12, .cls-13, .cls-14, .cls-16, .cls-17, .cls-19, .cls-20, .cls-21, .cls-26 {
        stroke-width: 1.94px;
      }

      .cls-13 {
        fill: #fd7c55;
      }

      .cls-15 {
        stroke-width: 2.43px;
      }

      .cls-16 {
        fill: #ccc;
      }

      .cls-18 {
        fill: #231f20;
        stroke-width: 0.49px;
      }

      .cls-20 {
        fill: #ff6762;
      }

      .cls-21 {
        stroke: #848484;
        opacity: 0.66;
      }

      .cls-22 {
        stroke-width: 0.97px;
      }

      .cls-23 {
        stroke-width: 2.06px;
      }

      .cls-24 {
        fill: #333;
      }

      .cls-25 {
        stroke-width: 3.89px;
      }
    </style>
  </defs>
  <title>error_page</title>
  <path class="cls-1" d="M759.8,538.59H40.2c13-187.4,169.1-335.4,359.8-335.4S746.83,351.18,759.8,538.59Z" transform="translate(-40.2 -45.23)"/>
  <g>
    <rect class="cls-1" x="343.13" y="346.07" width="48.61" height="146.07"/>
    <rect class="cls-1" x="191.47" y="346.07" width="48.61" height="146.07"/>
    <rect class="cls-1" x="203.63" y="397.6" width="32.08" height="94.54"/>
    <rect class="cls-2" x="296.09" y="398.69" width="48.61" height="138.68" transform="translate(600.59 890.84) rotate(-180)"/>
    <rect class="cls-3" x="226.96" y="382.04" width="32.08" height="110.1"/>
    <rect class="cls-3" x="329.63" y="373.64" width="48.61" height="163.73" transform="translate(667.67 865.78) rotate(-180)"/>
    <rect class="cls-3" x="189.64" y="416.58" width="48.61" height="120.79" transform="translate(387.68 908.72) rotate(-180)"/>
    <rect class="cls-4" x="141.03" y="435.06" width="48.61" height="102.31" transform="translate(290.47 927.2) rotate(-180)"/>
    <rect class="cls-3" x="602.47" y="417.77" width="43.63" height="74.37"/>
    <rect class="cls-4" x="633.44" y="439.85" width="43.63" height="52.29"/>
    <rect class="cls-4" x="72.98" y="485.08" width="43.63" height="52.29" transform="translate(149.38 977.23) rotate(-180)"/>
    <rect class="cls-3" x="103.95" y="463" width="43.63" height="74.37" transform="translate(211.34 955.14) rotate(-180)"/>
    <rect class="cls-4" x="504.51" y="407.56" width="63.43" height="84.58"/>
    <rect class="cls-3" x="535.62" y="394.44" width="63.43" height="97.7"/>
    <rect class="cls-4" x="336.82" y="417.81" width="63.43" height="74.33"/>
    <rect class="cls-5" x="409.24" y="314.23" width="48.61" height="177.91"/>
    <rect class="cls-3" x="363.11" y="389.37" width="36.41" height="102.77"/>
    <rect class="cls-3" x="447.64" y="341.46" width="48.61" height="150.69"/>
    <path class="cls-3" d="M471.84,357.56a1.94,1.94,0,0,1-1.94-1.94V333.75a1.94,1.94,0,1,1,3.89,0v21.87A1.94,1.94,0,0,1,471.84,357.56Z" transform="translate(-40.2 -45.23)"/>
    <path class="cls-3" d="M342.54,376a1.94,1.94,0,0,1-1.94-1.94V352.22a1.94,1.94,0,0,1,3.89,0v21.87A1.94,1.94,0,0,1,342.54,376Z" transform="translate(-40.2 -45.23)"/>
    <path class="cls-3" d="M217.13,427.56a1.94,1.94,0,0,1-1.94-1.94V403.74a1.94,1.94,0,0,1,3.89,0v21.87A1.94,1.94,0,0,1,217.13,427.56Z" transform="translate(-40.2 -45.23)"/>
  </g>
  <g>
    <g>
      <path class="cls-6" d="M709,510.14H695.68l5.49-15.81a1.2,1.2,0,0,1,2.34,0Z" transform="translate(-40.2 -45.23)"/>
      <polygon class="cls-6" points="677.42 489.72 646.87 489.72 652.25 474.21 672.03 474.21 677.42 489.72"/>
    </g>
    <path class="cls-7" d="M644.32,486.23h34.84a1.7,1.7,0,0,1,1.7,1.7v2.19a0,0,0,0,1,0,0H642.62a0,0,0,0,1,0,0v-2.19A1.7,1.7,0,0,1,644.32,486.23Z"/>
  </g>
  <g>
    <path class="cls-8" d="M350.75,92.68h8.62v12.18h-8.62v16.46h-15.1V104.86h-31.2l-.68-9.51,31.72-50.12h15.26Zm-31.93,0h16.83V65.82l-1,1.72Z" transform="translate(-40.2 -45.23)"/>
    <path class="cls-8" d="M492.11,92.68h8.62v12.18h-8.62v16.46H477V104.86h-31.2l-.68-9.51,31.72-50.12h15.26Zm-31.93,0H477V65.82l-1,1.72Z" transform="translate(-40.2 -45.23)"/>
  </g>
  <g>
    <path class="cls-9" d="M319.06,140.57v3.67h-1.61v-9.68h3.78a3.58,3.58,0,0,1,2.51.83,3.07,3.07,0,0,1,0,4.36,3.6,3.6,0,0,1-2.51.82Zm0-1.3h2.17a1.77,1.77,0,0,0,1.35-.48,1.7,1.7,0,0,0,.45-1.22,1.63,1.63,0,0,0-1.8-1.72h-2.17Z" transform="translate(-40.2 -45.23)"/>
    <path class="cls-9" d="M334.41,142h-3.79l-.77,2.26h-1.63l3.56-9.68h1.53l3.52,9.68h-1.64Zm-3.32-1.35H334l-1.4-4.13h0Z" transform="translate(-40.2 -45.23)"/>
    <path class="cls-9" d="M349.23,142.93a3.37,3.37,0,0,1-1.27,1,5,5,0,0,1-2.26.45,3.94,3.94,0,0,1-2.88-1.11,3.83,3.83,0,0,1-1.13-2.86v-2a4,4,0,0,1,1.07-2.86,3.66,3.66,0,0,1,2.75-1.11,3.86,3.86,0,0,1,2.65.84,2.85,2.85,0,0,1,1,2.19v0H347.6a1.87,1.87,0,0,0-.57-1.29,2.09,2.09,0,0,0-1.49-.49,2,2,0,0,0-1.62.75,2.91,2.91,0,0,0-.61,1.91v2a2.79,2.79,0,0,0,.67,1.92,2.21,2.21,0,0,0,1.73.75,3.58,3.58,0,0,0,1.23-.18,1.7,1.7,0,0,0,.68-.41v-2H345.7v-1.21h3.54Z" transform="translate(-40.2 -45.23)"/>
    <path class="cls-9" d="M361.14,139.88h-4.23v3.06h4.91v1.3H355.3v-9.68h6.48v1.3h-4.86v2.73h4.23Z" transform="translate(-40.2 -45.23)"/>
    <path class="cls-9" d="M389.77,144.24h-1.61l-4.29-7.06h0v7.05h-1.61v-9.68h1.61l4.29,7.06h0v-7h1.61Z" transform="translate(-40.2 -45.23)"/>
    <path class="cls-9" d="M403.51,140.27a4.09,4.09,0,0,1-1.11,2.94,3.81,3.81,0,0,1-2.89,1.17,3.69,3.69,0,0,1-2.83-1.17,4.15,4.15,0,0,1-1.09-2.94v-1.74a4.15,4.15,0,0,1,1.09-2.94,3.67,3.67,0,0,1,2.82-1.17,3.82,3.82,0,0,1,2.89,1.17,4.09,4.09,0,0,1,1.12,2.94Zm-1.61-1.75a3,3,0,0,0-.65-2,2.16,2.16,0,0,0-1.75-.78,2,2,0,0,0-1.68.78,3.1,3.1,0,0,0-.62,2v1.75a3.13,3.13,0,0,0,.62,2,2,2,0,0,0,1.69.78,2.15,2.15,0,0,0,1.75-.78,3,3,0,0,0,.64-2Z" transform="translate(-40.2 -45.23)"/>
    <path class="cls-9" d="M415.76,135.86h-2.92v8.38h-1.61v-8.38H408.3v-1.3h7.46Z" transform="translate(-40.2 -45.23)"/>
    <path class="cls-9" d="M434.44,140.11H430.2v4.13h-1.61v-9.68h6.53v1.3H430.2v3h4.24Z" transform="translate(-40.2 -45.23)"/>
    <path class="cls-9" d="M448.1,140.27a4.09,4.09,0,0,1-1.11,2.94,3.81,3.81,0,0,1-2.89,1.17,3.69,3.69,0,0,1-2.83-1.17,4.15,4.15,0,0,1-1.09-2.94v-1.74a4.15,4.15,0,0,1,1.09-2.94,3.67,3.67,0,0,1,2.82-1.17,3.82,3.82,0,0,1,2.89,1.17,4.09,4.09,0,0,1,1.12,2.94Zm-1.61-1.75a3,3,0,0,0-.65-2,2.16,2.16,0,0,0-1.75-.78,2,2,0,0,0-1.68.78,3.1,3.1,0,0,0-.62,2v1.75a3.13,3.13,0,0,0,.62,2,2,2,0,0,0,1.69.78,2.15,2.15,0,0,0,1.75-.78,3,3,0,0,0,.64-2Z" transform="translate(-40.2 -45.23)"/>
    <path class="cls-9" d="M461.29,134.56V141a3,3,0,0,1-1.05,2.47,4.19,4.19,0,0,1-2.74.86,4,4,0,0,1-2.69-.86,3,3,0,0,1-1-2.47v-6.49h1.61V141a1.94,1.94,0,0,0,.57,1.53,2.22,2.22,0,0,0,1.54.51,2.35,2.35,0,0,0,1.59-.51,1.91,1.91,0,0,0,.59-1.53v-6.48Z" transform="translate(-40.2 -45.23)"/>
    <path class="cls-9" d="M474.85,144.24h-1.61L469,137.17h0v7.05H467.3v-9.68h1.61l4.29,7.06h0v-7h1.61Z" transform="translate(-40.2 -45.23)"/>
    <path class="cls-9" d="M481.05,144.24v-9.68h3.14a4.06,4.06,0,0,1,3,1.15,4,4,0,0,1,1.15,3v1.47a4,4,0,0,1-1.15,3,4.07,4.07,0,0,1-3,1.14Zm1.61-8.38v7.08h1.48a2.39,2.39,0,0,0,1.89-.78,3,3,0,0,0,.69-2v-1.48a2.94,2.94,0,0,0-.69-2,2.39,2.39,0,0,0-1.89-.78Z" transform="translate(-40.2 -45.23)"/>
  </g>
  <circle class="cls-8" cx="363.25" cy="38.39" r="30.62"/>
  <path class="cls-10" d="M403.45,83.62" transform="translate(-40.2 -45.23)"/>
  <g id="_Group_" data-name="&lt;Group&gt;">
    <path id="_Compound_Path_" data-name="&lt;Compound Path&gt;" class="cls-11" d="M403.28,104.05A20.43,20.43,0,1,0,383,83.46,20.43,20.43,0,0,0,403.28,104.05Zm-13.6-34.41a19.62,19.62,0,1,1-5.86,13.83A19.49,19.49,0,0,1,389.69,69.64Z" transform="translate(-40.2 -45.23)"/>
    <path id="_Compound_Path_2" data-name="&lt;Compound Path&gt;" class="cls-11" d="M403.3,101.54a17.92,17.92,0,1,0-12.63-5.35A17.8,17.8,0,0,0,403.3,101.54Zm-3.13-22.29A5.46,5.46,0,1,1,398,83.58,5.43,5.43,0,0,1,400.17,79.26Zm17.32,8.15a14.57,14.57,0,0,1-7.11,9A2.66,2.66,0,0,1,406.45,94V92.17a7.39,7.39,0,0,1,1-3.44,6.53,6.53,0,0,0,1.47-1.62,7.25,7.25,0,0,1,3.28-.85l4.43,0A.89.89,0,0,1,417.49,87.41Zm-27.91-8.15a14.54,14.54,0,0,1,27.64-.32.89.89,0,0,1-.84,1.18l-4.11,0a13.14,13.14,0,0,1-4-.79,6.5,6.5,0,0,0-9.57-.12,7.87,7.87,0,0,1-4,1.27l-4.27,0A.89.89,0,0,1,389.58,79.25Zm.77,7.33,4.29,0a12.16,12.16,0,0,1,3.39.6,6.53,6.53,0,0,0,1.32,1.45,7.39,7.39,0,0,1,.94,3.46V94a2.66,2.66,0,0,1-4,2.29,14.57,14.57,0,0,1-6.8-8.57A.89.89,0,0,1,390.35,86.58Z" transform="translate(-40.2 -45.23)"/>
    <path id="_Compound_Path_3" data-name="&lt;Compound Path&gt;" class="cls-11" d="M403.41,87.6a4,4,0,1,0-3.94-4A4,4,0,0,0,403.41,87.6Zm-1.69-5.88a2.57,2.57,0,1,1-.85,1.89A2.56,2.56,0,0,1,401.72,81.72Z" transform="translate(-40.2 -45.23)"/>
    <path id="_Path_" data-name="&lt;Path&gt;" class="cls-11" d="M403.43,85.21a1.58,1.58,0,0,0,1.21-.55l0,0a1.59,1.59,0,1,0-1.24.58Z" transform="translate(-40.2 -45.23)"/>
  </g>
  <g>
    <g>
      <g>
        <line class="cls-12" x1="133.81" y1="492.14" x2="182.67" y2="492.14"/>
        <line class="cls-13" x1="31.97" y1="492.14" x2="135.03" y2="492.14"/>
        <line class="cls-14" x1="2.48" y1="492.14" x2="23.36" y2="492.14"/>
      </g>
      <line class="cls-14" x1="169.48" y1="492.14" x2="169.48" y2="489.89"/>
    </g>
    <g>
      <line class="cls-12" x1="202.79" y1="492.14" x2="416.19" y2="492.14"/>
      <line class="cls-14" x1="188.65" y1="492.14" x2="197.2" y2="492.14"/>
      <g>
        <line class="cls-14" x1="358.1" y1="491.17" x2="358.1" y2="489.23"/>
        <line class="cls-14" x1="363.26" y1="491.17" x2="363.26" y2="486.98"/>
        <line class="cls-14" x1="369.28" y1="491.17" x2="369.28" y2="489.53"/>
      </g>
    </g>
    <g>
      <g>
        <line class="cls-15" x1="475.97" y1="490.93" x2="689.36" y2="490.93"/>
        <line class="cls-15" x1="698.8" y1="490.93" x2="713.36" y2="490.93"/>
      </g>
      <g>
        <ellipse class="cls-3" cx="568.09" cy="502.59" rx="10.63" ry="0.71"/>
        <ellipse class="cls-3" cx="374.4" cy="500" rx="12.96" ry="1.46"/>
        <ellipse class="cls-3" cx="186.29" cy="507.45" rx="18.53" ry="2.09"/>
        <ellipse class="cls-3" cx="283.34" cy="507.13" rx="7.2" ry="0.81"/>
        <ellipse class="cls-3" cx="51.64" cy="502.92" rx="10.08" ry="1.13"/>
      </g>
    </g>
  </g>
  <path class="cls-11" d="M399.57,349.77a6.18,6.18,0,0,1-4,5.8H378.78a6.18,6.18,0,0,1-5.45-9.07,6.07,6.07,0,0,1,.39-.63,6.18,6.18,0,0,1,6.64-2.44,6.18,6.18,0,0,1,12.12.25,6.3,6.3,0,0,1,.93-.07,6.17,6.17,0,0,1,6.18,6.18Z" transform="translate(-40.2 -45.23)"/>
  <path class="cls-11" d="M575.72,357.14h0a1.28,1.28,0,0,1-1.29,1.26H533.17a1.29,1.29,0,0,1-1.29-1.2q0-.34,0-.69a10,10,0,0,1,1.17-4.72,10.53,10.53,0,0,1,.63-1,10,10,0,0,1,8.24-4.3,10.18,10.18,0,0,1,1.48.11,1.28,1.28,0,0,0,1.38-.89,10,10,0,0,1,19.16.45,1.28,1.28,0,0,0,1.28,1h.49a10,10,0,0,1,10,10Z" transform="translate(-40.2 -45.23)"/>
  <path class="cls-11" d="M225.48,388.93a4.58,4.58,0,0,1-3,4.3H210a4.58,4.58,0,0,1-4-6.73,4.5,4.5,0,0,1,.29-.47,4.59,4.59,0,0,1,4.92-1.81,4.58,4.58,0,0,1,9,.18,4.68,4.68,0,0,1,.69-.05,4.58,4.58,0,0,1,4.58,4.58Z" transform="translate(-40.2 -45.23)"/>
  <g>
    <path class="cls-8" d="M375,518.38c23.62-4.49,22.43-21.91,22.23-24.79,0-.24,0-.37,0-.37a23.31,23.31,0,0,0-3-9.88c-4.86-8.32-13.84-9.46-14.77-9.55l-.17,0c-13.83-3.1-47.48-8.36-56.17-9.71a10.76,10.76,0,0,1-3.88-1.4l-52.53-26.18-.08,0a20,20,0,0,0-10.26-2.83l-55.86-1.13c-26.41-.49-46,15.07-46,15.07-9.09,6.71-16.21,9.55-19.8,10.67a14.77,14.77,0,0,1-4.42.67H101.57c-9.75.59-11.85,6-12.2,7.22a1.55,1.55,0,0,0-.06.43v21.84A1.62,1.62,0,0,1,87.69,490h0a1.62,1.62,0,0,0-1.62,1.62v3.26a1.65,1.65,0,0,0,.43,1.09,22.93,22.93,0,0,1,5.38,13.57A1.62,1.62,0,0,0,93.12,511l30.81,7.26" transform="translate(-40.2 -45.23)"/>
    <polyline class="cls-12" points="332.09 457.14 355.97 457.24 356.4 448.39 356.23 448.39 347.32 448.39 325.05 448.39"/>
    <path class="cls-16" d="M298.21,465H153.81a1,1,0,0,1-1-1v-1.25a4,4,0,0,1,1.59-3.19c5.72-4.3,25.44-18.56,35.35-18.56,0,0,43.22,0,61.11.55a30,30,0,0,1,13,3.4l34.82,18.18A1,1,0,0,1,298.21,465Z" transform="translate(-40.2 -45.23)"/>
    <path class="cls-14" d="M152.83,464.38v11.53a2.78,2.78,0,0,0,2.31,2.75c34.25,5.73,32.93,33,32.93,33" transform="translate(-40.2 -45.23)"/>
    <polyline class="cls-12" points="280.57 467.35 138.15 467.35 138.15 472.94 280.32 472.94"/>
    <path class="cls-14" d="M222.09,441.61" transform="translate(-40.2 -45.23)"/>
    <rect class="cls-12" x="183.35" y="396.38" width="3.89" height="22.85"/>
    <line class="cls-14" x1="246.06" y1="411.45" x2="246.06" y2="419.47"/>
    <circle class="cls-12" cx="111.17" cy="470.02" r="21.63"/>
    <path class="cls-14" d="M178.37,517.32a20.66,20.66,0,0,0,.14-2.07,27.14,27.14,0,1,0-54.28,0q0,1.19.1,2.35" transform="translate(-40.2 -45.23)"/>
    <path class="cls-14" d="M321,517.6q-.1-1.16-.1-2.35a27.14,27.14,0,1,1,54.28,0q0,1.19-.1,2.35" transform="translate(-40.2 -45.23)"/>
    <circle class="cls-17" cx="111.17" cy="470.02" r="13.61"/>
    <circle class="cls-14" cx="111.17" cy="470.02" r="4.37"/>
    <circle class="cls-18" cx="111.17" cy="460.67" r="1.28"/>
    <circle class="cls-18" cx="144.78" cy="508.58" r="1.28" transform="translate(-357.42 206.1) rotate(-45)"/>
    <circle class="cls-18" cx="101.81" cy="469.9" r="1.28"/>
    <circle class="cls-18" cx="144.69" cy="521.73" r="1.28" transform="translate(-366.74 209.89) rotate(-45)"/>
    <circle class="cls-18" cx="111.05" cy="479.26" r="1.28"/>
    <circle class="cls-18" cx="157.84" cy="521.81" r="1.28" transform="translate(-362.95 219.21) rotate(-45)"/>
    <circle class="cls-18" cx="120.4" cy="470.02" r="1.28"/>
    <circle class="cls-18" cx="157.92" cy="508.66" r="1.28" transform="translate(-353.63 215.42) rotate(-45)"/>
    <circle class="cls-12" cx="307.87" cy="470.02" r="21.63"/>
    <circle class="cls-17" cx="307.87" cy="470.02" r="13.61"/>
    <circle class="cls-14" cx="307.87" cy="470.02" r="4.37"/>
    <circle class="cls-18" cx="307.87" cy="460.67" r="1.28"/>
    <circle class="cls-18" cx="341.48" cy="508.58" r="1.28" transform="translate(-299.8 345.19) rotate(-45)"/>
    <circle class="cls-18" cx="298.51" cy="469.9" r="1.28"/>
    <circle class="cls-18" cx="341.39" cy="521.73" r="1.28" transform="translate(-309.12 348.98) rotate(-45)"/>
    <circle class="cls-18" cx="307.75" cy="479.26" r="1.28"/>
    <circle class="cls-18" cx="354.54" cy="521.81" r="1.28" transform="translate(-305.33 358.3) rotate(-45)"/>
    <circle class="cls-18" cx="317.11" cy="470.02" r="1.28"/>
    <circle class="cls-18" cx="354.63" cy="508.66" r="1.28" transform="translate(-296.01 354.51) rotate(-45)"/>
    <line class="cls-14" x1="258.21" y1="466.62" x2="258.21" y2="429.68"/>
    <line class="cls-14" x1="187.73" y1="466.62" x2="187.73" y2="439.16"/>
    <line class="cls-14" x1="130.12" y1="430.89" x2="142.76" y2="430.89"/>
    <line class="cls-14" x1="198.91" y1="431.38" x2="212.03" y2="431.38"/>
    <circle class="cls-19" cx="277.08" cy="433.57" r="3.56"/>
    <rect class="cls-13" x="71.68" y="424.17" width="9.63" height="7.94" rx="3.12" ry="3.12"/>
    <path class="cls-20" d="M49.6,426.52h4.7a2.92,2.92,0,0,1,2.92,2.92v6.81a2.92,2.92,0,0,1-2.92,2.92H49.6a0,0,0,0,1,0,0V426.52A0,0,0,0,1,49.6,426.52Z"/>
    <path class="cls-19" d="M396.47,493.6l0,0h-8.91a5.9,5.9,0,0,1-2-4.37,6.26,6.26,0,0,1,6.43-6.08,6.76,6.76,0,0,1,1.48.17,23.31,23.31,0,0,1,3,9.88S396.45,493.35,396.47,493.6Z" transform="translate(-40.2 -45.23)"/>
    <line class="cls-21" x1="156.01" y1="401" x2="148.23" y2="410.72"/>
    <line class="cls-21" x1="159.53" y1="401" x2="151.76" y2="410.72"/>
    <line class="cls-21" x1="210.69" y1="402.34" x2="202.92" y2="412.06"/>
    <line class="cls-21" x1="214.22" y1="402.34" x2="206.44" y2="412.06"/>
    <line class="cls-21" x1="174.82" y1="405.6" x2="170.37" y2="411.16"/>
    <line class="cls-21" x1="178.54" y1="405.6" x2="174.09" y2="411.16"/>
    <path class="cls-12" d="M139.58,490H86.07v5.39l3.52,3.52h40.26A34.74,34.74,0,0,1,139.58,490Z" transform="translate(-40.2 -45.23)"/>
    <line class="cls-22" x1="134.99" y1="433.57" x2="138.15" y2="433.57"/>
    <line class="cls-22" x1="204.5" y1="434.05" x2="207.66" y2="434.05"/>
  </g>
  <g>
    <polygon class="cls-6" points="556.26 451.55 551.24 433.41 560.96 433.41 566.47 451.55 556.26 451.55"/>
    <polygon class="cls-6" points="539.41 451.55 534.38 433.41 544.11 433.41 549.62 451.55 539.41 451.55"/>
    <polygon class="cls-6" points="522.56 451.55 517.53 433.41 527.26 433.41 532.76 451.55 522.56 451.55"/>
    <polygon class="cls-14" points="575.81 468.89 510.71 468.89 518.44 432.76 568.15 432.76 575.81 468.89"/>
    <polyline class="cls-14" points="530.82 490.6 526.23 468.89 522.69 452.2 518.57 432.76 518.51 432.44 518.44 432.76 510.71 468.89 506.03 490.77"/>
    <circle class="cls-13" cx="518.59" cy="427.25" r="3.56"/>
    <polyline class="cls-14" points="580.4 490.6 575.81 468.89 568.15 432.76 568.09 432.44 568.02 432.76 563.86 452.2 560.29 468.89 555.61 490.77"/>
    <circle class="cls-13" cx="567.68" cy="427.25" r="3.56"/>
    <line class="cls-23" x1="514.46" y1="452.2" x2="572.14" y2="452.2"/>
  </g>
  <g>
    <path class="cls-24" d="M596.2,485.82H617a1.26,1.26,0,0,1,1.26,1.26v3.36a0,0,0,0,1,0,0H594.94a0,0,0,0,1,0,0v-3.36A1.26,1.26,0,0,1,596.2,485.82Z"/>
    <polyline class="cls-25" points="606.61 485.34 606.61 429.14 606.61 421.09 606.61 417 606.61 409.82 606.61 408.96 606.61 408.54"/>
    <path class="cls-24" d="M654.16,451.42v2.26a1.3,1.3,0,0,1-.1.52,1.37,1.37,0,0,1-1.27.86h-12a1.38,1.38,0,0,1-1.38-1.38v-2.26a1.37,1.37,0,0,1,.14-.6l.1-.17a1.37,1.37,0,0,1,1.14-.61h12a1.37,1.37,0,0,1,1.38,1.38Z" transform="translate(-40.2 -45.23)"/>
    <circle class="cls-26" cx="606.61" cy="374.1" r="33.05"/>
    <g>
      <path class="cls-11" d="M634.25,420.46a1,1,0,0,0-.4-.87,5.22,5.22,0,0,0-1.44-.64,10.17,10.17,0,0,1-1.64-.66,2.68,2.68,0,0,1-1.65-2.4,2.34,2.34,0,0,1,.44-1.4,2.88,2.88,0,0,1,1.27-1,4.78,4.78,0,0,1,1.86-.35,4.35,4.35,0,0,1,1.85.38,2.94,2.94,0,0,1,1.26,1.06,2.77,2.77,0,0,1,.45,1.56h-2a1.31,1.31,0,0,0-.42-1,1.72,1.72,0,0,0-1.18-.37,1.84,1.84,0,0,0-1.14.31,1,1,0,0,0-.41.81.93.93,0,0,0,.48.79,5.37,5.37,0,0,0,1.4.6,6,6,0,0,1,2.48,1.27,2.53,2.53,0,0,1,.78,1.89,2.33,2.33,0,0,1-1,2,4.16,4.16,0,0,1-2.56.71,4.94,4.94,0,0,1-2-.41,3.22,3.22,0,0,1-1.4-1.12,2.87,2.87,0,0,1-.48-1.65h2q0,1.6,1.91,1.6a1.86,1.86,0,0,0,1.11-.29A.94.94,0,0,0,634.25,420.46Z" transform="translate(-40.2 -45.23)"/>
      <path class="cls-11" d="M644.89,414.93h-3V423h-2v-8.06H637v-1.61h7.88Z" transform="translate(-40.2 -45.23)"/>
      <path class="cls-11" d="M653.79,418.38a5.84,5.84,0,0,1-.51,2.51,3.8,3.8,0,0,1-1.45,1.66,4.27,4.27,0,0,1-4.3,0,3.84,3.84,0,0,1-1.46-1.65,5.67,5.67,0,0,1-.53-2.47V418a5.81,5.81,0,0,1,.52-2.52,3.83,3.83,0,0,1,1.46-1.67,4.26,4.26,0,0,1,4.3,0,3.83,3.83,0,0,1,1.46,1.67,5.8,5.8,0,0,1,.52,2.51Zm-2-.44a4.07,4.07,0,0,0-.54-2.31,1.93,1.93,0,0,0-3.1,0,4,4,0,0,0-.55,2.29v.47a4.12,4.12,0,0,0,.54,2.3,1.91,1.91,0,0,0,3.11,0,4.1,4.1,0,0,0,.54-2.3Z" transform="translate(-40.2 -45.23)"/>
      <path class="cls-11" d="M657.23,419.59V423h-2v-9.68H659a4.37,4.37,0,0,1,1.92.4,2.94,2.94,0,0,1,1.27,1.13,3.16,3.16,0,0,1,.45,1.67,2.78,2.78,0,0,1-1,2.24,4.05,4.05,0,0,1-2.69.82Zm0-1.61H659a1.75,1.75,0,0,0,1.21-.37,1.35,1.35,0,0,0,.42-1.06,1.6,1.6,0,0,0-.42-1.15,1.56,1.56,0,0,0-1.16-.45h-1.83Z" transform="translate(-40.2 -45.23)"/>
    </g>
  </g>
  <g>
    <rect class="cls-8" x="255.14" y="350.45" width="64.47" height="29.4" rx="13.12" ry="13.12"/>
    <path class="cls-8" d="M325.87,432.37l25.37-11.71-14.31-14.31-11.71,25.37A.49.49,0,0,0,325.87,432.37Z" transform="translate(-40.2 -45.23)"/>
    <g>
      <path class="cls-11" d="M312.1,410.16a5.89,5.89,0,0,1-.51,2.53,3.84,3.84,0,0,1-1.46,1.67,4.31,4.31,0,0,1-4.34,0,3.87,3.87,0,0,1-1.47-1.66,5.72,5.72,0,0,1-.53-2.49v-.48a5.86,5.86,0,0,1,.52-2.54,3.86,3.86,0,0,1,1.47-1.68,4.3,4.3,0,0,1,4.33,0,3.87,3.87,0,0,1,1.47,1.68,5.84,5.84,0,0,1,.52,2.53Zm-2-.44a4.1,4.1,0,0,0-.55-2.33,1.94,1.94,0,0,0-3.13,0,4.06,4.06,0,0,0-.56,2.31v.48a4.15,4.15,0,0,0,.55,2.32,1.92,1.92,0,0,0,3.14,0,4.13,4.13,0,0,0,.55-2.32Z" transform="translate(-40.2 -45.23)"/>
      <path class="cls-11" d="M321.58,410.16a5.89,5.89,0,0,1-.51,2.53,3.84,3.84,0,0,1-1.46,1.67,4.31,4.31,0,0,1-4.34,0,3.87,3.87,0,0,1-1.47-1.66,5.72,5.72,0,0,1-.53-2.49v-.48a5.86,5.86,0,0,1,.52-2.54,3.86,3.86,0,0,1,1.47-1.68,4.3,4.3,0,0,1,4.33,0,3.87,3.87,0,0,1,1.47,1.68,5.84,5.84,0,0,1,.52,2.53Zm-2-.44a4.1,4.1,0,0,0-.55-2.33,1.94,1.94,0,0,0-3.13,0,4.06,4.06,0,0,0-.56,2.31v.48a4.15,4.15,0,0,0,.55,2.32,1.92,1.92,0,0,0,3.14,0,4.13,4.13,0,0,0,.55-2.32Z" transform="translate(-40.2 -45.23)"/>
      <path class="cls-11" d="M325,411.38v3.44h-2v-9.75h3.81a4.4,4.4,0,0,1,1.93.4,3,3,0,0,1,1.28,1.14,3.19,3.19,0,0,1,.45,1.69,2.8,2.8,0,0,1-1,2.26,4.09,4.09,0,0,1-2.72.83Zm0-1.63h1.8a1.77,1.77,0,0,0,1.22-.38,1.36,1.36,0,0,0,.42-1.07,1.61,1.61,0,0,0-.42-1.16,1.58,1.58,0,0,0-1.17-.46H325Z" transform="translate(-40.2 -45.23)"/>
      <path class="cls-11" d="M336.95,412.26a1,1,0,0,0-.4-.87,5.26,5.26,0,0,0-1.45-.64,10.24,10.24,0,0,1-1.65-.67,2.7,2.7,0,0,1-1.66-2.42,2.36,2.36,0,0,1,.45-1.41,2.91,2.91,0,0,1,1.28-1,4.81,4.81,0,0,1,1.87-.35,4.39,4.39,0,0,1,1.86.38,3,3,0,0,1,1.27,1.07,2.8,2.8,0,0,1,.45,1.57h-2a1.32,1.32,0,0,0-.42-1,1.74,1.74,0,0,0-1.19-.37,1.86,1.86,0,0,0-1.15.31,1,1,0,0,0-.41.82.94.94,0,0,0,.48.8,5.42,5.42,0,0,0,1.41.6,6.1,6.1,0,0,1,2.5,1.28,2.55,2.55,0,0,1,.78,1.9,2.35,2.35,0,0,1-1,2,4.19,4.19,0,0,1-2.58.72,5,5,0,0,1-2.05-.41,3.24,3.24,0,0,1-1.41-1.13,2.89,2.89,0,0,1-.49-1.66h2q0,1.61,1.93,1.61a1.87,1.87,0,0,0,1.12-.29A1,1,0,0,0,336.95,412.26Z" transform="translate(-40.2 -45.23)"/>
      <path class="cls-11" d="M344.78,412.88a1.08,1.08,0,0,1,.79.29,1.05,1.05,0,0,1,0,1.47,1.21,1.21,0,0,1-1.57,0,1,1,0,0,1-.3-.73,1,1,0,0,1,.3-.73A1.07,1.07,0,0,1,344.78,412.88Zm.8-1.06H344l-.23-6.76h2.06Z" transform="translate(-40.2 -45.23)"/>
      <path class="cls-11" d="M348.51,412.88a1.08,1.08,0,0,1,.79.29,1.05,1.05,0,0,1,0,1.47,1.21,1.21,0,0,1-1.57,0,1,1,0,0,1-.3-.73,1,1,0,0,1,.3-.73A1.07,1.07,0,0,1,348.51,412.88Zm.8-1.06h-1.61l-.23-6.76h2.06Z" transform="translate(-40.2 -45.23)"/>
      <path class="cls-11" d="M352.24,412.88a1.08,1.08,0,0,1,.79.29,1.05,1.05,0,0,1,0,1.47,1.21,1.21,0,0,1-1.57,0,1,1,0,0,1-.3-.73,1,1,0,0,1,.3-.73A1.07,1.07,0,0,1,352.24,412.88Zm.8-1.06h-1.61l-.23-6.76h2.06Z" transform="translate(-40.2 -45.23)"/>
    </g>
  </g>
</svg>
