{
  "payloadName": "sdwanConnectivity.yml",
  "contactId": "jh0003",
  "name": "SDWANConnectivity",
  "description": "Represents SDWAN Connectivity.",
  "resourceIconPath": "defaulticon",
  "resourceType": "VL",
  "categories": [
  {
    "name": "Generic",
    "subcategories": [
      {
        "name": "Infrastructure"
      }
    ]
  }
],
  "tags": [
    "SDWANConnectivity"
  ]
}
