[{
	"key": "SALE10",
	"value": 0.1
},
	{
		"key": "SALE20",
		"value": 0.2
	},
	{
		"key":"SALE30",
		"value": 0.3
	},
	{
		"key":"WINTERMADNESS",
		"value": 0.1,
		"stacks": "TRUE"
	}]