<svg xmlns="http://www.w3.org/2000/svg" width="128" height="128" viewBox="0 0 128 128">
  <g id="connected-dot-sm-3" transform="translate(14984 7839)">
    <g id="Group_2461" data-name="Group 2461" transform="translate(-16136.435 -7920.549)">
      <line id="Line_129" data-name="Line 129" y1="2.069" x2="48.618" transform="translate(1241.989 205.638) rotate(-120)" fill="none" stroke="#121014" stroke-width="1" opacity="0.25"/>
      <line id="Line_130" data-name="Line 130" x2="52.756" y2="21.723" transform="translate(1243.781 204.603) rotate(-120)" fill="none" stroke="#121014" stroke-width="1" opacity="0.25"/>
      <line id="Line_131" data-name="Line 131" x1="64.134" y2="10.344" transform="translate(1207.826 169.223) rotate(-120)" fill="none" stroke="#121014" stroke-width="1"/>
      <line id="Line_132" data-name="Line 132" x1="70.341" y1="38.274" transform="translate(1216.784 164.05) rotate(-120)" fill="none" stroke="#121014" stroke-width="1"/>
      <line id="Line_133" data-name="Line 133" x2="4.138" y2="48.618" transform="translate(1175.759 113.681) rotate(-120)" fill="none" stroke="#121014" stroke-width="1"/>
      <g id="Ellipse_176" data-name="Ellipse 176" transform="translate(1216.355 168.479) rotate(-120)" fill="#121014" stroke="#121014" stroke-width="1">
        <circle cx="3.103" cy="3.103" r="3.103" stroke="none"/>
        <circle cx="3.103" cy="3.103" r="2.603" fill="none"/>
      </g>
      <g id="Ellipse_177" data-name="Ellipse 177" transform="translate(1234.89 153) rotate(-120)" fill="#121014" stroke="#121014" stroke-width="1" opacity="0.5">
        <circle cx="3.103" cy="3.103" r="3.103" stroke="none"/>
        <circle cx="3.103" cy="3.103" r="2.603" fill="none"/>
      </g>
      <g id="Ellipse_178" data-name="Ellipse 178" transform="translate(1242.455 209.549) rotate(-120)" fill="#121014" stroke="#121014" stroke-width="1" opacity="0.5">
        <circle cx="3.103" cy="3.103" r="3.103" stroke="none"/>
        <circle cx="3.103" cy="3.103" r="2.603" fill="none"/>
      </g>
      <g id="Ellipse_179" data-name="Ellipse 179" transform="translate(1173.538 119.143) rotate(-120)" fill="#121014" stroke="#121014" stroke-width="1">
        <circle cx="3.103" cy="3.103" r="3.103" stroke="none"/>
        <circle cx="3.103" cy="3.103" r="2.603" fill="none"/>
      </g>
      <line id="Line_134" data-name="Line 134" x1="59.997" y2="36.205" transform="translate(1204.861 166.156) rotate(-120)" fill="none" stroke="#121014" stroke-width="1" opacity="0.25"/>
      <g id="Ellipse_244" data-name="Ellipse 244" transform="translate(1214.33 90.027) rotate(-120)" fill="#121014" stroke="#121014" stroke-width="1">
        <circle cx="3.103" cy="3.103" r="3.103" stroke="none"/>
        <circle cx="3.103" cy="3.103" r="2.603" fill="none"/>
      </g>
    </g>
    <rect id="Rectangle_447" data-name="Rectangle 447" width="128" height="128" transform="translate(-14984 -7839)" fill="none"/>
  </g>
</svg>
