   ____                  _        _       
  / ___|_ __ _   _ _ __ | |_ __ _(_)_ __  
 | |   | '__| | | | '_ \| __/ _` | | '_ \ 
 | |___| |  | |_| | |_) | || (_| | | | | |
  \____|_|   \__, | .__/ \__\__,_|_|_| |_|
             |___/|_|                     