<svg width="23" height="24" viewBox="0 0 23 24" fill="none" xmlns="http://www.w3.org/2000/svg">
<path d="M7.00244 17.0129L11.0777 16.9979L19.9725 7.45793C20.3215 7.07993 20.5136 6.57793 20.5136 6.04393C20.5136 5.50993 20.3215 5.00793 19.9725 4.62993L18.5078 3.04393C17.8097 2.28793 16.5917 2.29193 15.8991 3.04093L7.00244 12.5829V17.0129ZM17.2021 4.45793L18.6694 6.04093L17.1947 7.62293L15.7301 6.03793L17.2021 4.45793ZM8.84936 13.4169L14.4178 7.44393L15.8824 9.02993L10.3149 15.0009L8.84936 15.0059V13.4169Z" fill="#01407A"/>
<path d="M5.15527 21H18.0837C19.1023 21 19.9306 20.103 19.9306 19V10.332L18.0837 12.332V19H8.07156C8.04755 19 8.02262 19.01 7.99861 19.01C7.96813 19.01 7.93766 19.001 7.90626 19H5.15527V5H11.4782L13.3251 3H5.15527C4.13669 3 3.30835 3.897 3.30835 5V19C3.30835 20.103 4.13669 21 5.15527 21Z" fill="#01407A"/>
</svg>
