<svg width="17" height="20" viewBox="0 0 17 20" fill="none" xmlns="http://www.w3.org/2000/svg">
<path fill-rule="evenodd" clip-rule="evenodd" d="M8.41662 0.833344C5.16146 0.833344 2.52257 3.53603 2.52257 6.8699V8.42216C2.52257 9.02041 2.34291 9.60433 2.00786 10.0945L0.930953 11.6702C0.0101717 13.0174 0.631427 14.8927 2.16253 15.388L3.13742 15.7033C3.8056 15.9193 4.48318 16.0935 5.16674 16.2255C5.36525 17.883 6.74462 19.1667 8.41666 19.1667C10.0887 19.1667 11.4681 17.883 11.6666 16.2255C12.35 16.0935 13.0277 15.9193 13.6959 15.7033L14.6708 15.388C16.2019 14.8927 16.8232 13.0174 15.9024 11.6702L14.8255 10.0945C14.4904 9.60433 14.3107 9.02045 14.3107 8.42216V6.8699C14.3107 3.53603 11.6719 0.833344 8.4167 0.833344H8.41662ZM10.2858 16.4345C9.0433 16.5709 7.78994 16.5709 6.5474 16.4345C6.80307 17.2416 7.54318 17.8254 8.41662 17.8254C9.29006 17.8254 10.0302 17.2416 10.2858 16.4345ZM3.83232 6.8699C3.83232 4.27698 5.88472 2.1748 8.41658 2.1748C10.9484 2.1748 13.0008 4.27698 13.0008 6.8699V8.42216C13.0008 9.29575 13.2631 10.1481 13.7524 10.8637L14.8293 12.4395C15.2427 13.0443 14.9638 13.8863 14.2763 14.1087L13.3014 14.424C10.1222 15.4524 6.7109 15.4524 3.53186 14.424L2.55696 14.1087C1.86947 13.8863 1.59056 13.0443 2.00397 12.4395L3.08088 10.8637C3.56999 10.1481 3.8324 9.29575 3.8324 8.42216L3.83232 6.8699Z" fill="#585858"/>
</svg>
