<svg width="50" height="20" viewBox="0 0 50 20" fill="none" xmlns="http://www.w3.org/2000/svg">
<path d="M0.0284091 15L2.44318 0.454545H6.39205L4.51705 11.8182H10.3977L9.85795 15H0.0284091ZM16.7383 15.1989C15.5546 15.1989 14.5792 14.9645 13.8121 14.4957C13.0498 14.0223 12.5148 13.3641 12.207 12.5213C11.8993 11.6738 11.8377 10.6913 12.0224 9.57386C12.207 8.45644 12.5929 7.47633 13.18 6.63352C13.7672 5.78598 14.5224 5.12784 15.4457 4.65909C16.369 4.18561 17.4248 3.94886 18.6133 3.94886C19.7923 3.94886 20.7629 4.18561 21.5252 4.65909C22.2923 5.12784 22.8297 5.78598 23.1374 6.63352C23.4499 7.47633 23.5138 8.45644 23.3292 9.57386C23.1445 10.6913 22.7563 11.6738 22.1644 12.5213C21.5726 13.3641 20.815 14.0223 19.8917 14.4957C18.9731 14.9645 17.922 15.1989 16.7383 15.1989ZM17.2212 12.3011C17.5621 12.3011 17.8723 12.1899 18.1516 11.9673C18.4357 11.7448 18.6772 11.4276 18.8761 11.0156C19.0797 10.6037 19.2288 10.1136 19.3235 9.54545C19.4182 8.97254 19.4324 8.48248 19.3661 8.07528C19.2998 7.66335 19.1625 7.34612 18.9542 7.12358C18.7459 6.90104 18.4712 6.78977 18.1303 6.78977C17.7894 6.78977 17.4769 6.90104 17.1928 7.12358C16.9087 7.34612 16.6673 7.66335 16.4684 8.07528C16.2695 8.48248 16.1228 8.97254 16.0281 9.54545C15.9334 10.1136 15.9168 10.6037 15.9783 11.0156C16.0446 11.4276 16.1819 11.7448 16.3903 11.9673C16.6033 12.1899 16.8803 12.3011 17.2212 12.3011ZM28.5849 19.3182C27.4864 19.3182 26.5726 19.1619 25.8434 18.8494C25.119 18.5417 24.5839 18.1155 24.2383 17.571C23.8974 17.0313 23.7553 16.411 23.8121 15.7102H27.5906C27.6 15.947 27.6687 16.1364 27.7965 16.2784C27.9244 16.4205 28.1019 16.5223 28.3292 16.5838C28.5565 16.6454 28.8216 16.6761 29.1246 16.6761C29.636 16.6761 30.0787 16.5507 30.4528 16.2997C30.8268 16.0535 31.0565 15.6108 31.1417 14.9716L31.4542 13.125H31.3406C31.1417 13.4943 30.8742 13.8092 30.538 14.0696C30.2018 14.3253 29.8159 14.5218 29.3803 14.6591C28.9447 14.7917 28.4807 14.858 27.9883 14.858C27.2118 14.858 26.5276 14.678 25.9357 14.3182C25.3486 13.9583 24.9225 13.3878 24.6573 12.6065C24.3969 11.8253 24.3709 10.8049 24.5792 9.54545C24.797 8.22917 25.1805 7.15909 25.7298 6.33523C26.279 5.51136 26.9111 4.90767 27.6261 4.52415C28.341 4.14062 29.0584 3.94886 29.7781 3.94886C30.3178 3.94886 30.7747 4.04356 31.1488 4.23295C31.5228 4.41761 31.8211 4.66619 32.0437 4.97869C32.2662 5.28646 32.4201 5.625 32.5053 5.99432H32.5906L32.9031 4.09091H36.8235L35.0053 14.9716C34.8633 15.8996 34.5011 16.6856 33.9187 17.3295C33.341 17.9782 32.5929 18.4706 31.6744 18.8068C30.7605 19.1477 29.7307 19.3182 28.5849 19.3182ZM29.8917 12.0739C30.2515 12.0739 30.5782 11.9744 30.8718 11.7756C31.1654 11.572 31.4139 11.2831 31.6175 10.9091C31.8211 10.5303 31.9656 10.0758 32.0508 9.54545C32.136 9.00568 32.1407 8.54403 32.065 8.16051C31.9892 7.77225 31.8401 7.47633 31.6175 7.27273C31.395 7.06439 31.1038 6.96023 30.744 6.96023C30.3841 6.96023 30.0598 7.06439 29.771 7.27273C29.4821 7.47633 29.2383 7.77225 29.0394 8.16051C28.8406 8.54403 28.6985 9.00568 28.6133 9.54545C28.5281 10.0852 28.521 10.5445 28.592 10.9233C28.663 11.2973 28.8074 11.5838 29.0252 11.7827C29.243 11.9768 29.5318 12.0739 29.8917 12.0739ZM42.2266 15.1989C41.0429 15.1989 40.0675 14.9645 39.3004 14.4957C38.5381 14.0223 38.0031 13.3641 37.6953 12.5213C37.3875 11.6738 37.326 10.6913 37.5107 9.57386C37.6953 8.45644 38.0812 7.47633 38.6683 6.63352C39.2554 5.78598 40.0107 5.12784 40.9339 4.65909C41.8572 4.18561 42.9131 3.94886 44.1016 3.94886C45.2805 3.94886 46.2512 4.18561 47.0135 4.65909C47.7805 5.12784 48.3179 5.78598 48.6257 6.63352C48.9382 7.47633 49.0021 8.45644 48.8175 9.57386C48.6328 10.6913 48.2446 11.6738 47.6527 12.5213C47.0608 13.3641 46.3033 14.0223 45.38 14.4957C44.4614 14.9645 43.4103 15.1989 42.2266 15.1989ZM42.7095 12.3011C43.0504 12.3011 43.3606 12.1899 43.6399 11.9673C43.924 11.7448 44.1655 11.4276 44.3643 11.0156C44.5679 10.6037 44.7171 10.1136 44.8118 9.54545C44.9065 8.97254 44.9207 8.48248 44.8544 8.07528C44.7881 7.66335 44.6508 7.34612 44.4425 7.12358C44.2341 6.90104 43.9595 6.78977 43.6186 6.78977C43.2777 6.78977 42.9652 6.90104 42.6811 7.12358C42.397 7.34612 42.1555 7.66335 41.9567 8.07528C41.7578 8.48248 41.611 8.97254 41.5163 9.54545C41.4216 10.1136 41.4051 10.6037 41.4666 11.0156C41.5329 11.4276 41.6702 11.7448 41.8786 11.9673C42.0916 12.1899 42.3686 12.3011 42.7095 12.3011Z" fill="#4F539E"/>
</svg>
