{
  "dp": {
    "host": "mobile.farmos.co.kr",
    "user": "farmos",
    "password": "farmosv2@",
    "db": "master_node"
  },
  "datanode": "61.97.189.227",
  "db": {
    "host": "localhost",
    "user": "farmos",
    "password": "farmosv2@",
    "db": "farmos"
  },
  "mqtt": {
    "host": "localhost",
    "port": 1883,
    "keepalive": 60,
    "svc" : "cvtgate"
  },
  "sleep" : 1
}
