{
  "id": "fbd25290-8680-4d59-8f2b-f84227792689",
  "name": "FJBox 테스트",
  "children": [
    {
      "name": "디폴트장비",
      "id": "1c30a295-ada8-4f03-b989-124142e23211",
      "ssmate": {
        "mod": "mate_farmos",
        "class": "FarmosMate",
        "opt": {
          "db": {
            "host": "localhost",
            "user": "farmos",
            "password": "farmosv2@",
            "db": "farmos"
          },
          "conn": {
            "host": "localhost",
            "port": 1883,
            "keepalive": 60
          },
          "mqtt": {
            "svc": "cvtgate",
            "id": "1c30a295-ada8-4f03-b989-124142e23211"
          },
          "sleep": {
            "time": 0.5,
            "obs": 60,
            "noti": 20
          }
        }
      },
      "dsmate": {
        "mod": "mate_fjbox",
        "class": "FJBoxMate",
        "opt": {
          "conn": {
            "method": "rtu",
            "port": "/dev/ttyS0",
            "baudrate": 115200,
            "timeout": 5
          }
        }
      },
      "children": [
        {
          "id": "",
          "dt": "gw",
          "dk": "S0",
          "opt": {},
          "children": [
            {
              "id": "1",
              "dt": "nd",
              "dk": "{\"addr\":0}",
              "opt": {},
              "children": [
                {
                  "id": "2",
                  "dt": "sen",
                  "dk": "{\"addr\":16}",
                  "opt": {
                    "type": "temperature-sensor"
                  },
                  "children": []
                },
                {
                  "id": "3",
                  "dt": "sen",
                  "dk": "{\"addr\":18}",
                  "opt": {
                    "type": "humidity-sensor"
                  },
                  "children": []
                },
                {
                  "id": "4",
                  "dt": "sen",
                  "dk": "{\"addr\":20}",
                  "opt": {
                    "type": "CO2-sensor"
                  },
                  "children": []
                },
                {
                  "id": "5",
                  "dt": "sen",
                  "dk": "{\"addr\":22}",
                  "opt": {
                    "type": "EC-sensor"
                  },
                  "children": []
                },
                {
                  "id": "6",
                  "dt": "sen",
                  "dk": "{\"addr\":24}",
                  "opt": {
                    "type": "pH-sensor"
                  },
                  "children": []
                },
                {
                  "id": "7",
                  "dt": "sen",
                  "dk": "{\"addr\":26}",
                  "opt": {
                    "type": "temperature-sensor"
                  },
                  "children": []
                },
                {
                  "id": "8",
                  "dt": "sen",
                  "dk": "{\"addr\":28}",
                  "opt": {
                    "type": "humidity-sensor"
                  },
                  "children": []
                },
                {
                  "id": "9",
                  "dt": "sen",
                  "dk": "{\"addr\":30}",
                  "opt": {
                    "type": "pyranometer-sensor"
                  },
                  "children": []
                },
                {
                  "id": "10",
                  "dt": "act/switch/level1",
                  "dk": "{\"addr\":64}",
                  "opt": {},
                  "children": []
                },
                {
                  "id": "11",
                  "dt": "act/switch/level1",
                  "dk": "{\"addr\":66}",
                  "opt": {},
                  "children": []
                },
                {
                  "id": "12",
                  "dt": "act/switch/level1",
                  "dk": "{\"addr\":68}",
                  "opt": {},
                  "children": []
                },
                {
                  "id": "13",
                  "dt": "act/switch/level1",
                  "dk": "{\"addr\":76}",
                  "opt": {},
                  "children": []
                },
                {
                  "id": "14",
                  "dt": "act/switch/level1",
                  "dk": "{\"addr\":78}",
                  "opt": {},
                  "children": []
                },
                {
                  "id": "15",
                  "dt": "act/switch/level2",
                  "dk": "{\"addr\":70, \"addr_ratio\":96}",
                  "opt": {},
                  "children": []
                },
                {
                  "id": "16",
                  "dt": "act/switch/level2",
                  "dk": "{\"addr\":72, \"addr_ratio\":97}",
                  "opt": {},
                  "children": []
                },
                {
                  "id": "17",
                  "dt": "act/switch/level2",
                  "dk": "{\"addr\":74, \"addr_ratio\":98}",
                  "opt": {},
                  "children": []
                }
              ]
            }
          ]
        }
      ]
    },
    {
      "name": "카메라",
      "id": "fb04e7a3-edab-460e-aad8-1adfd2138fc8",
      "ssmate": {
        "mod": "mate_farmos",
        "class": "FarmosMate",
        "opt": {
          "db": {
            "host": "localhost",
            "user": "farmos",
            "password": "farmosv2@",
            "db": "farmos"
          },
          "conn": {
            "host": "localhost",
            "port": 1883,
            "keepalive": 60
          },
          "mqtt": {
            "svc": "cvtgate",
            "id": "fb04e7a3-edab-460e-aad8-1adfd2138fc8"
          },
          "sleep": {
            "time": 0.5,
            "obs": 60,
            "noti": 20
          }
        }
      },
      "dsmate": {
        "mod": "mate_rpicam",
        "class": "RPICamMate",
        "opt": {
          "upload": {
            "URL": "http://localhost:8081/common/v1/upload"
          },
          "extproc": {
            "cmdfmt": "raspistill -o %s",
            "stdout": false,
            "base": "picture/"
          }
        }
      },
      "children": [
        {
          "id": "",
          "dt": "gw",
          "dk": "",
          "opt": {},
          "children": [
            {
              "id": "19",
              "dt": "nd",
              "dk": "",
              "opt": {},
              "children": [
                {
                  "id": "20",
                  "dt": "act/camera/level0",
                  "dk": "",
                  "opt": {},
                  "children": []
                }
              ]
            }
          ]
        }
      ]
    }
  ]
}
