%YAML 1.1
%TAG !u! tag:unity3d.com,2011:
--- !u!114 &11400000
MonoBehaviour:
  m_ObjectHideFlags: 0
  m_CorrespondingSourceObject: {fileID: 0}
  m_PrefabInstance: {fileID: 0}
  m_PrefabAsset: {fileID: 0}
  m_GameObject: {fileID: 0}
  m_Enabled: 1
  m_EditorHideFlags: 0
  m_Script: {fileID: 11500000, guid: da164155443283e40a77454c14205435, type: 3}
  m_Name: Cain
  m_EditorClassIdentifier: 
  charName: Cain
  sprite:
  - {fileID: 21300000, guid: 8d93c3bff3f33f44a95989add7654097, type: 3}
  - {fileID: 21300000, guid: 5d9a5ed43aacb0a4ca962e002ed18e55, type: 3}
  - {fileID: 21300000, guid: 07cb88f685cef3140820c86a1c041bc1, type: 3}
  - {fileID: 21300000, guid: 79a4eb543c847764da3d134f96578deb, type: 3}
  - {fileID: 21300000, guid: 2a53c17223bcd104f8f3b481f09eb457, type: 3}
  - {fileID: 21300000, guid: bb4e74179e43e4748af1bb30279399cd, type: 3}
  - {fileID: 21300000, guid: 39198a6c406637745916863a42668543, type: 3}
  - {fileID: 21300000, guid: faf3e5e09c1de944385415cbe1f37fa1, type: 3}
