
title-anim.png
size: 2048,512
format: RGBA4444
filter: Linear,Linear
repeat: none
title 2
  rotate: false
  xy: 2, 2
  size: 911, 436
  orig: 1024, 1024
  offset: 71, 297
  index: -1
title 2 glow
  rotate: false
  xy: 915, 321
  size: 235, 117
  orig: 256, 256
  offset: 14, 70
  index: -1
