
eye.png
size: 1766,934
format: RGBA8888
filter: Linear,Linear
repeat: none
1
  rotate: false
  xy: 2, 109
  size: 885, 89
  orig: 1030, 524
  offset: 78, 217
  index: -1
10
  rotate: false
  xy: 875, 481
  size: 881, 138
  orig: 1030, 524
  offset: 80, 189
  index: -1
11
  rotate: false
  xy: 875, 621
  size: 887, 154
  orig: 1030, 524
  offset: 77, 183
  index: -1
12
  rotate: false
  xy: 875, 777
  size: 889, 155
  orig: 1030, 524
  offset: 76, 183
  index: -1
13
  rotate: false
  xy: 2, 416
  size: 871, 158
  orig: 1030, 524
  offset: 86, 182
  index: -1
14
  rotate: false
  xy: 2, 576
  size: 871, 173
  orig: 1030, 524
  offset: 86, 174
  index: -1
15
  rotate: false
  xy: 2, 751
  size: 871, 181
  orig: 1030, 524
  offset: 86, 170
  index: -1
2
  rotate: false
  xy: 2, 200
  size: 885, 94
  orig: 1030, 524
  offset: 78, 212
  index: -1
3
  rotate: false
  xy: 2, 18
  size: 885, 89
  orig: 1030, 524
  offset: 78, 215
  index: -1
4
  rotate: false
  xy: 889, 86
  size: 841, 89
  orig: 1030, 524
  offset: 102, 216
  index: -1
5
  rotate: false
  xy: 889, 177
  size: 845, 90
  orig: 1030, 524
  offset: 100, 216
  index: -1
6
  rotate: false
  xy: 889, 2
  size: 845, 82
  orig: 1030, 524
  offset: 100, 219
  index: -1
7
  rotate: false
  xy: 885, 368
  size: 841, 111
  orig: 1030, 524
  offset: 102, 203
  index: -1
8
  rotate: false
  xy: 889, 269
  size: 843, 97
  orig: 1030, 524
  offset: 101, 212
  index: -1
9
  rotate: false
  xy: 2, 296
  size: 881, 118
  orig: 1030, 524
  offset: 80, 198
  index: -1
