%YAML 1.1
%TAG !u! tag:unity3d.com,2011:
--- !u!74 &7400000
AnimationClip:
  m_ObjectHideFlags: 0
  m_CorrespondingSourceObject: {fileID: 0}
  m_PrefabInstance: {fileID: 0}
  m_PrefabAsset: {fileID: 0}
  m_Name: Daun Happy
  serializedVersion: 6
  m_Legacy: 0
  m_Compressed: 0
  m_UseHighQualityCurve: 1
  m_RotationCurves: []
  m_CompressedRotationCurves: []
  m_EulerCurves: []
  m_PositionCurves: []
  m_ScaleCurves: []
  m_FloatCurves: []
  m_PPtrCurves:
  - curve:
    - time: 0
      value: {fileID: -1555840733, guid: 054caddd959307344b47243fba0dfa78, type: 3}
    - time: 0.016666668
      value: {fileID: 263673435, guid: 054caddd959307344b47243fba0dfa78, type: 3}
    - time: 0.05
      value: {fileID: 1477866192, guid: 054caddd959307344b47243fba0dfa78, type: 3}
    - time: 0.06666667
      value: {fileID: 774016743, guid: 054caddd959307344b47243fba0dfa78, type: 3}
    - time: 0.1
      value: {fileID: 994226280, guid: 054caddd959307344b47243fba0dfa78, type: 3}
    - time: 0.11666667
      value: {fileID: 867494966, guid: 054caddd959307344b47243fba0dfa78, type: 3}
    - time: 0.13333334
      value: {fileID: -2036538171, guid: 054caddd959307344b47243fba0dfa78, type: 3}
    - time: 0.16666667
      value: {fileID: -1335083365, guid: 054caddd959307344b47243fba0dfa78, type: 3}
    - time: 0.18333334
      value: {fileID: 896618587, guid: 054caddd959307344b47243fba0dfa78, type: 3}
    - time: 0.21666667
      value: {fileID: 1114271914, guid: 054caddd959307344b47243fba0dfa78, type: 3}
    - time: 0.23333333
      value: {fileID: 976313065, guid: 054caddd959307344b47243fba0dfa78, type: 3}
    - time: 0.25
      value: {fileID: 1807291801, guid: 054caddd959307344b47243fba0dfa78, type: 3}
    - time: 0.28333333
      value: {fileID: 2054955983, guid: 054caddd959307344b47243fba0dfa78, type: 3}
    - time: 0.3
      value: {fileID: 827446150, guid: 054caddd959307344b47243fba0dfa78, type: 3}
    - time: 0.33333334
      value: {fileID: 1812960597, guid: 054caddd959307344b47243fba0dfa78, type: 3}
    - time: 0.35
      value: {fileID: -136338367, guid: 054caddd959307344b47243fba0dfa78, type: 3}
    - time: 0.38333333
      value: {fileID: -1345855937, guid: 054caddd959307344b47243fba0dfa78, type: 3}
    - time: 0.4
      value: {fileID: -1652266972, guid: 054caddd959307344b47243fba0dfa78, type: 3}
    - time: 0.41666666
      value: {fileID: 1320906334, guid: 054caddd959307344b47243fba0dfa78, type: 3}
    - time: 0.45
      value: {fileID: 853212753, guid: 054caddd959307344b47243fba0dfa78, type: 3}
    - time: 0.46666667
      value: {fileID: 64210115, guid: 054caddd959307344b47243fba0dfa78, type: 3}
    - time: 0.5
      value: {fileID: 1118269159, guid: 054caddd959307344b47243fba0dfa78, type: 3}
    - time: 0.51666665
      value: {fileID: -124479841, guid: 054caddd959307344b47243fba0dfa78, type: 3}
    - time: 0.53333336
      value: {fileID: -1575985230, guid: 054caddd959307344b47243fba0dfa78, type: 3}
    - time: 0.56666666
      value: {fileID: -1842053838, guid: 054caddd959307344b47243fba0dfa78, type: 3}
    - time: 0.5833333
      value: {fileID: 1965828677, guid: 054caddd959307344b47243fba0dfa78, type: 3}
    - time: 0.6166667
      value: {fileID: 1906428206, guid: 054caddd959307344b47243fba0dfa78, type: 3}
    - time: 0.6333333
      value: {fileID: 1966423525, guid: 054caddd959307344b47243fba0dfa78, type: 3}
    - time: 0.65
      value: {fileID: 231364461, guid: 054caddd959307344b47243fba0dfa78, type: 3}
    - time: 0.68333334
      value: {fileID: -1696947356, guid: 054caddd959307344b47243fba0dfa78, type: 3}
    - time: 0.7
      value: {fileID: -730638416, guid: 054caddd959307344b47243fba0dfa78, type: 3}
    - time: 0.73333335
      value: {fileID: 2103969060, guid: 054caddd959307344b47243fba0dfa78, type: 3}
    - time: 0.75
      value: {fileID: 1554258319, guid: 054caddd959307344b47243fba0dfa78, type: 3}
    attribute: m_Sprite
    path: 
    classID: 212
    script: {fileID: 0}
  m_SampleRate: 60
  m_WrapMode: 0
  m_Bounds:
    m_Center: {x: 0, y: 0, z: 0}
    m_Extent: {x: 0, y: 0, z: 0}
  m_ClipBindingConstant:
    genericBindings:
    - serializedVersion: 2
      path: 0
      attribute: 0
      script: {fileID: 0}
      typeID: 212
      customType: 23
      isPPtrCurve: 1
    pptrCurveMapping:
    - {fileID: -1555840733, guid: 054caddd959307344b47243fba0dfa78, type: 3}
    - {fileID: 263673435, guid: 054caddd959307344b47243fba0dfa78, type: 3}
    - {fileID: 1477866192, guid: 054caddd959307344b47243fba0dfa78, type: 3}
    - {fileID: 774016743, guid: 054caddd959307344b47243fba0dfa78, type: 3}
    - {fileID: 994226280, guid: 054caddd959307344b47243fba0dfa78, type: 3}
    - {fileID: 867494966, guid: 054caddd959307344b47243fba0dfa78, type: 3}
    - {fileID: -2036538171, guid: 054caddd959307344b47243fba0dfa78, type: 3}
    - {fileID: -1335083365, guid: 054caddd959307344b47243fba0dfa78, type: 3}
    - {fileID: 896618587, guid: 054caddd959307344b47243fba0dfa78, type: 3}
    - {fileID: 1114271914, guid: 054caddd959307344b47243fba0dfa78, type: 3}
    - {fileID: 976313065, guid: 054caddd959307344b47243fba0dfa78, type: 3}
    - {fileID: 1807291801, guid: 054caddd959307344b47243fba0dfa78, type: 3}
    - {fileID: 2054955983, guid: 054caddd959307344b47243fba0dfa78, type: 3}
    - {fileID: 827446150, guid: 054caddd959307344b47243fba0dfa78, type: 3}
    - {fileID: 1812960597, guid: 054caddd959307344b47243fba0dfa78, type: 3}
    - {fileID: -136338367, guid: 054caddd959307344b47243fba0dfa78, type: 3}
    - {fileID: -1345855937, guid: 054caddd959307344b47243fba0dfa78, type: 3}
    - {fileID: -1652266972, guid: 054caddd959307344b47243fba0dfa78, type: 3}
    - {fileID: 1320906334, guid: 054caddd959307344b47243fba0dfa78, type: 3}
    - {fileID: 853212753, guid: 054caddd959307344b47243fba0dfa78, type: 3}
    - {fileID: 64210115, guid: 054caddd959307344b47243fba0dfa78, type: 3}
    - {fileID: 1118269159, guid: 054caddd959307344b47243fba0dfa78, type: 3}
    - {fileID: -124479841, guid: 054caddd959307344b47243fba0dfa78, type: 3}
    - {fileID: -1575985230, guid: 054caddd959307344b47243fba0dfa78, type: 3}
    - {fileID: -1842053838, guid: 054caddd959307344b47243fba0dfa78, type: 3}
    - {fileID: 1965828677, guid: 054caddd959307344b47243fba0dfa78, type: 3}
    - {fileID: 1906428206, guid: 054caddd959307344b47243fba0dfa78, type: 3}
    - {fileID: 1966423525, guid: 054caddd959307344b47243fba0dfa78, type: 3}
    - {fileID: 231364461, guid: 054caddd959307344b47243fba0dfa78, type: 3}
    - {fileID: -1696947356, guid: 054caddd959307344b47243fba0dfa78, type: 3}
    - {fileID: -730638416, guid: 054caddd959307344b47243fba0dfa78, type: 3}
    - {fileID: 2103969060, guid: 054caddd959307344b47243fba0dfa78, type: 3}
    - {fileID: 1554258319, guid: 054caddd959307344b47243fba0dfa78, type: 3}
  m_AnimationClipSettings:
    serializedVersion: 2
    m_AdditiveReferencePoseClip: {fileID: 0}
    m_AdditiveReferencePoseTime: 0
    m_StartTime: 0
    m_StopTime: 0.76666665
    m_OrientationOffsetY: 0
    m_Level: 0
    m_CycleOffset: 0
    m_HasAdditiveReferencePose: 0
    m_LoopTime: 1
    m_LoopBlend: 0
    m_LoopBlendOrientation: 0
    m_LoopBlendPositionY: 0
    m_LoopBlendPositionXZ: 0
    m_KeepOriginalOrientation: 0
    m_KeepOriginalPositionY: 1
    m_KeepOriginalPositionXZ: 0
    m_HeightFromFeet: 0
    m_Mirror: 0
  m_EditorCurves: []
  m_EulerEditorCurves: []
  m_HasGenericRootTransform: 0
  m_HasMotionFloatCurves: 0
  m_Events: []
