{
"skeleton": { "hash": "7Dg2pj4ce9O6CYpi42+vfs6BF0Q", "spine": "3.8.99", "x": -452, "y": -354, "width": 591, "height": 591 },
"bones": [
	{ "name": "root" },
	{ "name": "bone", "parent": "root" }
],
"slots": [
	{ "name": "E_taunt", "bone": "bone", "attachment": "E_taunt" },
	{ "name": "shift_eject", "bone": "bone" },
	{ "name": "space_dash", "bone": "bone" },
	{ "name": "space_grab", "bone": "bone" },
	{ "name": "space_jump", "bone": "bone" }
],
"skins": [
	{
		"name": "default",
		"attachments": {
			"E_taunt": {
				"E_taunt": { "x": -156.5, "y": -58.5, "width": 591, "height": 591 }
			},
			"shift_eject": {
				"shift_eject": { "x": 138.5, "y": -69.5, "width": 591, "height": 591 }
			},
			"space_dash": {
				"space_dash": { "x": -21.5, "y": 41.94, "width": 591, "height": 591 }
			},
			"space_grab": {
				"space_grab": { "x": -21.34, "y": 42.18, "width": 591, "height": 591 }
			},
			"space_jump": {
				"space_jump": { "x": -22.18, "y": 42.46, "width": 591, "height": 591 }
			}
		}
	}
],
"animations": {
	"E_Taunt": {},
	"Shift_Eject": {
		"slots": {
			"E_taunt": {
				"attachment": [
					{ "name": null }
				]
			},
			"shift_eject": {
				"attachment": [
					{ "name": "shift_eject" }
				]
			}
		}
	},
	"Space_Dash": {
		"slots": {
			"E_taunt": {
				"attachment": [
					{ "name": null }
				]
			},
			"space_dash": {
				"attachment": [
					{ "name": "space_dash" }
				]
			}
		}
	},
	"Space_Grab": {
		"slots": {
			"E_taunt": {
				"attachment": [
					{ "name": null }
				]
			},
			"space_grab": {
				"attachment": [
					{ "name": "space_grab" }
				]
			}
		}
	},
	"Space_Jump": {
		"slots": {
			"E_taunt": {
				"attachment": [
					{ "name": null }
				]
			},
			"space_jump": {
				"attachment": [
					{ "name": "space_jump" }
				]
			}
		}
	}
}
}