
treerb.png
size: 1024,512
format: RGBA4444
filter: Linear,Linear
repeat: none
tree
  rotate: false
  xy: 1, 1
  size: 262, 498
  orig: 386, 532
  offset: 46, 9
  index: -1
tree2
  rotate: false
  xy: 265, 2
  size: 176, 497
  orig: 386, 532
  offset: 101, 16
  index: -1
tree3
  rotate: false
  xy: 443, 84
  size: 207, 415
  orig: 386, 532
  offset: 93, 14
  index: -1
