%YAML 1.1
%TAG !u! tag:unity3d.com,2011:
--- !u!74 &7400000
AnimationClip:
  m_ObjectHideFlags: 0
  m_CorrespondingSourceObject: {fileID: 0}
  m_PrefabInstance: {fileID: 0}
  m_PrefabAsset: {fileID: 0}
  m_Name: Idle Right
  serializedVersion: 6
  m_Legacy: 0
  m_Compressed: 0
  m_UseHighQualityCurve: 1
  m_RotationCurves: []
  m_CompressedRotationCurves: []
  m_EulerCurves: []
  m_PositionCurves: []
  m_ScaleCurves: []
  m_FloatCurves: []
  m_PPtrCurves:
  - curve:
    - time: 0
      value: {fileID: 1145212220, guid: 3ac6212546530964483136d450eaf3d9, type: 3}
    - time: 0.083333336
      value: {fileID: -1903382457, guid: 3ac6212546530964483136d450eaf3d9, type: 3}
    - time: 0.16666667
      value: {fileID: 205928523, guid: 3ac6212546530964483136d450eaf3d9, type: 3}
    - time: 0.25
      value: {fileID: 496817015, guid: 3ac6212546530964483136d450eaf3d9, type: 3}
    - time: 0.33333334
      value: {fileID: -1626191255, guid: 3ac6212546530964483136d450eaf3d9, type: 3}
    - time: 0.41666666
      value: {fileID: -759313231, guid: 3ac6212546530964483136d450eaf3d9, type: 3}
    - time: 0.5
      value: {fileID: -739965971, guid: 3ac6212546530964483136d450eaf3d9, type: 3}
    - time: 0.5833333
      value: {fileID: -1850774503, guid: 3ac6212546530964483136d450eaf3d9, type: 3}
    - time: 0.6666667
      value: {fileID: -1133916046, guid: 3ac6212546530964483136d450eaf3d9, type: 3}
    - time: 0.75
      value: {fileID: 197326944, guid: 3ac6212546530964483136d450eaf3d9, type: 3}
    - time: 0.8333333
      value: {fileID: -1750959105, guid: 3ac6212546530964483136d450eaf3d9, type: 3}
    - time: 0.9166667
      value: {fileID: -139622001, guid: 3ac6212546530964483136d450eaf3d9, type: 3}
    - time: 1
      value: {fileID: -1422120131, guid: 3ac6212546530964483136d450eaf3d9, type: 3}
    - time: 1.0833334
      value: {fileID: 1009082767, guid: 3ac6212546530964483136d450eaf3d9, type: 3}
    - time: 1.1666666
      value: {fileID: 544317423, guid: 3ac6212546530964483136d450eaf3d9, type: 3}
    - time: 1.25
      value: {fileID: 769546162, guid: 3ac6212546530964483136d450eaf3d9, type: 3}
    - time: 1.3333334
      value: {fileID: -145346710, guid: 3ac6212546530964483136d450eaf3d9, type: 3}
    - time: 1.4166666
      value: {fileID: -2122356443, guid: 3ac6212546530964483136d450eaf3d9, type: 3}
    - time: 1.5
      value: {fileID: -1621843043, guid: 3ac6212546530964483136d450eaf3d9, type: 3}
    - time: 1.5833334
      value: {fileID: -646439450, guid: 3ac6212546530964483136d450eaf3d9, type: 3}
    - time: 1.6666666
      value: {fileID: -1680336022, guid: 3ac6212546530964483136d450eaf3d9, type: 3}
    - time: 1.75
      value: {fileID: 1167777673, guid: 3ac6212546530964483136d450eaf3d9, type: 3}
    - time: 1.8333334
      value: {fileID: -134744749, guid: 3ac6212546530964483136d450eaf3d9, type: 3}
    - time: 1.9166666
      value: {fileID: -802102085, guid: 3ac6212546530964483136d450eaf3d9, type: 3}
    attribute: m_Sprite
    path: 
    classID: 212
    script: {fileID: 0}
  m_SampleRate: 12
  m_WrapMode: 0
  m_Bounds:
    m_Center: {x: 0, y: 0, z: 0}
    m_Extent: {x: 0, y: 0, z: 0}
  m_ClipBindingConstant:
    genericBindings:
    - serializedVersion: 2
      path: 0
      attribute: 0
      script: {fileID: 0}
      typeID: 212
      customType: 23
      isPPtrCurve: 1
    pptrCurveMapping:
    - {fileID: 1145212220, guid: 3ac6212546530964483136d450eaf3d9, type: 3}
    - {fileID: -1903382457, guid: 3ac6212546530964483136d450eaf3d9, type: 3}
    - {fileID: 205928523, guid: 3ac6212546530964483136d450eaf3d9, type: 3}
    - {fileID: 496817015, guid: 3ac6212546530964483136d450eaf3d9, type: 3}
    - {fileID: -1626191255, guid: 3ac6212546530964483136d450eaf3d9, type: 3}
    - {fileID: -759313231, guid: 3ac6212546530964483136d450eaf3d9, type: 3}
    - {fileID: -739965971, guid: 3ac6212546530964483136d450eaf3d9, type: 3}
    - {fileID: -1850774503, guid: 3ac6212546530964483136d450eaf3d9, type: 3}
    - {fileID: -1133916046, guid: 3ac6212546530964483136d450eaf3d9, type: 3}
    - {fileID: 197326944, guid: 3ac6212546530964483136d450eaf3d9, type: 3}
    - {fileID: -1750959105, guid: 3ac6212546530964483136d450eaf3d9, type: 3}
    - {fileID: -139622001, guid: 3ac6212546530964483136d450eaf3d9, type: 3}
    - {fileID: -1422120131, guid: 3ac6212546530964483136d450eaf3d9, type: 3}
    - {fileID: 1009082767, guid: 3ac6212546530964483136d450eaf3d9, type: 3}
    - {fileID: 544317423, guid: 3ac6212546530964483136d450eaf3d9, type: 3}
    - {fileID: 769546162, guid: 3ac6212546530964483136d450eaf3d9, type: 3}
    - {fileID: -145346710, guid: 3ac6212546530964483136d450eaf3d9, type: 3}
    - {fileID: -2122356443, guid: 3ac6212546530964483136d450eaf3d9, type: 3}
    - {fileID: -1621843043, guid: 3ac6212546530964483136d450eaf3d9, type: 3}
    - {fileID: -646439450, guid: 3ac6212546530964483136d450eaf3d9, type: 3}
    - {fileID: -1680336022, guid: 3ac6212546530964483136d450eaf3d9, type: 3}
    - {fileID: 1167777673, guid: 3ac6212546530964483136d450eaf3d9, type: 3}
    - {fileID: -134744749, guid: 3ac6212546530964483136d450eaf3d9, type: 3}
    - {fileID: -802102085, guid: 3ac6212546530964483136d450eaf3d9, type: 3}
  m_AnimationClipSettings:
    serializedVersion: 2
    m_AdditiveReferencePoseClip: {fileID: 0}
    m_AdditiveReferencePoseTime: 0
    m_StartTime: 0
    m_StopTime: 2
    m_OrientationOffsetY: 0
    m_Level: 0
    m_CycleOffset: 0
    m_HasAdditiveReferencePose: 0
    m_LoopTime: 1
    m_LoopBlend: 0
    m_LoopBlendOrientation: 0
    m_LoopBlendPositionY: 0
    m_LoopBlendPositionXZ: 0
    m_KeepOriginalOrientation: 0
    m_KeepOriginalPositionY: 1
    m_KeepOriginalPositionXZ: 0
    m_HeightFromFeet: 0
    m_Mirror: 0
  m_EditorCurves: []
  m_EulerEditorCurves: []
  m_HasGenericRootTransform: 0
  m_HasMotionFloatCurves: 0
  m_Events: []
