%YAML 1.1
%TAG !u! tag:unity3d.com,2011:
--- !u!1 &6460424426362246455
GameObject:
  m_ObjectHideFlags: 0
  m_CorrespondingSourceObject: {fileID: 0}
  m_PrefabInstance: {fileID: 0}
  m_PrefabAsset: {fileID: 0}
  serializedVersion: 6
  m_Component:
  - component: {fileID: 5972856562616913805}
  m_Layer: 0
  m_Name: Terrain-Area02
  m_TagString: Untagged
  m_Icon: {fileID: 0}
  m_NavMeshLayer: 0
  m_StaticEditorFlags: 0
  m_IsActive: 1
--- !u!4 &5972856562616913805
Transform:
  m_ObjectHideFlags: 0
  m_CorrespondingSourceObject: {fileID: 0}
  m_PrefabInstance: {fileID: 0}
  m_PrefabAsset: {fileID: 0}
  m_GameObject: {fileID: 6460424426362246455}
  m_LocalRotation: {x: 0, y: 0, z: 0, w: 1}
  m_LocalPosition: {x: 0, y: 0, z: 0}
  m_LocalScale: {x: 1, y: 1, z: 1}
  m_ConstrainProportionsScale: 0
  m_Children:
  - {fileID: 9186121298677075844}
  m_Father: {fileID: 0}
  m_RootOrder: 0
  m_LocalEulerAnglesHint: {x: 0, y: 0, z: 0}
--- !u!1001 &8714766389890607215
PrefabInstance:
  m_ObjectHideFlags: 0
  serializedVersion: 2
  m_Modification:
    m_TransformParent: {fileID: 5972856562616913805}
    m_Modifications:
    - target: {fileID: -8679921383154817045, guid: f3b1a0b61f70fae44add0d27af63ec37, type: 3}
      propertyPath: m_RootOrder
      value: 0
      objectReference: {fileID: 0}
    - target: {fileID: -8679921383154817045, guid: f3b1a0b61f70fae44add0d27af63ec37, type: 3}
      propertyPath: m_LocalPosition.x
      value: 0
      objectReference: {fileID: 0}
    - target: {fileID: -8679921383154817045, guid: f3b1a0b61f70fae44add0d27af63ec37, type: 3}
      propertyPath: m_LocalPosition.y
      value: 0
      objectReference: {fileID: 0}
    - target: {fileID: -8679921383154817045, guid: f3b1a0b61f70fae44add0d27af63ec37, type: 3}
      propertyPath: m_LocalPosition.z
      value: 0
      objectReference: {fileID: 0}
    - target: {fileID: -8679921383154817045, guid: f3b1a0b61f70fae44add0d27af63ec37, type: 3}
      propertyPath: m_LocalRotation.w
      value: 1
      objectReference: {fileID: 0}
    - target: {fileID: -8679921383154817045, guid: f3b1a0b61f70fae44add0d27af63ec37, type: 3}
      propertyPath: m_LocalRotation.x
      value: 0
      objectReference: {fileID: 0}
    - target: {fileID: -8679921383154817045, guid: f3b1a0b61f70fae44add0d27af63ec37, type: 3}
      propertyPath: m_LocalRotation.y
      value: 0
      objectReference: {fileID: 0}
    - target: {fileID: -8679921383154817045, guid: f3b1a0b61f70fae44add0d27af63ec37, type: 3}
      propertyPath: m_LocalRotation.z
      value: 0
      objectReference: {fileID: 0}
    - target: {fileID: -8679921383154817045, guid: f3b1a0b61f70fae44add0d27af63ec37, type: 3}
      propertyPath: m_LocalEulerAnglesHint.x
      value: 0
      objectReference: {fileID: 0}
    - target: {fileID: -8679921383154817045, guid: f3b1a0b61f70fae44add0d27af63ec37, type: 3}
      propertyPath: m_LocalEulerAnglesHint.y
      value: 0
      objectReference: {fileID: 0}
    - target: {fileID: -8679921383154817045, guid: f3b1a0b61f70fae44add0d27af63ec37, type: 3}
      propertyPath: m_LocalEulerAnglesHint.z
      value: 0
      objectReference: {fileID: 0}
    - target: {fileID: -8108069207598218402, guid: f3b1a0b61f70fae44add0d27af63ec37, type: 3}
      propertyPath: m_Materials.Array.data[0]
      value: 
      objectReference: {fileID: 2100000, guid: 02c98bb6dacc2774d96518037d8a1e3b, type: 2}
    - target: {fileID: 919132149155446097, guid: f3b1a0b61f70fae44add0d27af63ec37, type: 3}
      propertyPath: m_Name
      value: Terrain-Area02
      objectReference: {fileID: 0}
    - target: {fileID: 8597220161341820984, guid: f3b1a0b61f70fae44add0d27af63ec37, type: 3}
      propertyPath: m_Materials.Array.data[0]
      value: 
      objectReference: {fileID: 2100000, guid: ddea6b30ec72ba94b86a259405bacc07, type: 2}
    m_RemovedComponents: []
  m_SourcePrefab: {fileID: 100100000, guid: f3b1a0b61f70fae44add0d27af63ec37, type: 3}
--- !u!4 &9186121298677075844 stripped
Transform:
  m_CorrespondingSourceObject: {fileID: -8679921383154817045, guid: f3b1a0b61f70fae44add0d27af63ec37, type: 3}
  m_PrefabInstance: {fileID: 8714766389890607215}
  m_PrefabAsset: {fileID: 0}
