{
"skeleton": { "hash": "QPD9TX9tJ9rkxarHVxc8J/yvsdc", "spine": "3.8.95", "x": -512, "y": -512, "width": 1024, "height": 1024 },
"bones": [
	{ "name": "root" },
	{ "name": "title", "parent": "root" },
	{ "name": "glow", "parent": "title", "scaleX": 4, "scaleY": 4 }
],
"slots": [
	{ "name": "glow", "bone": "glow", "attachment": "title 2 glow", "blend": "screen" },
	{ "name": "title", "bone": "title", "attachment": "title 2" }
],
"skins": [
	{
		"name": "default",
		"attachments": {
			"glow": {
				"title 2 glow": { "width": 256, "height": 256 }
			},
			"title": {
				"title 2": { "width": 1024, "height": 1024 }
			}
		}
	}
],
"animations": {
	"title": {
		"slots": {
			"glow": {
				"color": [
					{ "color": "291a6eff" }
				]
			}
		},
		"bones": {
			"title": {
				"shear": [
					{ "x": 0.25, "curve": 0.25, "c3": 0.75 },
					{ "time": 2.6667, "x": -2.11, "curve": 0.25, "c3": 0.75 },
					{ "time": 5.6667, "x": 0.25 }
				]
			}
		}
	},
	"title ch1": {
		"slots": {
			"glow": {
				"color": [
					{ "color": "291a6eff" }
				]
			}
		},
		"bones": {
			"title": {
				"shear": [
					{ "x": 0.25, "curve": 0.25, "c3": 0.75 },
					{ "time": 2.6667, "x": -2.11, "curve": 0.25, "c3": 0.75 },
					{ "time": 5.6667, "x": 0.25 }
				]
			}
		}
	},
	"title ch2": {
		"slots": {
			"glow": {
				"color": [
					{ "color": "281b63ff" }
				]
			}
		},
		"bones": {
			"title": {
				"shear": [
					{ "x": 0.25, "curve": 0.25, "c3": 0.75 },
					{ "time": 2.6667, "x": -2.11, "curve": 0.25, "c3": 0.75 },
					{ "time": 5.6667, "x": 0.25 }
				]
			}
		}
	},
	"title ch3": {
		"slots": {
			"glow": {
				"color": [
					{ "color": "222869ff" }
				]
			}
		},
		"bones": {
			"title": {
				"shear": [
					{ "x": 0.25, "curve": 0.25, "c3": 0.75 },
					{ "time": 2.6667, "x": -2.11, "curve": 0.25, "c3": 0.75 },
					{ "time": 5.6667, "x": 0.25 }
				]
			}
		}
	},
	"title ch4": {
		"slots": {
			"glow": {
				"color": [
					{ "color": "332574ff" }
				]
			}
		},
		"bones": {
			"title": {
				"shear": [
					{ "x": 0.25, "curve": 0.25, "c3": 0.75 },
					{ "time": 2.6667, "x": -2.11, "curve": 0.25, "c3": 0.75 },
					{ "time": 5.6667, "x": 0.25 }
				]
			}
		}
	},
	"title ch5": {
		"slots": {
			"glow": {
				"color": [
					{ "color": "5e5681ff" }
				]
			}
		},
		"bones": {
			"title": {
				"shear": [
					{ "x": 0.25, "curve": 0.25, "c3": 0.75 },
					{ "time": 2.6667, "x": -2.11, "curve": 0.25, "c3": 0.75 },
					{ "time": 5.6667, "x": 0.25 }
				]
			}
		}
	}
}
}