{
"skeleton": { "hash": "nh9nyH7dJ6/pVt1apzl1LprR8/4", "spine": "3.8.95", "x": -3051.71, "y": -2290.3, "width": 6124.13, "height": 4590.55 },
"bones": [
	{ "name": "root" },
	{ "name": "bg", "parent": "root" },
	{ "name": "cain", "parent": "root" },
	{ "name": "result", "parent": "root" },
	{ "name": "bingkai", "parent": "root", "y": 22.47 },
	{ "name": "speedline1", "parent": "root" },
	{ "name": "speedline2", "parent": "root", "scaleX": -1 }
],
"slots": [
	{ "name": "panel-black", "bone": "bingkai", "color": "0000009e", "attachment": "asset/bg" },
	{ "name": "panel-black-T", "bone": "bingkai", "color": "000000d4", "attachment": "asset/bg" },
	{ "name": "panel-black-B", "bone": "bingkai", "color": "000000d4", "attachment": "asset/bg" },
	{ "name": "panel-black-R", "bone": "bingkai", "color": "000000d4", "attachment": "asset/bg" },
	{ "name": "panel-black-L", "bone": "bingkai", "color": "000000d4", "attachment": "asset/bg" },
	{ "name": "asset/ui-qte-atas", "bone": "bingkai", "attachment": "asset/ui-qte-atas" },
	{ "name": "asset/ui-qte-bawah", "bone": "bingkai", "attachment": "asset/ui-qte-bawah" },
	{ "name": "asset/ui-qte-kanan", "bone": "bingkai", "attachment": "asset/ui-qte-kanan" },
	{ "name": "asset/ui-qte-kiri", "bone": "bingkai", "attachment": "asset/ui-qte-kiri" },
	{ "name": "bg", "bone": "bg", "attachment": "asset/02-bg" },
	{ "name": "cain", "bone": "cain", "attachment": "asset/02-cain" },
	{ "name": "result", "bone": "result", "attachment": "asset/02-result" },
	{ "name": "speedline1", "bone": "speedline1", "color": "bd1a00ff", "attachment": "asset/garis1" },
	{ "name": "speedline2", "bone": "speedline2", "color": "bd1a00ff", "attachment": "asset/garis1" }
],
"skins": [
	{
		"name": "default",
		"attachments": {
			"asset/ui-qte-atas": {
				"asset/ui-qte-atas": { "x": 0.5, "width": 3505, "height": 1922 }
			},
			"asset/ui-qte-bawah": {
				"asset/ui-qte-bawah": { "x": 0.5, "width": 3505, "height": 1922 }
			},
			"asset/ui-qte-kanan": {
				"asset/ui-qte-kanan": { "x": 0.5, "width": 3505, "height": 1922 }
			},
			"asset/ui-qte-kiri": {
				"asset/ui-qte-kiri": { "width": 3505, "height": 1922 }
			},
			"bg": {
				"asset/02-bg": { "width": 1920, "height": 1080 }
			},
			"cain": {
				"asset/02-cain": { "width": 1920, "height": 1080 }
			},
			"panel-black": {
				"asset/bg": { "x": 7.91, "y": -31.63, "scaleX": 12.1684, "scaleY": 6, "width": 256, "height": 256 }
			},
			"panel-black-B": {
				"asset/bg": { "x": 7.91, "y": -1558.4, "scaleX": 12.1684, "scaleY": 5.8936, "width": 256, "height": 256 }
			},
			"panel-black-L": {
				"asset/bg": {
					"x": -2297.34,
					"y": -15.05,
					"scaleX": 17.5171,
					"scaleY": 5.8936,
					"rotation": 90,
					"width": 256,
					"height": 256
				}
			},
			"panel-black-R": {
				"asset/bg": {
					"x": 2318.04,
					"y": -15.05,
					"scaleX": 17.5171,
					"scaleY": 5.8936,
					"rotation": 90,
					"width": 256,
					"height": 256
				}
			},
			"panel-black-T": {
				"asset/bg": { "x": 7.91, "y": 1523.41, "scaleX": 12.1684, "scaleY": 5.8936, "width": 256, "height": 256 }
			},
			"result": {
				"asset/02-result": { "width": 1920, "height": 1080 }
			},
			"speedline1": {
				"asset/garis1": { "x": 0.5, "y": 0.5, "width": 261, "height": 395 },
				"asset/garis2": { "x": 0.5, "y": 0.5, "width": 261, "height": 395 }
			},
			"speedline2": {
				"asset/garis1": { "x": 0.5, "y": 0.5, "width": 261, "height": 395 },
				"asset/garis2": { "x": 0.5, "y": 0.5, "width": 261, "height": 395 }
			}
		}
	}
],
"animations": {
	"qte-mightybot2": {
		"slots": {
			"bg": {
				"color": [
					{ "color": "ffffffff" },
					{ "time": 0.1, "color": "c4c4c4ff" },
					{ "time": 0.2, "color": "ffffffff" }
				]
			},
			"panel-black": {
				"color": [
					{ "color": "0000009e" },
					{ "time": 0.1, "color": "000000cc" },
					{ "time": 0.2, "color": "0000009e" }
				]
			},
			"result": {
				"attachment": [
					{ "name": null }
				]
			},
			"speedline1": {
				"attachment": [
					{ "time": 0.0667, "name": "asset/garis2" },
					{ "time": 0.1333, "name": "asset/garis1" },
					{ "time": 0.1667, "name": "asset/garis2" }
				]
			},
			"speedline2": {
				"attachment": [
					{ "time": 0.0333, "name": "asset/garis2" },
					{ "time": 0.1, "name": "asset/garis1" },
					{ "time": 0.1667, "name": "asset/garis2" }
				]
			}
		},
		"bones": {
			"bg": {
				"translate": [
					{ "y": 119.72 },
					{ "time": 0.1, "x": 11.3, "y": 119.72 },
					{ "time": 0.2, "y": 119.72 }
				],
				"scale": [
					{ "x": 2, "y": 2 }
				]
			},
			"cain": {
				"rotate": [
					{},
					{ "time": 0.1, "angle": -1.53 },
					{ "time": 0.2 }
				],
				"translate": [
					{ "x": 71.32, "y": 258.1 },
					{ "time": 0.1, "x": 71.32, "y": 273.17 },
					{ "time": 0.2, "x": 71.32, "y": 258.1 }
				],
				"scale": [
					{ "x": 2, "y": 2 }
				]
			},
			"speedline1": {
				"rotate": [
					{ "angle": -51.73 }
				],
				"translate": [
					{ "x": -943.45, "y": 758.14 }
				],
				"scale": [
					{ "x": 6.839, "y": 6.839 }
				]
			},
			"speedline2": {
				"rotate": [
					{ "angle": -49.88 }
				],
				"translate": [
					{ "x": 1008, "y": -582 }
				],
				"scale": [
					{ "x": 7.123, "y": 7.123 }
				]
			}
		},
		"drawOrder": [
			{
				"offsets": [
					{ "slot": "bg", "offset": -6 },
					{ "slot": "speedline1", "offset": -11 },
					{ "slot": "speedline2", "offset": -11 }
				]
			}
		]
	},
	"result-mightybot2": {
		"slots": {
			"bg": {
				"attachment": [
					{ "name": null }
				]
			},
			"cain": {
				"attachment": [
					{ "name": null }
				]
			},
			"panel-black": {
				"color": [
					{ "color": "0000009e" },
					{ "time": 0.3333, "color": "000000c1" },
					{ "time": 0.6333, "color": "0000009e" },
					{ "time": 1, "color": "000000c1" },
					{ "time": 1.3, "color": "0000009e" },
					{ "time": 1.6, "color": "000000c1" },
					{ "time": 1.9, "color": "0000009e" },
					{ "time": 2.2333, "color": "000000c1" },
					{ "time": 2.5333, "color": "0000009e" },
					{ "time": 2.9333, "color": "000000c1" },
					{ "time": 3.2333, "color": "0000009e" },
					{ "time": 3.6, "color": "000000c1" },
					{ "time": 4, "color": "0000009e" }
				]
			},
			"speedline1": {
				"attachment": [
					{ "name": null }
				]
			},
			"speedline2": {
				"attachment": [
					{ "name": null }
				]
			}
		},
		"bones": {
			"result": {
				"rotate": [
					{},
					{ "time": 4, "angle": -2.9 }
				],
				"translate": [
					{ "y": 146.93 },
					{ "time": 4, "x": 135.75, "y": 163.26 }
				],
				"scale": [
					{ "x": 2, "y": 2 }
				]
			},
			"bingkai": {
				"translate": [
					{ "x": 10.88 }
				]
			}
		}
	}
}
}