{
"skeleton": { "hash": "y+Yk5a+qO8fyq7UD1R0v+o+Q26s", "spine": "3.8.95" },
"bones": [
	{ "name": "root" },
	{ "name": "kedip", "parent": "root" },
	{ "name": "ekspressi", "parent": "root" },
	{ "name": "mulut", "parent": "root" }
],
"slots": [
	{ "name": "ekspressi", "bone": "ekspressi" },
	{ "name": "kedip", "bone": "kedip" },
	{ "name": "mulut", "bone": "mulut" }
],
"skins": [
	{
		"name": "default",
		"attachments": {
			"ekspressi": {
				"cutscene-bocil-happy": { "x": 0.5, "width": 933, "height": 1316 },
				"cutscene-bocil-sedih": { "x": 0.5, "width": 933, "height": 1316 }
			},
			"kedip": {
				"cutscene-anak-kedipp": { "x": 0.5, "width": 933, "height": 1316 }
			},
			"mulut": {
				"cutscene-bocil-happy-mulut1": { "x": 0.5, "width": 933, "height": 1316 },
				"cutscene-bocil-happy-mulut2": { "x": 0.5, "width": 933, "height": 1316 },
				"cutscene-bocil-netral-mulut1": { "x": 0.5, "width": 933, "height": 1316 },
				"cutscene-bocil-netral-mulut2": { "x": 0.5, "width": 933, "height": 1316 },
				"cutscene-bocil-sedih-mulut1": { "x": 0.5, "width": 933, "height": 1316 },
				"cutscene-bocil-sedih-mulut2": { "x": 0.5, "width": 933, "height": 1316 }
			}
		}
	}
],
"animations": {
	"happy-idle": {
		"slots": {
			"ekspressi": {
				"attachment": [
					{ "name": "cutscene-bocil-happy" }
				]
			},
			"kedip": {
				"attachment": [
					{ "time": 0.5333, "name": "cutscene-anak-kedipp" },
					{ "time": 0.6667, "name": null },
					{ "time": 1.0667, "name": "cutscene-anak-kedipp" },
					{ "time": 1.2, "name": null },
					{ "time": 2.4333, "name": "cutscene-anak-kedipp" },
					{ "time": 2.5667, "name": null },
					{ "time": 4.1333, "name": "cutscene-anak-kedipp" },
					{ "time": 4.2667, "name": null },
					{ "time": 4.8, "name": null }
				]
			}
		}
	},
	"happy-talk": {
		"slots": {
			"ekspressi": {
				"attachment": [
					{ "name": "cutscene-bocil-happy" }
				]
			},
			"kedip": {
				"attachment": [
					{ "time": 0.5333, "name": "cutscene-anak-kedipp" },
					{ "time": 0.6667, "name": null },
					{ "time": 1.0667, "name": "cutscene-anak-kedipp" },
					{ "time": 1.2, "name": null },
					{ "time": 2.4333, "name": "cutscene-anak-kedipp" },
					{ "time": 2.5667, "name": null },
					{ "time": 4.1333, "name": "cutscene-anak-kedipp" },
					{ "time": 4.2667, "name": null },
					{ "time": 4.8, "name": null }
				]
			},
			"mulut": {
				"attachment": [
					{ "name": "cutscene-bocil-happy-mulut1" },
					{ "time": 0.2, "name": "cutscene-bocil-happy-mulut2" },
					{ "time": 0.4333, "name": "cutscene-bocil-happy-mulut1" },
					{ "time": 0.6333, "name": "cutscene-bocil-happy-mulut2" },
					{ "time": 0.7333, "name": null },
					{ "time": 0.9333, "name": "cutscene-bocil-happy-mulut2" },
					{ "time": 1.1333, "name": "cutscene-bocil-happy-mulut1" },
					{ "time": 1.4, "name": "cutscene-bocil-happy-mulut2" },
					{ "time": 1.5667, "name": "cutscene-bocil-happy-mulut1" },
					{ "time": 1.8333, "name": "cutscene-bocil-happy-mulut2" },
					{ "time": 1.9667, "name": "cutscene-bocil-happy-mulut1" },
					{ "time": 2.1, "name": "cutscene-bocil-happy-mulut2" },
					{ "time": 2.3333, "name": null },
					{ "time": 2.4333, "name": "cutscene-bocil-happy-mulut1" },
					{ "time": 2.6333, "name": "cutscene-bocil-happy-mulut2" },
					{ "time": 2.8667, "name": "cutscene-bocil-happy-mulut1" },
					{ "time": 3.0667, "name": "cutscene-bocil-happy-mulut2" },
					{ "time": 3.1667, "name": null },
					{ "time": 3.3667, "name": "cutscene-bocil-happy-mulut2" },
					{ "time": 3.5667, "name": "cutscene-bocil-happy-mulut1" },
					{ "time": 3.8333, "name": "cutscene-bocil-happy-mulut2" },
					{ "time": 4, "name": "cutscene-bocil-happy-mulut1" },
					{ "time": 4.2667, "name": "cutscene-bocil-happy-mulut2" },
					{ "time": 4.4, "name": "cutscene-bocil-happy-mulut1" },
					{ "time": 4.5333, "name": "cutscene-bocil-happy-mulut2" },
					{ "time": 4.7667, "name": null }
				]
			}
		}
	},
	"netral-idle": {
		"slots": {
			"kedip": {
				"attachment": [
					{ "time": 0.5333, "name": "cutscene-anak-kedipp" },
					{ "time": 0.6667, "name": null },
					{ "time": 1.0667, "name": "cutscene-anak-kedipp" },
					{ "time": 1.2, "name": null },
					{ "time": 2.4333, "name": "cutscene-anak-kedipp" },
					{ "time": 2.5667, "name": null },
					{ "time": 4.1333, "name": "cutscene-anak-kedipp" },
					{ "time": 4.2667, "name": null },
					{ "time": 4.8, "name": null }
				]
			}
		}
	},
	"netral-talk": {
		"slots": {
			"kedip": {
				"attachment": [
					{ "time": 0.5333, "name": "cutscene-anak-kedipp" },
					{ "time": 0.6667, "name": null },
					{ "time": 1.0667, "name": "cutscene-anak-kedipp" },
					{ "time": 1.2, "name": null },
					{ "time": 2.4333, "name": "cutscene-anak-kedipp" },
					{ "time": 2.5667, "name": null },
					{ "time": 4.1333, "name": "cutscene-anak-kedipp" },
					{ "time": 4.2667, "name": null },
					{ "time": 4.8, "name": null }
				]
			},
			"mulut": {
				"attachment": [
					{ "name": "cutscene-bocil-netral-mulut1" },
					{ "time": 0.2, "name": "cutscene-bocil-netral-mulut2" },
					{ "time": 0.3667, "name": "cutscene-bocil-netral-mulut1" },
					{ "time": 0.5667, "name": "cutscene-bocil-netral-mulut2" },
					{ "time": 0.6667, "name": "cutscene-bocil-netral-mulut1" },
					{ "time": 0.7667, "name": null },
					{ "time": 0.9333, "name": "cutscene-bocil-netral-mulut2" },
					{ "time": 1.1, "name": "cutscene-bocil-netral-mulut1" },
					{ "time": 1.2667, "name": "cutscene-bocil-netral-mulut2" },
					{ "time": 1.3667, "name": "cutscene-bocil-netral-mulut1" },
					{ "time": 1.5333, "name": "cutscene-bocil-netral-mulut2" },
					{ "time": 1.6, "name": "cutscene-bocil-netral-mulut1" },
					{ "time": 1.8, "name": "cutscene-bocil-netral-mulut2" },
					{ "time": 1.9333, "name": "cutscene-bocil-netral-mulut1" },
					{ "time": 2.1333, "name": null },
					{ "time": 2.4333, "name": "cutscene-bocil-netral-mulut1" },
					{ "time": 2.6, "name": "cutscene-bocil-netral-mulut2" },
					{ "time": 2.7667, "name": "cutscene-bocil-netral-mulut1" },
					{ "time": 2.9333, "name": "cutscene-bocil-netral-mulut2" },
					{ "time": 3.0333, "name": "cutscene-bocil-netral-mulut1" },
					{ "time": 3.1667, "name": null },
					{ "time": 3.3667, "name": "cutscene-bocil-netral-mulut2" },
					{ "time": 3.4667, "name": "cutscene-bocil-netral-mulut1" },
					{ "time": 3.6667, "name": "cutscene-bocil-netral-mulut2" },
					{ "time": 3.8, "name": "cutscene-bocil-netral-mulut1" },
					{ "time": 3.9333, "name": "cutscene-bocil-netral-mulut2" },
					{ "time": 4.0333, "name": "cutscene-bocil-netral-mulut1" },
					{ "time": 4.1667, "name": "cutscene-bocil-netral-mulut2" },
					{ "time": 4.3333, "name": "cutscene-bocil-netral-mulut1" },
					{ "time": 4.5667, "name": null },
					{ "time": 4.7, "name": "cutscene-bocil-netral-mulut1" }
				]
			}
		}
	},
	"sad-idle": {
		"slots": {
			"ekspressi": {
				"attachment": [
					{ "name": "cutscene-bocil-sedih" }
				]
			},
			"kedip": {
				"attachment": [
					{ "time": 0.5333, "name": "cutscene-anak-kedipp" },
					{ "time": 0.6667, "name": null },
					{ "time": 1.0667, "name": "cutscene-anak-kedipp" },
					{ "time": 1.2, "name": null },
					{ "time": 2.4333, "name": "cutscene-anak-kedipp" },
					{ "time": 2.5667, "name": null },
					{ "time": 4.1333, "name": "cutscene-anak-kedipp" },
					{ "time": 4.2667, "name": null },
					{ "time": 4.8, "name": null }
				]
			}
		}
	},
	"sad-talk": {
		"slots": {
			"ekspressi": {
				"attachment": [
					{ "name": "cutscene-bocil-sedih" }
				]
			},
			"kedip": {
				"attachment": [
					{ "time": 0.5333, "name": "cutscene-anak-kedipp" },
					{ "time": 0.6667, "name": null },
					{ "time": 1.0667, "name": "cutscene-anak-kedipp" },
					{ "time": 1.2, "name": null },
					{ "time": 2.4333, "name": "cutscene-anak-kedipp" },
					{ "time": 2.5667, "name": null },
					{ "time": 4.1333, "name": "cutscene-anak-kedipp" },
					{ "time": 4.2667, "name": null },
					{ "time": 4.8, "name": null }
				]
			},
			"mulut": {
				"attachment": [
					{ "time": 0.1667, "name": "cutscene-bocil-sedih-mulut2" },
					{ "time": 0.3667, "name": "cutscene-bocil-sedih-mulut1" },
					{ "time": 0.5333, "name": "cutscene-bocil-sedih-mulut2" },
					{ "time": 0.7, "name": "cutscene-bocil-sedih-mulut1" },
					{ "time": 0.8667, "name": "cutscene-bocil-sedih-mulut2" },
					{ "time": 1.0333, "name": "cutscene-bocil-sedih-mulut1" },
					{ "time": 1.2333, "name": "cutscene-bocil-sedih-mulut2" },
					{ "time": 1.3667, "name": "cutscene-bocil-sedih-mulut1" },
					{ "time": 1.5667, "name": null },
					{ "time": 1.7667, "name": "cutscene-bocil-sedih-mulut2" },
					{ "time": 2, "name": "cutscene-bocil-sedih-mulut1" },
					{ "time": 2.1667, "name": "cutscene-bocil-sedih-mulut2" },
					{ "time": 2.2667, "name": "cutscene-bocil-sedih-mulut1" },
					{ "time": 2.3667, "name": null },
					{ "time": 2.5333, "name": "cutscene-bocil-sedih-mulut2" },
					{ "time": 2.7333, "name": "cutscene-bocil-sedih-mulut1" },
					{ "time": 2.9, "name": "cutscene-bocil-sedih-mulut2" },
					{ "time": 3.0667, "name": "cutscene-bocil-sedih-mulut1" },
					{ "time": 3.2333, "name": "cutscene-bocil-sedih-mulut2" },
					{ "time": 3.4, "name": "cutscene-bocil-sedih-mulut1" },
					{ "time": 3.6, "name": "cutscene-bocil-sedih-mulut2" },
					{ "time": 3.7333, "name": "cutscene-bocil-sedih-mulut1" },
					{ "time": 3.9333, "name": null },
					{ "time": 4.2333, "name": "cutscene-bocil-sedih-mulut2" },
					{ "time": 4.4667, "name": "cutscene-bocil-sedih-mulut1" },
					{ "time": 4.6333, "name": "cutscene-bocil-sedih-mulut2" },
					{ "time": 4.7333, "name": "cutscene-bocil-sedih-mulut1" }
				]
			}
		}
	}
}
}