%YAML 1.1
%TAG !u! tag:unity3d.com,2011:
--- !u!74 &7400000
AnimationClip:
  m_ObjectHideFlags: 0
  m_CorrespondingSourceObject: {fileID: 0}
  m_PrefabInstance: {fileID: 0}
  m_PrefabAsset: {fileID: 0}
  m_Name: Pohon Micro-Arm-01_Pohon_micro_01-Interact
  serializedVersion: 6
  m_Legacy: 0
  m_Compressed: 0
  m_UseHighQualityCurve: 1
  m_RotationCurves:
  - curve:
      serializedVersion: 2
      m_Curve:
      - serializedVersion: 3
        time: 0
        value: {x: 0.7071068, y: -0.000000002593481, z: -0.0000000025934805, w: 0.7071067}
        inSlope: {x: -0.0033860207, y: -0.33903462, z: 0.3390347, w: -0.0033860207}
        outSlope: {x: -0.0033860207, y: -0.33903462, z: 0.3390347, w: -0.0033860207}
        tangentMode: 0
        weightedMode: 0
        inWeight: {x: 0.33333334, y: 0.33333334, z: 0.33333334, w: 0.33333334}
        outWeight: {x: 0.33333334, y: 0.33333334, z: 0.33333334, w: 0.33333334}
      - serializedVersion: 3
        time: 0.083333336
        value: {x: 0.70654243, y: -0.028247256, z: 0.028247256, w: 0.7065423}
        inSlope: {x: -0.0021872518, y: -0.08707945, z: 0.08707946, w: -0.0021872518}
        outSlope: {x: -0.0021872518, y: -0.08707945, z: 0.08707946, w: -0.0021872518}
        tangentMode: 0
        weightedMode: 0
        inWeight: {x: 0.33333334, y: 0.33333334, z: 0.33333334, w: 0.33333334}
        outWeight: {x: 0.33333334, y: 0.33333334, z: 0.33333334, w: 0.33333334}
      - serializedVersion: 3
        time: 0.20833334
        value: {x: 0.7071047, y: -0.0017599936, z: 0.0017599886, w: 0.70710456}
        inSlope: {x: 0.00054430956, y: 0.065108694, z: -0.0651087, w: 0.0005450248}
        outSlope: {x: 0.00054430956, y: 0.065108694, z: -0.0651087, w: 0.0005450248}
        tangentMode: 0
        weightedMode: 0
        inWeight: {x: 0.33333334, y: 0.33333334, z: 0.33333334, w: 0.33333334}
        outWeight: {x: 0.33333334, y: 0.33333334, z: 0.33333334, w: 0.33333334}
      - serializedVersion: 3
        time: 0.375
        value: {x: 0.707086, y: -0.005425388, z: 0.005425384, w: 0.7070859}
        inSlope: {x: 0.00042486185, y: 0.06510885, z: -0.06510885, w: 0.00042486185}
        outSlope: {x: 0.00042486185, y: 0.06510885, z: -0.06510885, w: 0.00042486185}
        tangentMode: 0
        weightedMode: 0
        inWeight: {x: 0.33333334, y: 0.33333334, z: 0.33333334, w: 0.33333334}
        outWeight: {x: 0.33333334, y: 0.33333334, z: 0.33333334, w: 0.33333334}
      - serializedVersion: 3
        time: 0.45833334
        value: {x: 0.7071068, y: -0.000000002593481, z: -0.0000000025934805, w: 0.7071067}
        inSlope: {x: 0.000060081496, y: 0.04556986, z: -0.045569863, w: 0.000060081496}
        outSlope: {x: 0.000060081496, y: 0.04556986, z: -0.045569863, w: 0.000060081496}
        tangentMode: 0
        weightedMode: 0
        inWeight: {x: 0.33333334, y: 0.33333334, z: 0.33333334, w: 0.33333334}
        outWeight: {x: 0.33333334, y: 0.33333334, z: 0.33333334, w: 0.33333334}
      m_PreInfinity: 2
      m_PostInfinity: 2
      m_RotationOrder: 4
    path: Pohon Micro-Arm-01/Bone
  m_CompressedRotationCurves: []
  m_EulerCurves: []
  m_PositionCurves: []
  m_ScaleCurves:
  - curve:
      serializedVersion: 2
      m_Curve:
      - serializedVersion: 3
        time: 0
        value: {x: 1, y: 1, z: 1}
        inSlope: {x: 3.7626429, y: -1.961493, z: 0}
        outSlope: {x: 3.7626429, y: -1.961493, z: 0}
        tangentMode: 0
        weightedMode: 0
        inWeight: {x: 0.33333334, y: 0.33333334, z: 0.33333334}
        outWeight: {x: 0.33333334, y: 0.33333334, z: 0.33333334}
      - serializedVersion: 3
        time: 0.083333336
        value: {x: 1.2379994, y: 0.8759292, z: 1}
        inSlope: {x: 0.19160551, y: -0.20874664, z: 0}
        outSlope: {x: 0.19160551, y: -0.20874664, z: 0}
        tangentMode: 0
        weightedMode: 0
        inWeight: {x: 0.33333334, y: 0.33333334, z: 0.33333334}
        outWeight: {x: 0.33333334, y: 0.33333334, z: 0.33333334}
      - serializedVersion: 3
        time: 0.125
        value: {x: 1.1727439, y: 0.90087557, z: 1}
        inSlope: {x: -3.717151, y: 1.450982, z: 0}
        outSlope: {x: -3.717151, y: 1.450982, z: 0}
        tangentMode: 0
        weightedMode: 0
        inWeight: {x: 0.33333334, y: 0.33333334, z: 0.33333334}
        outWeight: {x: 0.33333334, y: 0.33333334, z: 0.33333334}
      - serializedVersion: 3
        time: 0.16666667
        value: {x: 0.92823684, y: 0.99684435, z: 1}
        inSlope: {x: -3.7171516, y: 1.7131803, z: 0}
        outSlope: {x: -3.7171516, y: 1.7131803, z: 0}
        tangentMode: 0
        weightedMode: 0
        inWeight: {x: 0.33333334, y: 0.33333334, z: 0.33333334}
        outWeight: {x: 0.33333334, y: 0.33333334, z: 0.33333334}
      - serializedVersion: 3
        time: 0.20833334
        value: {x: 0.86298126, y: 1.0436406, z: 1}
        inSlope: {x: -0.45798877, y: 0.4071013, z: 0}
        outSlope: {x: -0.45798877, y: 0.4071013, z: 0}
        tangentMode: 0
        weightedMode: 0
        inWeight: {x: 0.33333334, y: 0.33333334, z: 0.33333334}
        outWeight: {x: 0.33333334, y: 0.33333334, z: 0.33333334}
      - serializedVersion: 3
        time: 0.25
        value: {x: 0.8900711, y: 1.0307695, z: 1}
        inSlope: {x: 1.5246994, y: -0.5372342, z: 0}
        outSlope: {x: 1.5246994, y: -0.5372342, z: 0}
        tangentMode: 0
        weightedMode: 0
        inWeight: {x: 0.33333334, y: 0.33333334, z: 0.33333334}
        outWeight: {x: 0.33333334, y: 0.33333334, z: 0.33333334}
      - serializedVersion: 3
        time: 0.2916667
        value: {x: 0.9900396, y: 0.9988711, z: 1}
        inSlope: {x: 2.0595891, y: -0.604735, z: 0}
        outSlope: {x: 2.0595891, y: -0.604735, z: 0}
        tangentMode: 0
        weightedMode: 0
        inWeight: {x: 0.33333334, y: 0.33333334, z: 0.33333334}
        outWeight: {x: 0.33333334, y: 0.33333334, z: 0.33333334}
      - serializedVersion: 3
        time: 0.33333334
        value: {x: 1.0617036, y: 0.9803749, z: 1}
        inSlope: {x: 0.66800034, y: -0.16089897, z: 0}
        outSlope: {x: 0.66800034, y: -0.16089897, z: 0}
        tangentMode: 0
        weightedMode: 0
        inWeight: {x: 0.33333334, y: 0.33333334, z: 0.33333334}
        outWeight: {x: 0.33333334, y: 0.33333334, z: 0.33333334}
      - serializedVersion: 3
        time: 0.375
        value: {x: 1.0457063, y: 0.98546284, z: 1}
        inSlope: {x: -0.54847515, y: 0.17444512, z: 0}
        outSlope: {x: -0.54847515, y: 0.17444512, z: 0}
        tangentMode: 0
        weightedMode: 0
        inWeight: {x: 0.33333334, y: 0.33333334, z: 0.33333334}
        outWeight: {x: 0.33333334, y: 0.33333334, z: 0.33333334}
      - serializedVersion: 3
        time: 0.4166667
        value: {x: 1.0159973, y: 0.99491197, z: 1}
        inSlope: {x: -0.54847515, y: 0.17444584, z: 0}
        outSlope: {x: -0.54847515, y: 0.17444584, z: 0}
        tangentMode: 0
        weightedMode: 0
        inWeight: {x: 0.33333334, y: 0.33333334, z: 0.33333334}
        outWeight: {x: 0.33333334, y: 0.33333334, z: 0.33333334}
      - serializedVersion: 3
        time: 0.45833334
        value: {x: 1, y: 1, z: 1}
        inSlope: {x: -0.38393506, y: 0.12211278, z: 0}
        outSlope: {x: -0.38393506, y: 0.12211278, z: 0}
        tangentMode: 0
        weightedMode: 0
        inWeight: {x: 0.33333334, y: 0.33333334, z: 0.33333334}
        outWeight: {x: 0.33333334, y: 0.33333334, z: 0.33333334}
      m_PreInfinity: 2
      m_PostInfinity: 2
      m_RotationOrder: 4
    path: Pohon Micro-Arm-01/Bone
  m_FloatCurves: []
  m_PPtrCurves: []
  m_SampleRate: 24
  m_WrapMode: 0
  m_Bounds:
    m_Center: {x: 0, y: 0, z: 0}
    m_Extent: {x: 0, y: 0, z: 0}
  m_ClipBindingConstant:
    genericBindings: []
    pptrCurveMapping: []
  m_AnimationClipSettings:
    serializedVersion: 2
    m_AdditiveReferencePoseClip: {fileID: 0}
    m_AdditiveReferencePoseTime: 0
    m_StartTime: 0
    m_StopTime: 0.45833334
    m_OrientationOffsetY: 0
    m_Level: 0
    m_CycleOffset: 0
    m_HasAdditiveReferencePose: 0
    m_LoopTime: 0
    m_LoopBlend: 0
    m_LoopBlendOrientation: 0
    m_LoopBlendPositionY: 0
    m_LoopBlendPositionXZ: 0
    m_KeepOriginalOrientation: 0
    m_KeepOriginalPositionY: 1
    m_KeepOriginalPositionXZ: 0
    m_HeightFromFeet: 0
    m_Mirror: 0
  m_EditorCurves: []
  m_EulerEditorCurves: []
  m_HasGenericRootTransform: 0
  m_HasMotionFloatCurves: 0
  m_Events: []
