%YAML 1.1
%TAG !u! tag:unity3d.com,2011:
--- !u!74 &7400000
AnimationClip:
  m_ObjectHideFlags: 0
  m_CorrespondingSourceObject: {fileID: 0}
  m_PrefabInstance: {fileID: 0}
  m_PrefabAsset: {fileID: 0}
  m_Name: SuckaChase
  serializedVersion: 6
  m_Legacy: 0
  m_Compressed: 0
  m_UseHighQualityCurve: 1
  m_RotationCurves: []
  m_CompressedRotationCurves: []
  m_EulerCurves: []
  m_PositionCurves: []
  m_ScaleCurves: []
  m_FloatCurves: []
  m_PPtrCurves:
  - curve:
    - time: 0
      value: {fileID: -118841236, guid: 40246c66bf4258b448cc943062535c9e, type: 3}
    - time: 0.05
      value: {fileID: 1259258698, guid: 40246c66bf4258b448cc943062535c9e, type: 3}
    - time: 0.1
      value: {fileID: -237475776, guid: 40246c66bf4258b448cc943062535c9e, type: 3}
    - time: 0.15
      value: {fileID: -2016363851, guid: 40246c66bf4258b448cc943062535c9e, type: 3}
    - time: 0.21666667
      value: {fileID: 954301657, guid: 40246c66bf4258b448cc943062535c9e, type: 3}
    - time: 0.26666668
      value: {fileID: 512299220, guid: 40246c66bf4258b448cc943062535c9e, type: 3}
    - time: 0.31666666
      value: {fileID: -886754984, guid: 40246c66bf4258b448cc943062535c9e, type: 3}
    - time: 0.36666667
      value: {fileID: 1635742358, guid: 40246c66bf4258b448cc943062535c9e, type: 3}
    - time: 0.41666666
      value: {fileID: 2135706224, guid: 40246c66bf4258b448cc943062535c9e, type: 3}
    - time: 0.46666667
      value: {fileID: 431834461, guid: 40246c66bf4258b448cc943062535c9e, type: 3}
    - time: 0.53333336
      value: {fileID: 1517955287, guid: 40246c66bf4258b448cc943062535c9e, type: 3}
    - time: 0.5833333
      value: {fileID: 1740524089, guid: 40246c66bf4258b448cc943062535c9e, type: 3}
    - time: 0.6333333
      value: {fileID: 625661365, guid: 40246c66bf4258b448cc943062535c9e, type: 3}
    - time: 0.68333334
      value: {fileID: 2001712928, guid: 40246c66bf4258b448cc943062535c9e, type: 3}
    - time: 0.73333335
      value: {fileID: -1728516645, guid: 40246c66bf4258b448cc943062535c9e, type: 3}
    - time: 0.78333336
      value: {fileID: -1204657342, guid: 40246c66bf4258b448cc943062535c9e, type: 3}
    - time: 0.85
      value: {fileID: 1830421328, guid: 40246c66bf4258b448cc943062535c9e, type: 3}
    - time: 0.9
      value: {fileID: -76372980, guid: 40246c66bf4258b448cc943062535c9e, type: 3}
    - time: 0.95
      value: {fileID: -1091845875, guid: 40246c66bf4258b448cc943062535c9e, type: 3}
    - time: 1
      value: {fileID: 1464128082, guid: 40246c66bf4258b448cc943062535c9e, type: 3}
    attribute: m_Sprite
    path: 
    classID: 212
    script: {fileID: 0}
  m_SampleRate: 60
  m_WrapMode: 0
  m_Bounds:
    m_Center: {x: 0, y: 0, z: 0}
    m_Extent: {x: 0, y: 0, z: 0}
  m_ClipBindingConstant:
    genericBindings:
    - serializedVersion: 2
      path: 0
      attribute: 0
      script: {fileID: 0}
      typeID: 212
      customType: 23
      isPPtrCurve: 1
    pptrCurveMapping:
    - {fileID: -118841236, guid: 40246c66bf4258b448cc943062535c9e, type: 3}
    - {fileID: 1259258698, guid: 40246c66bf4258b448cc943062535c9e, type: 3}
    - {fileID: -237475776, guid: 40246c66bf4258b448cc943062535c9e, type: 3}
    - {fileID: -2016363851, guid: 40246c66bf4258b448cc943062535c9e, type: 3}
    - {fileID: 954301657, guid: 40246c66bf4258b448cc943062535c9e, type: 3}
    - {fileID: 512299220, guid: 40246c66bf4258b448cc943062535c9e, type: 3}
    - {fileID: -886754984, guid: 40246c66bf4258b448cc943062535c9e, type: 3}
    - {fileID: 1635742358, guid: 40246c66bf4258b448cc943062535c9e, type: 3}
    - {fileID: 2135706224, guid: 40246c66bf4258b448cc943062535c9e, type: 3}
    - {fileID: 431834461, guid: 40246c66bf4258b448cc943062535c9e, type: 3}
    - {fileID: 1517955287, guid: 40246c66bf4258b448cc943062535c9e, type: 3}
    - {fileID: 1740524089, guid: 40246c66bf4258b448cc943062535c9e, type: 3}
    - {fileID: 625661365, guid: 40246c66bf4258b448cc943062535c9e, type: 3}
    - {fileID: 2001712928, guid: 40246c66bf4258b448cc943062535c9e, type: 3}
    - {fileID: -1728516645, guid: 40246c66bf4258b448cc943062535c9e, type: 3}
    - {fileID: -1204657342, guid: 40246c66bf4258b448cc943062535c9e, type: 3}
    - {fileID: 1830421328, guid: 40246c66bf4258b448cc943062535c9e, type: 3}
    - {fileID: -76372980, guid: 40246c66bf4258b448cc943062535c9e, type: 3}
    - {fileID: -1091845875, guid: 40246c66bf4258b448cc943062535c9e, type: 3}
    - {fileID: 1464128082, guid: 40246c66bf4258b448cc943062535c9e, type: 3}
  m_AnimationClipSettings:
    serializedVersion: 2
    m_AdditiveReferencePoseClip: {fileID: 0}
    m_AdditiveReferencePoseTime: 0
    m_StartTime: 0
    m_StopTime: 1.0166667
    m_OrientationOffsetY: 0
    m_Level: 0
    m_CycleOffset: 0
    m_HasAdditiveReferencePose: 0
    m_LoopTime: 1
    m_LoopBlend: 0
    m_LoopBlendOrientation: 0
    m_LoopBlendPositionY: 0
    m_LoopBlendPositionXZ: 0
    m_KeepOriginalOrientation: 0
    m_KeepOriginalPositionY: 1
    m_KeepOriginalPositionXZ: 0
    m_HeightFromFeet: 0
    m_Mirror: 0
  m_EditorCurves: []
  m_EulerEditorCurves: []
  m_HasGenericRootTransform: 0
  m_HasMotionFloatCurves: 0
  m_Events: []
