{
"skeleton": { "hash": "EIpalykkeX/03oUw/BHtPeA0WvQ", "spine": "3.8.95" },
"bones": [
	{ "name": "root" },
	{ "name": "kedip", "parent": "root" },
	{ "name": "ekspressi", "parent": "root" },
	{ "name": "mulut", "parent": "root" }
],
"slots": [
	{ "name": "ekspressi", "bone": "ekspressi" },
	{ "name": "kedip", "bone": "kedip" },
	{ "name": "mulut", "bone": "mulut" }
],
"skins": [
	{
		"name": "default",
		"attachments": {
			"ekspressi": {
				"cutscene-ibu-happy": { "x": 0.5, "width": 933, "height": 1316 },
				"cutscene-ibu-sedih": { "x": 0.5, "width": 933, "height": 1316 }
			},
			"kedip": {
				"cutscene-ibu-kedipp": { "x": 0.5, "width": 933, "height": 1316 }
			},
			"mulut": {
				"cutscene-ibu-happy-mulut1": { "x": 0.5, "width": 933, "height": 1316 },
				"cutscene-ibu-happy-mulut2": { "x": 0.5, "width": 933, "height": 1316 },
				"cutscene-ibu-netral-mulut1": { "x": 0.5, "width": 933, "height": 1316 },
				"cutscene-ibu-netral-mulut2": { "x": 0.5, "width": 933, "height": 1316 },
				"cutscene-ibu-sedih-mulut1": { "x": 0.5, "width": 933, "height": 1316 },
				"cutscene-ibu-sedih-mulut2": { "x": 0.5, "width": 933, "height": 1316 }
			}
		}
	}
],
"animations": {
	"happy-idle": {
		"slots": {
			"ekspressi": {
				"attachment": [
					{ "name": "cutscene-ibu-happy" }
				]
			},
			"kedip": {
				"attachment": [
					{ "name": "cutscene-ibu-kedipp" },
					{ "time": 0.1667, "name": null },
					{ "time": 2.2333, "name": "cutscene-ibu-kedipp" },
					{ "time": 2.4, "name": null },
					{ "time": 4.6, "name": "cutscene-ibu-kedipp" },
					{ "time": 4.7667, "name": null },
					{ "time": 5.2667, "name": "cutscene-ibu-kedipp" },
					{ "time": 5.4333, "name": null },
					{ "time": 8.4667, "name": null }
				]
			}
		}
	},
	"happy-talk": {
		"slots": {
			"ekspressi": {
				"attachment": [
					{ "name": "cutscene-ibu-happy" }
				]
			},
			"kedip": {
				"attachment": [
					{ "name": "cutscene-ibu-kedipp" },
					{ "time": 0.1667, "name": null },
					{ "time": 2.2333, "name": "cutscene-ibu-kedipp" },
					{ "time": 2.4, "name": null },
					{ "time": 4.6, "name": "cutscene-ibu-kedipp" },
					{ "time": 4.7667, "name": null },
					{ "time": 5.2667, "name": "cutscene-ibu-kedipp" },
					{ "time": 5.4333, "name": null },
					{ "time": 8.4667, "name": null }
				]
			},
			"mulut": {
				"attachment": [
					{ "time": 0.2, "name": "cutscene-ibu-happy-mulut1" },
					{ "time": 0.3333, "name": "cutscene-ibu-happy-mulut2" },
					{ "time": 0.4, "name": "cutscene-ibu-happy-mulut1" },
					{ "time": 0.5, "name": "cutscene-ibu-happy-mulut2" },
					{ "time": 0.6, "name": "cutscene-ibu-happy-mulut1" },
					{ "time": 0.7, "name": "cutscene-ibu-happy-mulut2" },
					{ "time": 0.8333, "name": null },
					{ "time": 1.0333, "name": "cutscene-ibu-happy-mulut1" },
					{ "time": 1.1667, "name": "cutscene-ibu-happy-mulut2" },
					{ "time": 1.3333, "name": null },
					{ "time": 1.4, "name": "cutscene-ibu-happy-mulut1" },
					{ "time": 1.6, "name": "cutscene-ibu-happy-mulut2" },
					{ "time": 1.7667, "name": "cutscene-ibu-happy-mulut1" },
					{ "time": 1.9, "name": "cutscene-ibu-happy-mulut2" },
					{ "time": 2.0667, "name": "cutscene-ibu-happy-mulut1" },
					{ "time": 2.2333, "name": "cutscene-ibu-happy-mulut2" },
					{ "time": 2.4, "name": null },
					{ "time": 2.6667, "name": "cutscene-ibu-happy-mulut1" },
					{ "time": 2.8, "name": "cutscene-ibu-happy-mulut2" },
					{ "time": 2.8667, "name": "cutscene-ibu-happy-mulut1" },
					{ "time": 2.9667, "name": "cutscene-ibu-happy-mulut2" },
					{ "time": 3.0667, "name": "cutscene-ibu-happy-mulut1" },
					{ "time": 3.1667, "name": "cutscene-ibu-happy-mulut2" },
					{ "time": 3.3, "name": null },
					{ "time": 3.5, "name": "cutscene-ibu-happy-mulut1" },
					{ "time": 3.6333, "name": "cutscene-ibu-happy-mulut2" },
					{ "time": 3.8, "name": null },
					{ "time": 3.8667, "name": "cutscene-ibu-happy-mulut1" },
					{ "time": 4.0667, "name": "cutscene-ibu-happy-mulut2" },
					{ "time": 4.2333, "name": "cutscene-ibu-happy-mulut1" },
					{ "time": 4.3667, "name": "cutscene-ibu-happy-mulut2" },
					{ "time": 4.5333, "name": "cutscene-ibu-happy-mulut1" },
					{ "time": 4.7, "name": "cutscene-ibu-happy-mulut2" },
					{ "time": 4.8, "name": "cutscene-ibu-happy-mulut1" },
					{ "time": 4.9333, "name": "cutscene-ibu-happy-mulut2" },
					{ "time": 5, "name": "cutscene-ibu-happy-mulut1" },
					{ "time": 5.1, "name": "cutscene-ibu-happy-mulut2" },
					{ "time": 5.2, "name": "cutscene-ibu-happy-mulut1" },
					{ "time": 5.3, "name": "cutscene-ibu-happy-mulut2" },
					{ "time": 5.4333, "name": null },
					{ "time": 5.6333, "name": "cutscene-ibu-happy-mulut1" },
					{ "time": 5.7667, "name": "cutscene-ibu-happy-mulut2" },
					{ "time": 5.9333, "name": null },
					{ "time": 6, "name": "cutscene-ibu-happy-mulut1" },
					{ "time": 6.2, "name": "cutscene-ibu-happy-mulut2" },
					{ "time": 6.3667, "name": "cutscene-ibu-happy-mulut1" },
					{ "time": 6.5, "name": "cutscene-ibu-happy-mulut2" },
					{ "time": 6.6667, "name": "cutscene-ibu-happy-mulut1" },
					{ "time": 6.8333, "name": "cutscene-ibu-happy-mulut2" },
					{ "time": 6.9667, "name": "cutscene-ibu-happy-mulut1" },
					{ "time": 7.1, "name": "cutscene-ibu-happy-mulut2" },
					{ "time": 7.1667, "name": "cutscene-ibu-happy-mulut1" },
					{ "time": 7.2667, "name": "cutscene-ibu-happy-mulut2" },
					{ "time": 7.3667, "name": "cutscene-ibu-happy-mulut1" },
					{ "time": 7.4667, "name": "cutscene-ibu-happy-mulut2" },
					{ "time": 7.6, "name": null },
					{ "time": 7.8, "name": "cutscene-ibu-happy-mulut1" },
					{ "time": 7.9333, "name": "cutscene-ibu-happy-mulut2" },
					{ "time": 8.1, "name": null },
					{ "time": 8.1667, "name": "cutscene-ibu-happy-mulut1" },
					{ "time": 8.3667, "name": "cutscene-ibu-happy-mulut2" }
				]
			}
		}
	},
	"netral-idle": {
		"slots": {
			"kedip": {
				"attachment": [
					{ "name": "cutscene-ibu-kedipp" },
					{ "time": 0.1667, "name": null },
					{ "time": 2.2333, "name": "cutscene-ibu-kedipp" },
					{ "time": 2.4, "name": null },
					{ "time": 4.6, "name": "cutscene-ibu-kedipp" },
					{ "time": 4.7667, "name": null },
					{ "time": 5.2667, "name": "cutscene-ibu-kedipp" },
					{ "time": 5.4333, "name": null },
					{ "time": 8.4667, "name": null }
				]
			}
		}
	},
	"netral-talk": {
		"slots": {
			"kedip": {
				"attachment": [
					{ "name": "cutscene-ibu-kedipp" },
					{ "time": 0.1667, "name": null },
					{ "time": 2.2333, "name": "cutscene-ibu-kedipp" },
					{ "time": 2.4, "name": null },
					{ "time": 4.6, "name": "cutscene-ibu-kedipp" },
					{ "time": 4.7667, "name": null },
					{ "time": 5.2667, "name": "cutscene-ibu-kedipp" },
					{ "time": 5.4333, "name": null },
					{ "time": 8.4667, "name": null }
				]
			},
			"mulut": {
				"attachment": [
					{ "name": "cutscene-ibu-netral-mulut2" },
					{ "time": 0.1333, "name": "cutscene-ibu-netral-mulut1" },
					{ "time": 0.3, "name": "cutscene-ibu-netral-mulut2" },
					{ "time": 0.5, "name": "cutscene-ibu-netral-mulut1" },
					{ "time": 0.7333, "name": "cutscene-ibu-netral-mulut2" },
					{ "time": 0.9333, "name": null },
					{ "time": 1.1667, "name": "cutscene-ibu-netral-mulut1" },
					{ "time": 1.4, "name": "cutscene-ibu-netral-mulut2" },
					{ "time": 1.5333, "name": "cutscene-ibu-netral-mulut1" },
					{ "time": 1.7667, "name": "cutscene-ibu-netral-mulut2" },
					{ "time": 1.9667, "name": "cutscene-ibu-netral-mulut1" },
					{ "time": 2.2667, "name": "cutscene-ibu-netral-mulut2" },
					{ "time": 2.6, "name": null },
					{ "time": 2.9333, "name": "cutscene-ibu-netral-mulut2" },
					{ "time": 3.2, "name": "cutscene-ibu-netral-mulut1" },
					{ "time": 3.5333, "name": "cutscene-ibu-netral-mulut2" },
					{ "time": 3.8333, "name": "cutscene-ibu-netral-mulut1" },
					{ "time": 4.1333, "name": null },
					{ "time": 4.3333, "name": "cutscene-ibu-netral-mulut2" },
					{ "time": 4.4667, "name": "cutscene-ibu-netral-mulut1" },
					{ "time": 4.6333, "name": "cutscene-ibu-netral-mulut2" },
					{ "time": 4.8333, "name": "cutscene-ibu-netral-mulut1" },
					{ "time": 5.0667, "name": "cutscene-ibu-netral-mulut2" },
					{ "time": 5.2667, "name": null },
					{ "time": 5.4, "name": "cutscene-ibu-netral-mulut1" },
					{ "time": 5.6333, "name": "cutscene-ibu-netral-mulut2" },
					{ "time": 5.7667, "name": "cutscene-ibu-netral-mulut1" },
					{ "time": 6, "name": "cutscene-ibu-netral-mulut2" },
					{ "time": 6.2, "name": "cutscene-ibu-netral-mulut1" },
					{ "time": 6.5, "name": "cutscene-ibu-netral-mulut2" },
					{ "time": 6.8333, "name": null },
					{ "time": 7.1333, "name": "cutscene-ibu-netral-mulut2" },
					{ "time": 7.4, "name": "cutscene-ibu-netral-mulut1" },
					{ "time": 7.7333, "name": "cutscene-ibu-netral-mulut2" },
					{ "time": 8.0333, "name": "cutscene-ibu-netral-mulut1" },
					{ "time": 8.3333, "name": null }
				]
			}
		}
	},
	"sad-idle": {
		"slots": {
			"ekspressi": {
				"attachment": [
					{ "name": "cutscene-ibu-sedih" }
				]
			},
			"kedip": {
				"attachment": [
					{ "name": "cutscene-ibu-kedipp" },
					{ "time": 0.1667, "name": null },
					{ "time": 2.2333, "name": "cutscene-ibu-kedipp" },
					{ "time": 2.4, "name": null },
					{ "time": 4.6, "name": "cutscene-ibu-kedipp" },
					{ "time": 4.7667, "name": null },
					{ "time": 5.2667, "name": "cutscene-ibu-kedipp" },
					{ "time": 5.4333, "name": null },
					{ "time": 8.4667, "name": null }
				]
			}
		}
	},
	"sad-talk": {
		"slots": {
			"ekspressi": {
				"attachment": [
					{ "name": "cutscene-ibu-sedih" }
				]
			},
			"kedip": {
				"attachment": [
					{ "name": "cutscene-ibu-kedipp" },
					{ "time": 0.1667, "name": null },
					{ "time": 2.2333, "name": "cutscene-ibu-kedipp" },
					{ "time": 2.4, "name": null },
					{ "time": 4.6, "name": "cutscene-ibu-kedipp" },
					{ "time": 4.7667, "name": null },
					{ "time": 5.2667, "name": "cutscene-ibu-kedipp" },
					{ "time": 5.4333, "name": null }
				]
			},
			"mulut": {
				"attachment": [
					{ "name": "cutscene-ibu-sedih-mulut1" },
					{ "time": 0.2, "name": "cutscene-ibu-sedih-mulut2" },
					{ "time": 0.4, "name": "cutscene-ibu-sedih-mulut1" },
					{ "time": 0.6333, "name": null },
					{ "time": 0.8667, "name": "cutscene-ibu-sedih-mulut2" },
					{ "time": 1, "name": "cutscene-ibu-sedih-mulut1" },
					{ "time": 1.2333, "name": "cutscene-ibu-sedih-mulut2" },
					{ "time": 1.5, "name": "cutscene-ibu-sedih-mulut1" },
					{ "time": 1.7333, "name": "cutscene-ibu-sedih-mulut2" },
					{ "time": 1.9667, "name": null },
					{ "time": 2.3, "name": "cutscene-ibu-sedih-mulut1" },
					{ "time": 2.5, "name": "cutscene-ibu-sedih-mulut2" },
					{ "time": 2.7, "name": "cutscene-ibu-sedih-mulut1" },
					{ "time": 2.9333, "name": null },
					{ "time": 3.1667, "name": "cutscene-ibu-sedih-mulut2" },
					{ "time": 3.3, "name": "cutscene-ibu-sedih-mulut1" },
					{ "time": 3.5333, "name": "cutscene-ibu-sedih-mulut2" },
					{ "time": 3.8, "name": "cutscene-ibu-sedih-mulut1" },
					{ "time": 4.0333, "name": "cutscene-ibu-sedih-mulut2" },
					{ "time": 4.2667, "name": null },
					{ "time": 4.4, "name": "cutscene-ibu-sedih-mulut1" },
					{ "time": 4.6, "name": "cutscene-ibu-sedih-mulut2" },
					{ "time": 4.8, "name": "cutscene-ibu-sedih-mulut1" },
					{ "time": 5.0333, "name": null },
					{ "time": 5.2667, "name": "cutscene-ibu-sedih-mulut2" },
					{ "time": 5.4, "name": "cutscene-ibu-sedih-mulut1" },
					{ "time": 5.6333, "name": "cutscene-ibu-sedih-mulut2" },
					{ "time": 5.9, "name": "cutscene-ibu-sedih-mulut1" },
					{ "time": 6.1333, "name": "cutscene-ibu-sedih-mulut2" },
					{ "time": 6.3667, "name": null },
					{ "time": 6.5, "name": "cutscene-ibu-sedih-mulut1" },
					{ "time": 6.7, "name": "cutscene-ibu-sedih-mulut2" },
					{ "time": 6.9, "name": "cutscene-ibu-sedih-mulut1" },
					{ "time": 7.1333, "name": null },
					{ "time": 7.3667, "name": "cutscene-ibu-sedih-mulut2" },
					{ "time": 7.5, "name": "cutscene-ibu-sedih-mulut1" },
					{ "time": 7.7333, "name": "cutscene-ibu-sedih-mulut2" },
					{ "time": 8, "name": "cutscene-ibu-sedih-mulut1" },
					{ "time": 8.2333, "name": "cutscene-ibu-sedih-mulut2" },
					{ "time": 8.4667, "name": null }
				]
			}
		}
	}
}
}