%YAML 1.1
%TAG !u! tag:unity3d.com,2011:
--- !u!74 &7400000
AnimationClip:
  m_ObjectHideFlags: 0
  m_CorrespondingSourceObject: {fileID: 0}
  m_PrefabInstance: {fileID: 0}
  m_PrefabAsset: {fileID: 0}
  m_Name: Howl
  serializedVersion: 6
  m_Legacy: 0
  m_Compressed: 0
  m_UseHighQualityCurve: 1
  m_RotationCurves: []
  m_CompressedRotationCurves: []
  m_EulerCurves: []
  m_PositionCurves: []
  m_ScaleCurves: []
  m_FloatCurves: []
  m_PPtrCurves:
  - curve:
    - time: 0
      value: {fileID: 2068271271, guid: 127f11182ac34be498b4a08f09612ebf, type: 3}
    - time: 0.016666668
      value: {fileID: 2133877433, guid: 127f11182ac34be498b4a08f09612ebf, type: 3}
    - time: 0.033333335
      value: {fileID: 503502400, guid: 127f11182ac34be498b4a08f09612ebf, type: 3}
    - time: 0.05
      value: {fileID: -1133453349, guid: 127f11182ac34be498b4a08f09612ebf, type: 3}
    - time: 0.06666667
      value: {fileID: -241411091, guid: 127f11182ac34be498b4a08f09612ebf, type: 3}
    - time: 0.083333336
      value: {fileID: 1301708424, guid: 127f11182ac34be498b4a08f09612ebf, type: 3}
    - time: 0.1
      value: {fileID: 2118838163, guid: 127f11182ac34be498b4a08f09612ebf, type: 3}
    - time: 0.11666667
      value: {fileID: -1275145110, guid: 127f11182ac34be498b4a08f09612ebf, type: 3}
    - time: 0.13333334
      value: {fileID: -115538742, guid: 127f11182ac34be498b4a08f09612ebf, type: 3}
    - time: 0.15
      value: {fileID: -487620403, guid: 127f11182ac34be498b4a08f09612ebf, type: 3}
    - time: 0.16666667
      value: {fileID: 1846548019, guid: 127f11182ac34be498b4a08f09612ebf, type: 3}
    - time: 0.18333334
      value: {fileID: -756609617, guid: 127f11182ac34be498b4a08f09612ebf, type: 3}
    - time: 0.2
      value: {fileID: -1641984018, guid: 127f11182ac34be498b4a08f09612ebf, type: 3}
    - time: 0.21666667
      value: {fileID: -701010277, guid: 127f11182ac34be498b4a08f09612ebf, type: 3}
    - time: 0.23333333
      value: {fileID: 732972851, guid: 127f11182ac34be498b4a08f09612ebf, type: 3}
    - time: 0.25
      value: {fileID: 1702886788, guid: 127f11182ac34be498b4a08f09612ebf, type: 3}
    - time: 0.26666668
      value: {fileID: -475569412, guid: 127f11182ac34be498b4a08f09612ebf, type: 3}
    - time: 0.28333333
      value: {fileID: -1856639601, guid: 127f11182ac34be498b4a08f09612ebf, type: 3}
    - time: 0.3
      value: {fileID: -74924873, guid: 127f11182ac34be498b4a08f09612ebf, type: 3}
    - time: 0.31666666
      value: {fileID: 768338667, guid: 127f11182ac34be498b4a08f09612ebf, type: 3}
    - time: 0.33333334
      value: {fileID: -445466509, guid: 127f11182ac34be498b4a08f09612ebf, type: 3}
    - time: 0.35
      value: {fileID: -2036948097, guid: 127f11182ac34be498b4a08f09612ebf, type: 3}
    - time: 0.36666667
      value: {fileID: 1859648772, guid: 127f11182ac34be498b4a08f09612ebf, type: 3}
    - time: 0.38333333
      value: {fileID: 821504880, guid: 127f11182ac34be498b4a08f09612ebf, type: 3}
    - time: 0.4
      value: {fileID: 1818931136, guid: 127f11182ac34be498b4a08f09612ebf, type: 3}
    - time: 0.41666666
      value: {fileID: -1490866181, guid: 127f11182ac34be498b4a08f09612ebf, type: 3}
    - time: 0.43333334
      value: {fileID: 1072370603, guid: 127f11182ac34be498b4a08f09612ebf, type: 3}
    - time: 0.45
      value: {fileID: 76406668, guid: 127f11182ac34be498b4a08f09612ebf, type: 3}
    - time: 0.46666667
      value: {fileID: 1285756395, guid: 127f11182ac34be498b4a08f09612ebf, type: 3}
    - time: 0.48333332
      value: {fileID: 40261539, guid: 127f11182ac34be498b4a08f09612ebf, type: 3}
    - time: 0.5
      value: {fileID: -762012605, guid: 127f11182ac34be498b4a08f09612ebf, type: 3}
    - time: 0.51666665
      value: {fileID: -1664102582, guid: 127f11182ac34be498b4a08f09612ebf, type: 3}
    - time: 0.53333336
      value: {fileID: 1888690385, guid: 127f11182ac34be498b4a08f09612ebf, type: 3}
    - time: 0.55
      value: {fileID: 2147152379, guid: 127f11182ac34be498b4a08f09612ebf, type: 3}
    - time: 0.56666666
      value: {fileID: -1409260042, guid: 127f11182ac34be498b4a08f09612ebf, type: 3}
    - time: 0.5833333
      value: {fileID: 611707245, guid: 127f11182ac34be498b4a08f09612ebf, type: 3}
    - time: 0.6
      value: {fileID: -1056300542, guid: 127f11182ac34be498b4a08f09612ebf, type: 3}
    - time: 0.6166667
      value: {fileID: -1157577162, guid: 127f11182ac34be498b4a08f09612ebf, type: 3}
    - time: 0.6333333
      value: {fileID: -1387285196, guid: 127f11182ac34be498b4a08f09612ebf, type: 3}
    - time: 0.65
      value: {fileID: -1535141257, guid: 127f11182ac34be498b4a08f09612ebf, type: 3}
    - time: 0.6666667
      value: {fileID: -313893832, guid: 127f11182ac34be498b4a08f09612ebf, type: 3}
    - time: 0.68333334
      value: {fileID: 428617370, guid: 127f11182ac34be498b4a08f09612ebf, type: 3}
    - time: 0.7
      value: {fileID: 504701466, guid: 127f11182ac34be498b4a08f09612ebf, type: 3}
    - time: 0.71666664
      value: {fileID: -287061294, guid: 127f11182ac34be498b4a08f09612ebf, type: 3}
    - time: 0.73333335
      value: {fileID: -1825852907, guid: 127f11182ac34be498b4a08f09612ebf, type: 3}
    - time: 0.75
      value: {fileID: 1934416365, guid: 127f11182ac34be498b4a08f09612ebf, type: 3}
    - time: 0.76666665
      value: {fileID: -1893162404, guid: 127f11182ac34be498b4a08f09612ebf, type: 3}
    - time: 0.78333336
      value: {fileID: 1440849888, guid: 127f11182ac34be498b4a08f09612ebf, type: 3}
    - time: 0.8
      value: {fileID: -1618082018, guid: 127f11182ac34be498b4a08f09612ebf, type: 3}
    - time: 0.81666666
      value: {fileID: -1601822260, guid: 127f11182ac34be498b4a08f09612ebf, type: 3}
    - time: 0.8333333
      value: {fileID: -1040769904, guid: 127f11182ac34be498b4a08f09612ebf, type: 3}
    - time: 0.85
      value: {fileID: -585322555, guid: 127f11182ac34be498b4a08f09612ebf, type: 3}
    - time: 0.8666667
      value: {fileID: -113573446, guid: 127f11182ac34be498b4a08f09612ebf, type: 3}
    - time: 0.8833333
      value: {fileID: -434355136, guid: 127f11182ac34be498b4a08f09612ebf, type: 3}
    - time: 0.9
      value: {fileID: -2113689990, guid: 127f11182ac34be498b4a08f09612ebf, type: 3}
    - time: 0.9166667
      value: {fileID: -1565932633, guid: 127f11182ac34be498b4a08f09612ebf, type: 3}
    - time: 0.93333334
      value: {fileID: 2079748704, guid: 127f11182ac34be498b4a08f09612ebf, type: 3}
    - time: 0.95
      value: {fileID: 450998872, guid: 127f11182ac34be498b4a08f09612ebf, type: 3}
    - time: 0.96666664
      value: {fileID: -1143276908, guid: 127f11182ac34be498b4a08f09612ebf, type: 3}
    - time: 0.98333335
      value: {fileID: 731447370, guid: 127f11182ac34be498b4a08f09612ebf, type: 3}
    - time: 1
      value: {fileID: -1511393390, guid: 127f11182ac34be498b4a08f09612ebf, type: 3}
    - time: 1.0166667
      value: {fileID: -1544304617, guid: 127f11182ac34be498b4a08f09612ebf, type: 3}
    - time: 1.0333333
      value: {fileID: 476671892, guid: 127f11182ac34be498b4a08f09612ebf, type: 3}
    - time: 1.05
      value: {fileID: -132328517, guid: 127f11182ac34be498b4a08f09612ebf, type: 3}
    - time: 1.0666667
      value: {fileID: 1802292142, guid: 127f11182ac34be498b4a08f09612ebf, type: 3}
    - time: 1.0833334
      value: {fileID: -139914253, guid: 127f11182ac34be498b4a08f09612ebf, type: 3}
    - time: 1.1
      value: {fileID: -2081272187, guid: 127f11182ac34be498b4a08f09612ebf, type: 3}
    - time: 1.1166667
      value: {fileID: -676728554, guid: 127f11182ac34be498b4a08f09612ebf, type: 3}
    - time: 1.1333333
      value: {fileID: -1791605809, guid: 127f11182ac34be498b4a08f09612ebf, type: 3}
    - time: 1.15
      value: {fileID: 212368861, guid: 127f11182ac34be498b4a08f09612ebf, type: 3}
    - time: 1.1666666
      value: {fileID: -1879269904, guid: 127f11182ac34be498b4a08f09612ebf, type: 3}
    - time: 1.1833333
      value: {fileID: -621130050, guid: 127f11182ac34be498b4a08f09612ebf, type: 3}
    - time: 1.2
      value: {fileID: 1909615959, guid: 127f11182ac34be498b4a08f09612ebf, type: 3}
    - time: 1.2166667
      value: {fileID: -958648853, guid: 127f11182ac34be498b4a08f09612ebf, type: 3}
    - time: 1.2333333
      value: {fileID: 1151649288, guid: 127f11182ac34be498b4a08f09612ebf, type: 3}
    - time: 1.25
      value: {fileID: -843378175, guid: 127f11182ac34be498b4a08f09612ebf, type: 3}
    - time: 1.2666667
      value: {fileID: 1606552734, guid: 127f11182ac34be498b4a08f09612ebf, type: 3}
    - time: 1.2833333
      value: {fileID: -658771833, guid: 127f11182ac34be498b4a08f09612ebf, type: 3}
    - time: 1.3
      value: {fileID: 1827985863, guid: 127f11182ac34be498b4a08f09612ebf, type: 3}
    - time: 1.3166667
      value: {fileID: 47877568, guid: 127f11182ac34be498b4a08f09612ebf, type: 3}
    - time: 1.3333334
      value: {fileID: -937027404, guid: 127f11182ac34be498b4a08f09612ebf, type: 3}
    - time: 1.35
      value: {fileID: -1195065402, guid: 127f11182ac34be498b4a08f09612ebf, type: 3}
    - time: 1.3666667
      value: {fileID: 36848413, guid: 127f11182ac34be498b4a08f09612ebf, type: 3}
    - time: 1.3833333
      value: {fileID: 87604867, guid: 127f11182ac34be498b4a08f09612ebf, type: 3}
    - time: 1.4
      value: {fileID: -2055675988, guid: 127f11182ac34be498b4a08f09612ebf, type: 3}
    - time: 1.4166666
      value: {fileID: 70030505, guid: 127f11182ac34be498b4a08f09612ebf, type: 3}
    - time: 1.4333333
      value: {fileID: 1694600847, guid: 127f11182ac34be498b4a08f09612ebf, type: 3}
    - time: 1.45
      value: {fileID: 1438522498, guid: 127f11182ac34be498b4a08f09612ebf, type: 3}
    - time: 1.4666667
      value: {fileID: 486898514, guid: 127f11182ac34be498b4a08f09612ebf, type: 3}
    - time: 1.4833333
      value: {fileID: -839934895, guid: 127f11182ac34be498b4a08f09612ebf, type: 3}
    - time: 1.5
      value: {fileID: -100080200, guid: 127f11182ac34be498b4a08f09612ebf, type: 3}
    - time: 1.5166667
      value: {fileID: -511758243, guid: 127f11182ac34be498b4a08f09612ebf, type: 3}
    - time: 1.5333333
      value: {fileID: 1720145862, guid: 127f11182ac34be498b4a08f09612ebf, type: 3}
    - time: 1.55
      value: {fileID: 2056283963, guid: 127f11182ac34be498b4a08f09612ebf, type: 3}
    - time: 1.5666667
      value: {fileID: 2090575540, guid: 127f11182ac34be498b4a08f09612ebf, type: 3}
    - time: 1.5833334
      value: {fileID: 89588309, guid: 127f11182ac34be498b4a08f09612ebf, type: 3}
    - time: 1.6
      value: {fileID: -1459775777, guid: 127f11182ac34be498b4a08f09612ebf, type: 3}
    - time: 1.6166667
      value: {fileID: 689413125, guid: 127f11182ac34be498b4a08f09612ebf, type: 3}
    - time: 1.6333333
      value: {fileID: 989863587, guid: 127f11182ac34be498b4a08f09612ebf, type: 3}
    - time: 1.65
      value: {fileID: -895784689, guid: 127f11182ac34be498b4a08f09612ebf, type: 3}
    - time: 1.6666666
      value: {fileID: 904290905, guid: 127f11182ac34be498b4a08f09612ebf, type: 3}
    - time: 1.6833333
      value: {fileID: 1090407691, guid: 127f11182ac34be498b4a08f09612ebf, type: 3}
    - time: 1.7
      value: {fileID: -1550794922, guid: 127f11182ac34be498b4a08f09612ebf, type: 3}
    - time: 1.7166667
      value: {fileID: -257465150, guid: 127f11182ac34be498b4a08f09612ebf, type: 3}
    - time: 1.7333333
      value: {fileID: -657969482, guid: 127f11182ac34be498b4a08f09612ebf, type: 3}
    - time: 1.75
      value: {fileID: 1912377613, guid: 127f11182ac34be498b4a08f09612ebf, type: 3}
    - time: 1.7666667
      value: {fileID: 2046925854, guid: 127f11182ac34be498b4a08f09612ebf, type: 3}
    - time: 1.7833333
      value: {fileID: -436923973, guid: 127f11182ac34be498b4a08f09612ebf, type: 3}
    - time: 1.8
      value: {fileID: -1819774668, guid: 127f11182ac34be498b4a08f09612ebf, type: 3}
    - time: 1.8166667
      value: {fileID: -419142512, guid: 127f11182ac34be498b4a08f09612ebf, type: 3}
    - time: 1.8333334
      value: {fileID: -1446921932, guid: 127f11182ac34be498b4a08f09612ebf, type: 3}
    - time: 1.85
      value: {fileID: 1647961023, guid: 127f11182ac34be498b4a08f09612ebf, type: 3}
    - time: 1.8666667
      value: {fileID: -480803554, guid: 127f11182ac34be498b4a08f09612ebf, type: 3}
    - time: 1.8833333
      value: {fileID: 1887753169, guid: 127f11182ac34be498b4a08f09612ebf, type: 3}
    - time: 1.9
      value: {fileID: 1288105485, guid: 127f11182ac34be498b4a08f09612ebf, type: 3}
    - time: 1.9166666
      value: {fileID: 1804291914, guid: 127f11182ac34be498b4a08f09612ebf, type: 3}
    - time: 1.9333333
      value: {fileID: -1422940683, guid: 127f11182ac34be498b4a08f09612ebf, type: 3}
    - time: 1.95
      value: {fileID: 547223271, guid: 127f11182ac34be498b4a08f09612ebf, type: 3}
    - time: 1.9666667
      value: {fileID: 823872814, guid: 127f11182ac34be498b4a08f09612ebf, type: 3}
    - time: 1.9833333
      value: {fileID: 2141001057, guid: 127f11182ac34be498b4a08f09612ebf, type: 3}
    - time: 2
      value: {fileID: 1749386565, guid: 127f11182ac34be498b4a08f09612ebf, type: 3}
    - time: 2.0166667
      value: {fileID: 1421564637, guid: 127f11182ac34be498b4a08f09612ebf, type: 3}
    - time: 2.0333333
      value: {fileID: 665331922, guid: 127f11182ac34be498b4a08f09612ebf, type: 3}
    - time: 2.05
      value: {fileID: -1467671689, guid: 127f11182ac34be498b4a08f09612ebf, type: 3}
    - time: 2.0666666
      value: {fileID: -141854953, guid: 127f11182ac34be498b4a08f09612ebf, type: 3}
    - time: 2.0833333
      value: {fileID: 1007020368, guid: 127f11182ac34be498b4a08f09612ebf, type: 3}
    - time: 2.1
      value: {fileID: -1509738210, guid: 127f11182ac34be498b4a08f09612ebf, type: 3}
    - time: 2.1166666
      value: {fileID: -1859112272, guid: 127f11182ac34be498b4a08f09612ebf, type: 3}
    - time: 2.1333334
      value: {fileID: -1683089806, guid: 127f11182ac34be498b4a08f09612ebf, type: 3}
    - time: 2.15
      value: {fileID: 1261249465, guid: 127f11182ac34be498b4a08f09612ebf, type: 3}
    - time: 2.1666667
      value: {fileID: -687425715, guid: 127f11182ac34be498b4a08f09612ebf, type: 3}
    - time: 2.1833334
      value: {fileID: 1382092994, guid: 127f11182ac34be498b4a08f09612ebf, type: 3}
    - time: 2.2
      value: {fileID: 185519530, guid: 127f11182ac34be498b4a08f09612ebf, type: 3}
    - time: 2.2166667
      value: {fileID: 2087037482, guid: 127f11182ac34be498b4a08f09612ebf, type: 3}
    - time: 2.2333333
      value: {fileID: 2023923546, guid: 127f11182ac34be498b4a08f09612ebf, type: 3}
    - time: 2.25
      value: {fileID: -995176416, guid: 127f11182ac34be498b4a08f09612ebf, type: 3}
    - time: 2.2666667
      value: {fileID: 1382757030, guid: 127f11182ac34be498b4a08f09612ebf, type: 3}
    - time: 2.2833333
      value: {fileID: -1509223082, guid: 127f11182ac34be498b4a08f09612ebf, type: 3}
    - time: 2.3
      value: {fileID: 664669669, guid: 127f11182ac34be498b4a08f09612ebf, type: 3}
    - time: 2.3166666
      value: {fileID: 15554499, guid: 127f11182ac34be498b4a08f09612ebf, type: 3}
    - time: 2.3333333
      value: {fileID: 1755212243, guid: 127f11182ac34be498b4a08f09612ebf, type: 3}
    - time: 2.35
      value: {fileID: -142477910, guid: 127f11182ac34be498b4a08f09612ebf, type: 3}
    - time: 2.3666666
      value: {fileID: -1092333127, guid: 127f11182ac34be498b4a08f09612ebf, type: 3}
    - time: 2.3833334
      value: {fileID: 457503054, guid: 127f11182ac34be498b4a08f09612ebf, type: 3}
    - time: 2.4
      value: {fileID: -366529903, guid: 127f11182ac34be498b4a08f09612ebf, type: 3}
    - time: 2.4166667
      value: {fileID: -321127950, guid: 127f11182ac34be498b4a08f09612ebf, type: 3}
    - time: 2.4333334
      value: {fileID: 930771225, guid: 127f11182ac34be498b4a08f09612ebf, type: 3}
    - time: 2.45
      value: {fileID: 1794371461, guid: 127f11182ac34be498b4a08f09612ebf, type: 3}
    - time: 2.4666667
      value: {fileID: -179109428, guid: 127f11182ac34be498b4a08f09612ebf, type: 3}
    - time: 2.4833333
      value: {fileID: 502871736, guid: 127f11182ac34be498b4a08f09612ebf, type: 3}
    - time: 2.5
      value: {fileID: -1025885936, guid: 127f11182ac34be498b4a08f09612ebf, type: 3}
    - time: 2.5166667
      value: {fileID: 1223386276, guid: 127f11182ac34be498b4a08f09612ebf, type: 3}
    - time: 2.5333333
      value: {fileID: -182890208, guid: 127f11182ac34be498b4a08f09612ebf, type: 3}
    - time: 2.55
      value: {fileID: 708480952, guid: 127f11182ac34be498b4a08f09612ebf, type: 3}
    - time: 2.5666666
      value: {fileID: -1816033179, guid: 127f11182ac34be498b4a08f09612ebf, type: 3}
    - time: 2.5833333
      value: {fileID: 699572268, guid: 127f11182ac34be498b4a08f09612ebf, type: 3}
    - time: 2.6
      value: {fileID: -473120583, guid: 127f11182ac34be498b4a08f09612ebf, type: 3}
    - time: 2.6166666
      value: {fileID: 1486054230, guid: 127f11182ac34be498b4a08f09612ebf, type: 3}
    - time: 2.6333334
      value: {fileID: -2113419851, guid: 127f11182ac34be498b4a08f09612ebf, type: 3}
    - time: 2.65
      value: {fileID: 214764515, guid: 127f11182ac34be498b4a08f09612ebf, type: 3}
    - time: 2.6666667
      value: {fileID: 1986503972, guid: 127f11182ac34be498b4a08f09612ebf, type: 3}
    - time: 2.6833334
      value: {fileID: 1449140472, guid: 127f11182ac34be498b4a08f09612ebf, type: 3}
    - time: 2.7
      value: {fileID: 533342552, guid: 127f11182ac34be498b4a08f09612ebf, type: 3}
    - time: 2.7166667
      value: {fileID: -502345333, guid: 127f11182ac34be498b4a08f09612ebf, type: 3}
    - time: 2.7333333
      value: {fileID: 359769936, guid: 127f11182ac34be498b4a08f09612ebf, type: 3}
    - time: 2.75
      value: {fileID: -221858308, guid: 127f11182ac34be498b4a08f09612ebf, type: 3}
    - time: 2.7666667
      value: {fileID: 1555246111, guid: 127f11182ac34be498b4a08f09612ebf, type: 3}
    - time: 2.7833333
      value: {fileID: 503406313, guid: 127f11182ac34be498b4a08f09612ebf, type: 3}
    - time: 2.8
      value: {fileID: 814506223, guid: 127f11182ac34be498b4a08f09612ebf, type: 3}
    - time: 2.8166666
      value: {fileID: -872894498, guid: 127f11182ac34be498b4a08f09612ebf, type: 3}
    - time: 2.8333333
      value: {fileID: -434615834, guid: 127f11182ac34be498b4a08f09612ebf, type: 3}
    - time: 2.85
      value: {fileID: 1612285849, guid: 127f11182ac34be498b4a08f09612ebf, type: 3}
    - time: 2.8666666
      value: {fileID: 2010243599, guid: 127f11182ac34be498b4a08f09612ebf, type: 3}
    - time: 2.8833334
      value: {fileID: 798715727, guid: 127f11182ac34be498b4a08f09612ebf, type: 3}
    - time: 2.9
      value: {fileID: 1598653819, guid: 127f11182ac34be498b4a08f09612ebf, type: 3}
    - time: 2.9166667
      value: {fileID: 335913223, guid: 127f11182ac34be498b4a08f09612ebf, type: 3}
    - time: 2.9333334
      value: {fileID: -1519650224, guid: 127f11182ac34be498b4a08f09612ebf, type: 3}
    - time: 2.95
      value: {fileID: 27838984, guid: 127f11182ac34be498b4a08f09612ebf, type: 3}
    - time: 2.9666667
      value: {fileID: -1915730419, guid: 127f11182ac34be498b4a08f09612ebf, type: 3}
    - time: 2.9833333
      value: {fileID: -303872865, guid: 127f11182ac34be498b4a08f09612ebf, type: 3}
    - time: 3
      value: {fileID: 801704914, guid: 127f11182ac34be498b4a08f09612ebf, type: 3}
    - time: 3.0166667
      value: {fileID: 571050720, guid: 127f11182ac34be498b4a08f09612ebf, type: 3}
    - time: 3.0333333
      value: {fileID: 387663210, guid: 127f11182ac34be498b4a08f09612ebf, type: 3}
    - time: 3.05
      value: {fileID: -1589367713, guid: 127f11182ac34be498b4a08f09612ebf, type: 3}
    - time: 3.0666666
      value: {fileID: 963331259, guid: 127f11182ac34be498b4a08f09612ebf, type: 3}
    - time: 3.0833333
      value: {fileID: 84271266, guid: 127f11182ac34be498b4a08f09612ebf, type: 3}
    - time: 3.1
      value: {fileID: 1971576900, guid: 127f11182ac34be498b4a08f09612ebf, type: 3}
    - time: 3.1166666
      value: {fileID: -1284027434, guid: 127f11182ac34be498b4a08f09612ebf, type: 3}
    - time: 3.1333334
      value: {fileID: -1271301710, guid: 127f11182ac34be498b4a08f09612ebf, type: 3}
    - time: 3.15
      value: {fileID: 621873811, guid: 127f11182ac34be498b4a08f09612ebf, type: 3}
    - time: 3.1666667
      value: {fileID: -278796264, guid: 127f11182ac34be498b4a08f09612ebf, type: 3}
    - time: 3.1833334
      value: {fileID: -1473844633, guid: 127f11182ac34be498b4a08f09612ebf, type: 3}
    - time: 3.2
      value: {fileID: 494104232, guid: 127f11182ac34be498b4a08f09612ebf, type: 3}
    - time: 3.2166667
      value: {fileID: 2050194392, guid: 127f11182ac34be498b4a08f09612ebf, type: 3}
    - time: 3.2333333
      value: {fileID: -926153066, guid: 127f11182ac34be498b4a08f09612ebf, type: 3}
    - time: 3.25
      value: {fileID: 2146991235, guid: 127f11182ac34be498b4a08f09612ebf, type: 3}
    - time: 3.2666667
      value: {fileID: -895012975, guid: 127f11182ac34be498b4a08f09612ebf, type: 3}
    - time: 3.2833333
      value: {fileID: 1344622435, guid: 127f11182ac34be498b4a08f09612ebf, type: 3}
    - time: 3.3
      value: {fileID: 476469465, guid: 127f11182ac34be498b4a08f09612ebf, type: 3}
    attribute: m_Sprite
    path: 
    classID: 212
    script: {fileID: 0}
  m_SampleRate: 60
  m_WrapMode: 0
  m_Bounds:
    m_Center: {x: 0, y: 0, z: 0}
    m_Extent: {x: 0, y: 0, z: 0}
  m_ClipBindingConstant:
    genericBindings:
    - serializedVersion: 2
      path: 0
      attribute: 0
      script: {fileID: 0}
      typeID: 212
      customType: 23
      isPPtrCurve: 1
    pptrCurveMapping:
    - {fileID: 2068271271, guid: 127f11182ac34be498b4a08f09612ebf, type: 3}
    - {fileID: 2133877433, guid: 127f11182ac34be498b4a08f09612ebf, type: 3}
    - {fileID: 503502400, guid: 127f11182ac34be498b4a08f09612ebf, type: 3}
    - {fileID: -1133453349, guid: 127f11182ac34be498b4a08f09612ebf, type: 3}
    - {fileID: -241411091, guid: 127f11182ac34be498b4a08f09612ebf, type: 3}
    - {fileID: 1301708424, guid: 127f11182ac34be498b4a08f09612ebf, type: 3}
    - {fileID: 2118838163, guid: 127f11182ac34be498b4a08f09612ebf, type: 3}
    - {fileID: -1275145110, guid: 127f11182ac34be498b4a08f09612ebf, type: 3}
    - {fileID: -115538742, guid: 127f11182ac34be498b4a08f09612ebf, type: 3}
    - {fileID: -487620403, guid: 127f11182ac34be498b4a08f09612ebf, type: 3}
    - {fileID: 1846548019, guid: 127f11182ac34be498b4a08f09612ebf, type: 3}
    - {fileID: -756609617, guid: 127f11182ac34be498b4a08f09612ebf, type: 3}
    - {fileID: -1641984018, guid: 127f11182ac34be498b4a08f09612ebf, type: 3}
    - {fileID: -701010277, guid: 127f11182ac34be498b4a08f09612ebf, type: 3}
    - {fileID: 732972851, guid: 127f11182ac34be498b4a08f09612ebf, type: 3}
    - {fileID: 1702886788, guid: 127f11182ac34be498b4a08f09612ebf, type: 3}
    - {fileID: -475569412, guid: 127f11182ac34be498b4a08f09612ebf, type: 3}
    - {fileID: -1856639601, guid: 127f11182ac34be498b4a08f09612ebf, type: 3}
    - {fileID: -74924873, guid: 127f11182ac34be498b4a08f09612ebf, type: 3}
    - {fileID: 768338667, guid: 127f11182ac34be498b4a08f09612ebf, type: 3}
    - {fileID: -445466509, guid: 127f11182ac34be498b4a08f09612ebf, type: 3}
    - {fileID: -2036948097, guid: 127f11182ac34be498b4a08f09612ebf, type: 3}
    - {fileID: 1859648772, guid: 127f11182ac34be498b4a08f09612ebf, type: 3}
    - {fileID: 821504880, guid: 127f11182ac34be498b4a08f09612ebf, type: 3}
    - {fileID: 1818931136, guid: 127f11182ac34be498b4a08f09612ebf, type: 3}
    - {fileID: -1490866181, guid: 127f11182ac34be498b4a08f09612ebf, type: 3}
    - {fileID: 1072370603, guid: 127f11182ac34be498b4a08f09612ebf, type: 3}
    - {fileID: 76406668, guid: 127f11182ac34be498b4a08f09612ebf, type: 3}
    - {fileID: 1285756395, guid: 127f11182ac34be498b4a08f09612ebf, type: 3}
    - {fileID: 40261539, guid: 127f11182ac34be498b4a08f09612ebf, type: 3}
    - {fileID: -762012605, guid: 127f11182ac34be498b4a08f09612ebf, type: 3}
    - {fileID: -1664102582, guid: 127f11182ac34be498b4a08f09612ebf, type: 3}
    - {fileID: 1888690385, guid: 127f11182ac34be498b4a08f09612ebf, type: 3}
    - {fileID: 2147152379, guid: 127f11182ac34be498b4a08f09612ebf, type: 3}
    - {fileID: -1409260042, guid: 127f11182ac34be498b4a08f09612ebf, type: 3}
    - {fileID: 611707245, guid: 127f11182ac34be498b4a08f09612ebf, type: 3}
    - {fileID: -1056300542, guid: 127f11182ac34be498b4a08f09612ebf, type: 3}
    - {fileID: -1157577162, guid: 127f11182ac34be498b4a08f09612ebf, type: 3}
    - {fileID: -1387285196, guid: 127f11182ac34be498b4a08f09612ebf, type: 3}
    - {fileID: -1535141257, guid: 127f11182ac34be498b4a08f09612ebf, type: 3}
    - {fileID: -313893832, guid: 127f11182ac34be498b4a08f09612ebf, type: 3}
    - {fileID: 428617370, guid: 127f11182ac34be498b4a08f09612ebf, type: 3}
    - {fileID: 504701466, guid: 127f11182ac34be498b4a08f09612ebf, type: 3}
    - {fileID: -287061294, guid: 127f11182ac34be498b4a08f09612ebf, type: 3}
    - {fileID: -1825852907, guid: 127f11182ac34be498b4a08f09612ebf, type: 3}
    - {fileID: 1934416365, guid: 127f11182ac34be498b4a08f09612ebf, type: 3}
    - {fileID: -1893162404, guid: 127f11182ac34be498b4a08f09612ebf, type: 3}
    - {fileID: 1440849888, guid: 127f11182ac34be498b4a08f09612ebf, type: 3}
    - {fileID: -1618082018, guid: 127f11182ac34be498b4a08f09612ebf, type: 3}
    - {fileID: -1601822260, guid: 127f11182ac34be498b4a08f09612ebf, type: 3}
    - {fileID: -1040769904, guid: 127f11182ac34be498b4a08f09612ebf, type: 3}
    - {fileID: -585322555, guid: 127f11182ac34be498b4a08f09612ebf, type: 3}
    - {fileID: -113573446, guid: 127f11182ac34be498b4a08f09612ebf, type: 3}
    - {fileID: -434355136, guid: 127f11182ac34be498b4a08f09612ebf, type: 3}
    - {fileID: -2113689990, guid: 127f11182ac34be498b4a08f09612ebf, type: 3}
    - {fileID: -1565932633, guid: 127f11182ac34be498b4a08f09612ebf, type: 3}
    - {fileID: 2079748704, guid: 127f11182ac34be498b4a08f09612ebf, type: 3}
    - {fileID: 450998872, guid: 127f11182ac34be498b4a08f09612ebf, type: 3}
    - {fileID: -1143276908, guid: 127f11182ac34be498b4a08f09612ebf, type: 3}
    - {fileID: 731447370, guid: 127f11182ac34be498b4a08f09612ebf, type: 3}
    - {fileID: -1511393390, guid: 127f11182ac34be498b4a08f09612ebf, type: 3}
    - {fileID: -1544304617, guid: 127f11182ac34be498b4a08f09612ebf, type: 3}
    - {fileID: 476671892, guid: 127f11182ac34be498b4a08f09612ebf, type: 3}
    - {fileID: -132328517, guid: 127f11182ac34be498b4a08f09612ebf, type: 3}
    - {fileID: 1802292142, guid: 127f11182ac34be498b4a08f09612ebf, type: 3}
    - {fileID: -139914253, guid: 127f11182ac34be498b4a08f09612ebf, type: 3}
    - {fileID: -2081272187, guid: 127f11182ac34be498b4a08f09612ebf, type: 3}
    - {fileID: -676728554, guid: 127f11182ac34be498b4a08f09612ebf, type: 3}
    - {fileID: -1791605809, guid: 127f11182ac34be498b4a08f09612ebf, type: 3}
    - {fileID: 212368861, guid: 127f11182ac34be498b4a08f09612ebf, type: 3}
    - {fileID: -1879269904, guid: 127f11182ac34be498b4a08f09612ebf, type: 3}
    - {fileID: -621130050, guid: 127f11182ac34be498b4a08f09612ebf, type: 3}
    - {fileID: 1909615959, guid: 127f11182ac34be498b4a08f09612ebf, type: 3}
    - {fileID: -958648853, guid: 127f11182ac34be498b4a08f09612ebf, type: 3}
    - {fileID: 1151649288, guid: 127f11182ac34be498b4a08f09612ebf, type: 3}
    - {fileID: -843378175, guid: 127f11182ac34be498b4a08f09612ebf, type: 3}
    - {fileID: 1606552734, guid: 127f11182ac34be498b4a08f09612ebf, type: 3}
    - {fileID: -658771833, guid: 127f11182ac34be498b4a08f09612ebf, type: 3}
    - {fileID: 1827985863, guid: 127f11182ac34be498b4a08f09612ebf, type: 3}
    - {fileID: 47877568, guid: 127f11182ac34be498b4a08f09612ebf, type: 3}
    - {fileID: -937027404, guid: 127f11182ac34be498b4a08f09612ebf, type: 3}
    - {fileID: -1195065402, guid: 127f11182ac34be498b4a08f09612ebf, type: 3}
    - {fileID: 36848413, guid: 127f11182ac34be498b4a08f09612ebf, type: 3}
    - {fileID: 87604867, guid: 127f11182ac34be498b4a08f09612ebf, type: 3}
    - {fileID: -2055675988, guid: 127f11182ac34be498b4a08f09612ebf, type: 3}
    - {fileID: 70030505, guid: 127f11182ac34be498b4a08f09612ebf, type: 3}
    - {fileID: 1694600847, guid: 127f11182ac34be498b4a08f09612ebf, type: 3}
    - {fileID: 1438522498, guid: 127f11182ac34be498b4a08f09612ebf, type: 3}
    - {fileID: 486898514, guid: 127f11182ac34be498b4a08f09612ebf, type: 3}
    - {fileID: -839934895, guid: 127f11182ac34be498b4a08f09612ebf, type: 3}
    - {fileID: -100080200, guid: 127f11182ac34be498b4a08f09612ebf, type: 3}
    - {fileID: -511758243, guid: 127f11182ac34be498b4a08f09612ebf, type: 3}
    - {fileID: 1720145862, guid: 127f11182ac34be498b4a08f09612ebf, type: 3}
    - {fileID: 2056283963, guid: 127f11182ac34be498b4a08f09612ebf, type: 3}
    - {fileID: 2090575540, guid: 127f11182ac34be498b4a08f09612ebf, type: 3}
    - {fileID: 89588309, guid: 127f11182ac34be498b4a08f09612ebf, type: 3}
    - {fileID: -1459775777, guid: 127f11182ac34be498b4a08f09612ebf, type: 3}
    - {fileID: 689413125, guid: 127f11182ac34be498b4a08f09612ebf, type: 3}
    - {fileID: 989863587, guid: 127f11182ac34be498b4a08f09612ebf, type: 3}
    - {fileID: -895784689, guid: 127f11182ac34be498b4a08f09612ebf, type: 3}
    - {fileID: 904290905, guid: 127f11182ac34be498b4a08f09612ebf, type: 3}
    - {fileID: 1090407691, guid: 127f11182ac34be498b4a08f09612ebf, type: 3}
    - {fileID: -1550794922, guid: 127f11182ac34be498b4a08f09612ebf, type: 3}
    - {fileID: -257465150, guid: 127f11182ac34be498b4a08f09612ebf, type: 3}
    - {fileID: -657969482, guid: 127f11182ac34be498b4a08f09612ebf, type: 3}
    - {fileID: 1912377613, guid: 127f11182ac34be498b4a08f09612ebf, type: 3}
    - {fileID: 2046925854, guid: 127f11182ac34be498b4a08f09612ebf, type: 3}
    - {fileID: -436923973, guid: 127f11182ac34be498b4a08f09612ebf, type: 3}
    - {fileID: -1819774668, guid: 127f11182ac34be498b4a08f09612ebf, type: 3}
    - {fileID: -419142512, guid: 127f11182ac34be498b4a08f09612ebf, type: 3}
    - {fileID: -1446921932, guid: 127f11182ac34be498b4a08f09612ebf, type: 3}
    - {fileID: 1647961023, guid: 127f11182ac34be498b4a08f09612ebf, type: 3}
    - {fileID: -480803554, guid: 127f11182ac34be498b4a08f09612ebf, type: 3}
    - {fileID: 1887753169, guid: 127f11182ac34be498b4a08f09612ebf, type: 3}
    - {fileID: 1288105485, guid: 127f11182ac34be498b4a08f09612ebf, type: 3}
    - {fileID: 1804291914, guid: 127f11182ac34be498b4a08f09612ebf, type: 3}
    - {fileID: -1422940683, guid: 127f11182ac34be498b4a08f09612ebf, type: 3}
    - {fileID: 547223271, guid: 127f11182ac34be498b4a08f09612ebf, type: 3}
    - {fileID: 823872814, guid: 127f11182ac34be498b4a08f09612ebf, type: 3}
    - {fileID: 2141001057, guid: 127f11182ac34be498b4a08f09612ebf, type: 3}
    - {fileID: 1749386565, guid: 127f11182ac34be498b4a08f09612ebf, type: 3}
    - {fileID: 1421564637, guid: 127f11182ac34be498b4a08f09612ebf, type: 3}
    - {fileID: 665331922, guid: 127f11182ac34be498b4a08f09612ebf, type: 3}
    - {fileID: -1467671689, guid: 127f11182ac34be498b4a08f09612ebf, type: 3}
    - {fileID: -141854953, guid: 127f11182ac34be498b4a08f09612ebf, type: 3}
    - {fileID: 1007020368, guid: 127f11182ac34be498b4a08f09612ebf, type: 3}
    - {fileID: -1509738210, guid: 127f11182ac34be498b4a08f09612ebf, type: 3}
    - {fileID: -1859112272, guid: 127f11182ac34be498b4a08f09612ebf, type: 3}
    - {fileID: -1683089806, guid: 127f11182ac34be498b4a08f09612ebf, type: 3}
    - {fileID: 1261249465, guid: 127f11182ac34be498b4a08f09612ebf, type: 3}
    - {fileID: -687425715, guid: 127f11182ac34be498b4a08f09612ebf, type: 3}
    - {fileID: 1382092994, guid: 127f11182ac34be498b4a08f09612ebf, type: 3}
    - {fileID: 185519530, guid: 127f11182ac34be498b4a08f09612ebf, type: 3}
    - {fileID: 2087037482, guid: 127f11182ac34be498b4a08f09612ebf, type: 3}
    - {fileID: 2023923546, guid: 127f11182ac34be498b4a08f09612ebf, type: 3}
    - {fileID: -995176416, guid: 127f11182ac34be498b4a08f09612ebf, type: 3}
    - {fileID: 1382757030, guid: 127f11182ac34be498b4a08f09612ebf, type: 3}
    - {fileID: -1509223082, guid: 127f11182ac34be498b4a08f09612ebf, type: 3}
    - {fileID: 664669669, guid: 127f11182ac34be498b4a08f09612ebf, type: 3}
    - {fileID: 15554499, guid: 127f11182ac34be498b4a08f09612ebf, type: 3}
    - {fileID: 1755212243, guid: 127f11182ac34be498b4a08f09612ebf, type: 3}
    - {fileID: -142477910, guid: 127f11182ac34be498b4a08f09612ebf, type: 3}
    - {fileID: -1092333127, guid: 127f11182ac34be498b4a08f09612ebf, type: 3}
    - {fileID: 457503054, guid: 127f11182ac34be498b4a08f09612ebf, type: 3}
    - {fileID: -366529903, guid: 127f11182ac34be498b4a08f09612ebf, type: 3}
    - {fileID: -321127950, guid: 127f11182ac34be498b4a08f09612ebf, type: 3}
    - {fileID: 930771225, guid: 127f11182ac34be498b4a08f09612ebf, type: 3}
    - {fileID: 1794371461, guid: 127f11182ac34be498b4a08f09612ebf, type: 3}
    - {fileID: -179109428, guid: 127f11182ac34be498b4a08f09612ebf, type: 3}
    - {fileID: 502871736, guid: 127f11182ac34be498b4a08f09612ebf, type: 3}
    - {fileID: -1025885936, guid: 127f11182ac34be498b4a08f09612ebf, type: 3}
    - {fileID: 1223386276, guid: 127f11182ac34be498b4a08f09612ebf, type: 3}
    - {fileID: -182890208, guid: 127f11182ac34be498b4a08f09612ebf, type: 3}
    - {fileID: 708480952, guid: 127f11182ac34be498b4a08f09612ebf, type: 3}
    - {fileID: -1816033179, guid: 127f11182ac34be498b4a08f09612ebf, type: 3}
    - {fileID: 699572268, guid: 127f11182ac34be498b4a08f09612ebf, type: 3}
    - {fileID: -473120583, guid: 127f11182ac34be498b4a08f09612ebf, type: 3}
    - {fileID: 1486054230, guid: 127f11182ac34be498b4a08f09612ebf, type: 3}
    - {fileID: -2113419851, guid: 127f11182ac34be498b4a08f09612ebf, type: 3}
    - {fileID: 214764515, guid: 127f11182ac34be498b4a08f09612ebf, type: 3}
    - {fileID: 1986503972, guid: 127f11182ac34be498b4a08f09612ebf, type: 3}
    - {fileID: 1449140472, guid: 127f11182ac34be498b4a08f09612ebf, type: 3}
    - {fileID: 533342552, guid: 127f11182ac34be498b4a08f09612ebf, type: 3}
    - {fileID: -502345333, guid: 127f11182ac34be498b4a08f09612ebf, type: 3}
    - {fileID: 359769936, guid: 127f11182ac34be498b4a08f09612ebf, type: 3}
    - {fileID: -221858308, guid: 127f11182ac34be498b4a08f09612ebf, type: 3}
    - {fileID: 1555246111, guid: 127f11182ac34be498b4a08f09612ebf, type: 3}
    - {fileID: 503406313, guid: 127f11182ac34be498b4a08f09612ebf, type: 3}
    - {fileID: 814506223, guid: 127f11182ac34be498b4a08f09612ebf, type: 3}
    - {fileID: -872894498, guid: 127f11182ac34be498b4a08f09612ebf, type: 3}
    - {fileID: -434615834, guid: 127f11182ac34be498b4a08f09612ebf, type: 3}
    - {fileID: 1612285849, guid: 127f11182ac34be498b4a08f09612ebf, type: 3}
    - {fileID: 2010243599, guid: 127f11182ac34be498b4a08f09612ebf, type: 3}
    - {fileID: 798715727, guid: 127f11182ac34be498b4a08f09612ebf, type: 3}
    - {fileID: 1598653819, guid: 127f11182ac34be498b4a08f09612ebf, type: 3}
    - {fileID: 335913223, guid: 127f11182ac34be498b4a08f09612ebf, type: 3}
    - {fileID: -1519650224, guid: 127f11182ac34be498b4a08f09612ebf, type: 3}
    - {fileID: 27838984, guid: 127f11182ac34be498b4a08f09612ebf, type: 3}
    - {fileID: -1915730419, guid: 127f11182ac34be498b4a08f09612ebf, type: 3}
    - {fileID: -303872865, guid: 127f11182ac34be498b4a08f09612ebf, type: 3}
    - {fileID: 801704914, guid: 127f11182ac34be498b4a08f09612ebf, type: 3}
    - {fileID: 571050720, guid: 127f11182ac34be498b4a08f09612ebf, type: 3}
    - {fileID: 387663210, guid: 127f11182ac34be498b4a08f09612ebf, type: 3}
    - {fileID: -1589367713, guid: 127f11182ac34be498b4a08f09612ebf, type: 3}
    - {fileID: 963331259, guid: 127f11182ac34be498b4a08f09612ebf, type: 3}
    - {fileID: 84271266, guid: 127f11182ac34be498b4a08f09612ebf, type: 3}
    - {fileID: 1971576900, guid: 127f11182ac34be498b4a08f09612ebf, type: 3}
    - {fileID: -1284027434, guid: 127f11182ac34be498b4a08f09612ebf, type: 3}
    - {fileID: -1271301710, guid: 127f11182ac34be498b4a08f09612ebf, type: 3}
    - {fileID: 621873811, guid: 127f11182ac34be498b4a08f09612ebf, type: 3}
    - {fileID: -278796264, guid: 127f11182ac34be498b4a08f09612ebf, type: 3}
    - {fileID: -1473844633, guid: 127f11182ac34be498b4a08f09612ebf, type: 3}
    - {fileID: 494104232, guid: 127f11182ac34be498b4a08f09612ebf, type: 3}
    - {fileID: 2050194392, guid: 127f11182ac34be498b4a08f09612ebf, type: 3}
    - {fileID: -926153066, guid: 127f11182ac34be498b4a08f09612ebf, type: 3}
    - {fileID: 2146991235, guid: 127f11182ac34be498b4a08f09612ebf, type: 3}
    - {fileID: -895012975, guid: 127f11182ac34be498b4a08f09612ebf, type: 3}
    - {fileID: 1344622435, guid: 127f11182ac34be498b4a08f09612ebf, type: 3}
    - {fileID: 476469465, guid: 127f11182ac34be498b4a08f09612ebf, type: 3}
  m_AnimationClipSettings:
    serializedVersion: 2
    m_AdditiveReferencePoseClip: {fileID: 0}
    m_AdditiveReferencePoseTime: 0
    m_StartTime: 0
    m_StopTime: 3.3166666
    m_OrientationOffsetY: 0
    m_Level: 0
    m_CycleOffset: 0
    m_HasAdditiveReferencePose: 0
    m_LoopTime: 1
    m_LoopBlend: 0
    m_LoopBlendOrientation: 0
    m_LoopBlendPositionY: 0
    m_LoopBlendPositionXZ: 0
    m_KeepOriginalOrientation: 0
    m_KeepOriginalPositionY: 1
    m_KeepOriginalPositionXZ: 0
    m_HeightFromFeet: 0
    m_Mirror: 0
  m_EditorCurves: []
  m_EulerEditorCurves: []
  m_HasGenericRootTransform: 0
  m_HasMotionFloatCurves: 0
  m_Events: []
