%YAML 1.1
%TAG !u! tag:unity3d.com,2011:
--- !u!114 &11400000
MonoBehaviour:
  m_ObjectHideFlags: 0
  m_CorrespondingSourceObject: {fileID: 0}
  m_PrefabInstance: {fileID: 0}
  m_PrefabAsset: {fileID: 0}
  m_GameObject: {fileID: 0}
  m_Enabled: 1
  m_EditorHideFlags: 0
  m_Script: {fileID: 11500000, guid: dc5fbed1143d30f45a8cdb79099af82c, type: 3}
  m_Name: Scene 11
  m_EditorClassIdentifier: 
  id: 11
  fieldPrefab: {fileID: 5995014570813772937, guid: d8511ff14068c2e4d8e15e5068fc1ef7, type: 3}
  description: 
