%YAML 1.1
%TAG !u! tag:unity3d.com,2011:
--- !u!74 &7400000
AnimationClip:
  m_ObjectHideFlags: 0
  m_CorrespondingSourceObject: {fileID: 0}
  m_PrefabInstance: {fileID: 0}
  m_PrefabAsset: {fileID: 0}
  m_Name: Pohon Tinggi-Arm-01_Pohon_tinggi_01-Idle
  serializedVersion: 6
  m_Legacy: 0
  m_Compressed: 0
  m_UseHighQualityCurve: 1
  m_RotationCurves:
  - curve:
      serializedVersion: 2
      m_Curve:
      - serializedVersion: 3
        time: 0
        value: {x: 0, y: 0, z: 0.010057401, w: 0.99994946}
        inSlope: {x: 0, y: 0, z: -0.0005691871, w: 0.000005722046}
        outSlope: {x: 0, y: 0, z: -0.0005691871, w: 0.000005722046}
        tangentMode: 0
        weightedMode: 0
        inWeight: {x: 0.33333334, y: 0.33333334, z: 0.33333334, w: 0.33333334}
        outWeight: {x: 0.33333334, y: 0.33333334, z: 0.33333334, w: 0.33333334}
      - serializedVersion: 3
        time: 2.0416667
        value: {x: 0, y: -0, z: -0.0049509136, w: 0.9999878}
        inSlope: {x: 0, y: 0, z: 0.00490346, w: 0.000024318648}
        outSlope: {x: 0, y: 0, z: 0.00490346, w: 0.000024318648}
        tangentMode: 0
        weightedMode: 0
        inWeight: {x: 0.33333334, y: 0.33333334, z: 0.33333334, w: 0.33333334}
        outWeight: {x: 0.33333334, y: 0.33333334, z: 0.33333334, w: 0.33333334}
      - serializedVersion: 3
        time: 3.7083335
        value: {x: 0, y: 0, z: 0.010057401, w: 0.99994946}
        inSlope: {x: 0, y: 0, z: 0.00054446503, w: -0.000005722035}
        outSlope: {x: 0, y: 0, z: 0.00054446503, w: -0.000005722035}
        tangentMode: 0
        weightedMode: 0
        inWeight: {x: 0.33333334, y: 0.33333334, z: 0.33333334, w: 0.33333334}
        outWeight: {x: 0.33333334, y: 0.33333334, z: 0.33333334, w: 0.33333334}
      m_PreInfinity: 2
      m_PostInfinity: 2
      m_RotationOrder: 4
    path: Pohon Tinggi-Arm-01/Bone/Bone.001
  - curve:
      serializedVersion: 2
      m_Curve:
      - serializedVersion: 3
        time: 0
        value: {x: -8.3883434e-10, y: -0.00000011925431, z: 0.010562154, w: 0.9999442}
        inSlope: {x: 0.0000000025832496, y: -1.7053026e-11, z: 0.021660335, w: -0.0002374649}
        outSlope: {x: 0.0000000025832496, y: -1.7053026e-11, z: 0.021660335, w: -0.0002374649}
        tangentMode: 0
        weightedMode: 0
        inWeight: {x: 0.33333334, y: 0.33333334, z: 0.33333334, w: 0.33333334}
        outWeight: {x: 0.33333334, y: 0.33333334, z: 0.33333334, w: 0.33333334}
      - serializedVersion: 3
        time: 2.0416667
        value: {x: -0.0000000046669464, y: -0.00000011916591, z: -0.021545531, w: 0.9997679}
        inSlope: {x: -0.0000000014377858, y: 5.6189612e-11, z: -0.012062586, w: -0.00025963734}
        outSlope: {x: -0.0000000014377858, y: 5.6189612e-11, z: -0.012062586, w: -0.00025963734}
        tangentMode: 0
        weightedMode: 0
        inWeight: {x: 0.33333334, y: 0.33333334, z: 0.33333334, w: 0.33333334}
        outWeight: {x: 0.33333334, y: 0.33333334, z: 0.33333334, w: 0.33333334}
      - serializedVersion: 3
        time: 3.7083335
        value: {x: -8.3883434e-10, y: -0.00000011925431, z: 0.010562154, w: 0.9999442}
        inSlope: {x: 0.0000000027492622, y: -2.0804651e-11, z: 0.023052692, w: -0.00023317292}
        outSlope: {x: 0.0000000027492622, y: -2.0804651e-11, z: 0.023052692, w: -0.00023317292}
        tangentMode: 0
        weightedMode: 0
        inWeight: {x: 0.33333334, y: 0.33333334, z: 0.33333334, w: 0.33333334}
        outWeight: {x: 0.33333334, y: 0.33333334, z: 0.33333334, w: 0.33333334}
      m_PreInfinity: 2
      m_PostInfinity: 2
      m_RotationOrder: 4
    path: Pohon Tinggi-Arm-01/Bone/Bone.001/Bone.002
  m_CompressedRotationCurves: []
  m_EulerCurves: []
  m_PositionCurves: []
  m_ScaleCurves: []
  m_FloatCurves: []
  m_PPtrCurves: []
  m_SampleRate: 24
  m_WrapMode: 0
  m_Bounds:
    m_Center: {x: 0, y: 0, z: 0}
    m_Extent: {x: 0, y: 0, z: 0}
  m_ClipBindingConstant:
    genericBindings: []
    pptrCurveMapping: []
  m_AnimationClipSettings:
    serializedVersion: 2
    m_AdditiveReferencePoseClip: {fileID: 0}
    m_AdditiveReferencePoseTime: 0
    m_StartTime: 0
    m_StopTime: 3.7083335
    m_OrientationOffsetY: 0
    m_Level: 0
    m_CycleOffset: 0
    m_HasAdditiveReferencePose: 0
    m_LoopTime: 0
    m_LoopBlend: 0
    m_LoopBlendOrientation: 0
    m_LoopBlendPositionY: 0
    m_LoopBlendPositionXZ: 0
    m_KeepOriginalOrientation: 0
    m_KeepOriginalPositionY: 1
    m_KeepOriginalPositionXZ: 0
    m_HeightFromFeet: 0
    m_Mirror: 0
  m_EditorCurves: []
  m_EulerEditorCurves: []
  m_HasGenericRootTransform: 0
  m_HasMotionFloatCurves: 0
  m_Events: []
