%YAML 1.1
%TAG !u! tag:unity3d.com,2011:
--- !u!114 &11400000
MonoBehaviour:
  m_ObjectHideFlags: 0
  m_CorrespondingSourceObject: {fileID: 0}
  m_PrefabInstance: {fileID: 0}
  m_PrefabAsset: {fileID: 0}
  m_GameObject: {fileID: 0}
  m_Enabled: 1
  m_EditorHideFlags: 0
  m_Script: {fileID: 11500000, guid: bb3561e59d69837499eeee2ed57e09fc, type: 3}
  m_Name: Gamepad
  m_EditorClassIdentifier: 
  group: Gamepad
  controlIcons:
  - path: Gamepad/buttonSouth
    icon: {fileID: -2627676819740313877, guid: c121ffe7dd2934d4d92d85822da466a0, type: 3}
    iconPressed: {fileID: 3906636962852134750, guid: c121ffe7dd2934d4d92d85822da466a0, type: 3}
    altName: A
  - path: Gamepad/buttonEast
    icon: {fileID: -1523482259957014988, guid: c121ffe7dd2934d4d92d85822da466a0, type: 3}
    iconPressed: {fileID: 6052423538095338196, guid: c121ffe7dd2934d4d92d85822da466a0, type: 3}
    altName: B
  - path: Gamepad/buttonWest
    icon: {fileID: -3363761509405604423, guid: c121ffe7dd2934d4d92d85822da466a0, type: 3}
    iconPressed: {fileID: 2730768796494623273, guid: c121ffe7dd2934d4d92d85822da466a0, type: 3}
    altName: X
  - path: Gamepad/buttonNorth
    icon: {fileID: -3391470166271242413, guid: c121ffe7dd2934d4d92d85822da466a0, type: 3}
    iconPressed: {fileID: 8722088001123580984, guid: c121ffe7dd2934d4d92d85822da466a0, type: 3}
    altName: Y
  - path: Gamepad/dpad/down
    icon: {fileID: 8660299473498865702, guid: c121ffe7dd2934d4d92d85822da466a0, type: 3}
    iconPressed: {fileID: -1781287635587027996, guid: c121ffe7dd2934d4d92d85822da466a0, type: 3}
    altName: DpadDown
  - path: Gamepad/DpadLeft
    icon: {fileID: 7398084924626729406, guid: c121ffe7dd2934d4d92d85822da466a0, type: 3}
    iconPressed: {fileID: 3293878454747754403, guid: c121ffe7dd2934d4d92d85822da466a0, type: 3}
    altName: DpadLeft
  - path: Gamepad/DpadRight
    icon: {fileID: -6966954280044269204, guid: c121ffe7dd2934d4d92d85822da466a0, type: 3}
    iconPressed: {fileID: 6530417081920696880, guid: c121ffe7dd2934d4d92d85822da466a0, type: 3}
    altName: DpadRight
  - path: Gamepad/dpad/up
    icon: {fileID: -4319072737542448054, guid: c121ffe7dd2934d4d92d85822da466a0, type: 3}
    iconPressed: {fileID: 3610158097919185140, guid: c121ffe7dd2934d4d92d85822da466a0, type: 3}
    altName: DpadUp
  - path: Gamepad/LSBDown
    icon: {fileID: -2442326211325334133, guid: c121ffe7dd2934d4d92d85822da466a0, type: 3}
    iconPressed: {fileID: -5112886920324628651, guid: c121ffe7dd2934d4d92d85822da466a0, type: 3}
    altName: LSBDown
  - path: Gamepad/LSBLeft
    icon: {fileID: -1218911791654107582, guid: c121ffe7dd2934d4d92d85822da466a0, type: 3}
    iconPressed: {fileID: 5790881921425968878, guid: c121ffe7dd2934d4d92d85822da466a0, type: 3}
    altName: LSBLeft
  - path: Gamepad/LSBRight
    icon: {fileID: 8917043710636649918, guid: c121ffe7dd2934d4d92d85822da466a0, type: 3}
    iconPressed: {fileID: -8903107469958840942, guid: c121ffe7dd2934d4d92d85822da466a0, type: 3}
    altName: LSBRight
  - path: Gamepad/LSBUp
    icon: {fileID: -3268969750879586969, guid: c121ffe7dd2934d4d92d85822da466a0, type: 3}
    iconPressed: {fileID: 512899873536091274, guid: c121ffe7dd2934d4d92d85822da466a0, type: 3}
    altName: LSBUp
  - path: Gamepad/Menu
    icon: {fileID: 3838318795275561306, guid: c121ffe7dd2934d4d92d85822da466a0, type: 3}
    iconPressed: {fileID: 5315753719361577901, guid: c121ffe7dd2934d4d92d85822da466a0, type: 3}
    altName: Menu
  - path: Gamepad/select
    icon: {fileID: 3838318795275561306, guid: c121ffe7dd2934d4d92d85822da466a0, type: 3}
    iconPressed: {fileID: 5315753719361577901, guid: c121ffe7dd2934d4d92d85822da466a0, type: 3}
    altName: select
  - path: Gamepad/leftShoulder
    icon: {fileID: 2910978413928057670, guid: c121ffe7dd2934d4d92d85822da466a0, type: 3}
    iconPressed: {fileID: 8195371512297915582, guid: c121ffe7dd2934d4d92d85822da466a0, type: 3}
    altName: LB
  - path: Gamepad/rightShoulder
    icon: {fileID: -6426865204967649699, guid: c121ffe7dd2934d4d92d85822da466a0, type: 3}
    iconPressed: {fileID: 4181493172670571550, guid: c121ffe7dd2934d4d92d85822da466a0, type: 3}
    altName: RB
