{
"skeleton": { "hash": "xbb+WRwU8f58b9ND0Q0H9/W7tig", "spine": "3.8.95" },
"bones": [
	{ "name": "root" },
	{ "name": "dirt", "parent": "root" },
	{ "name": "smoke", "parent": "root", "x": 156.54, "y": 447.62 },
	{ "name": "gun-hitted", "parent": "root" },
	{ "name": "glow1", "parent": "root" },
	{ "name": "kotor", "parent": "root" },
	{ "name": "kotor2", "parent": "root" },
	{ "name": "explosion", "parent": "root" }
],
"slots": [
	{ "name": "dirt", "bone": "dirt" },
	{ "name": "gun-hitted", "bone": "gun-hitted" },
	{ "name": "smoke", "bone": "smoke" },
	{ "name": "glow1", "bone": "glow1", "blend": "screen" },
	{ "name": "kotor", "bone": "kotor" },
	{ "name": "kotor2", "bone": "kotor2" },
	{ "name": "explosion", "bone": "explosion" }
],
"skins": [
	{
		"name": "default",
		"attachments": {
			"dirt": {
				"asset/vfx/gun-dirt-vfx": { "x": -19.82, "y": 338.45, "width": 222, "height": 680 },
				"asset/vfx/gun-dirt-vfx2": { "y": 373.24, "width": 190, "height": 745 }
			},
			"explosion": {
				"asset/vfx2/cannon-vfx_00000": { "width": 640, "height": 836 },
				"asset/vfx2/cannon-vfx_00001": { "width": 640, "height": 836 },
				"asset/vfx2/cannon-vfx_00002": { "width": 640, "height": 836 },
				"asset/vfx2/cannon-vfx_00003": { "width": 640, "height": 836 },
				"asset/vfx2/cannon-vfx_00004": { "width": 640, "height": 836 },
				"asset/vfx2/cannon-vfx_00005": { "width": 640, "height": 836 },
				"asset/vfx2/cannon-vfx_00006": { "width": 640, "height": 836 }
			},
			"glow1": {
				"asset/vfx/vfx-lingkar-2": { "width": 200, "height": 200 }
			},
			"gun-hitted": {
				"asset/vfx2/gun-hitted_00000": { "x": 0.5, "y": 0.5, "width": 515, "height": 515 },
				"asset/vfx2/gun-hitted_00001": { "x": 0.5, "y": 0.5, "width": 515, "height": 515 },
				"asset/vfx2/gun-hitted_00002": { "x": 0.5, "y": 0.5, "width": 515, "height": 515 },
				"asset/vfx2/gun-hitted_00003": { "x": 0.5, "y": 0.5, "width": 515, "height": 515 }
			},
			"kotor": {
				"asset/vfx/dirt": { "x": 0.5, "width": 251, "height": 244 }
			},
			"kotor2": {
				"asset/vfx/dirt": { "x": 0.5, "width": 251, "height": 244 }
			},
			"smoke": {
				"asset/vfx2/smoke_00000": { "x": 0.5, "y": 0.5, "width": 779, "height": 919 },
				"asset/vfx2/smoke_00001": { "x": 0.5, "y": 0.5, "width": 779, "height": 919 },
				"asset/vfx2/smoke_00002": { "x": 0.5, "y": 0.5, "width": 779, "height": 919 },
				"asset/vfx2/smoke_00003": { "x": 0.5, "y": 0.5, "width": 779, "height": 919 },
				"asset/vfx2/smoke_00004": { "x": 0.5, "y": 0.5, "width": 779, "height": 919 }
			}
		}
	}
],
"animations": {
	"explosion-ch2-canon": {
		"slots": {
			"dirt": {
				"color": [
					{ "color": "ffffffff" },
					{ "time": 0.2667, "color": "bebebeff" },
					{ "time": 0.7333, "color": "bebebe00" }
				],
				"attachment": [
					{ "name": "asset/vfx/gun-dirt-vfx" }
				]
			},
			"explosion": {
				"color": [
					{ "time": 0.6667, "color": "ffffffff" },
					{ "time": 0.9667, "color": "00000000" }
				],
				"attachment": [
					{ "name": "asset/vfx2/cannon-vfx_00000" },
					{ "time": 0.0667, "name": "asset/vfx2/cannon-vfx_00001" },
					{ "time": 0.1333, "name": "asset/vfx2/cannon-vfx_00002" },
					{ "time": 0.2333, "name": "asset/vfx2/cannon-vfx_00003" },
					{ "time": 0.4333, "name": "asset/vfx2/cannon-vfx_00004" },
					{ "time": 0.6, "name": "asset/vfx2/cannon-vfx_00005" },
					{ "time": 0.7667, "name": "asset/vfx2/cannon-vfx_00006" },
					{ "time": 0.9667, "name": null }
				]
			},
			"glow1": {
				"color": [
					{ "color": "f64900ff", "curve": "stepped" },
					{ "time": 0.5333, "color": "f64900ff" },
					{ "time": 0.9667, "color": "f6480000" }
				],
				"attachment": [
					{ "name": "asset/vfx/vfx-lingkar-2" }
				]
			},
			"kotor": {
				"color": [
					{ "color": "7a7a7aff", "curve": "stepped" },
					{ "time": 0.3, "color": "7a7a7aff" },
					{ "time": 0.6333, "color": "7a7a7a00" }
				],
				"attachment": [
					{ "name": "asset/vfx/dirt" }
				]
			},
			"kotor2": {
				"color": [
					{ "color": "6c6c6cff", "curve": "stepped" },
					{ "time": 0.2667, "color": "6c6c6cff" },
					{ "time": 0.5333, "color": "6c6c6c00" }
				],
				"attachment": [
					{ "name": "asset/vfx/dirt" }
				]
			},
			"smoke": {
				"color": [
					{ "color": "ffffff00", "curve": "stepped" },
					{ "time": 0.1667, "color": "ffffff00" },
					{ "time": 0.3333, "color": "ffffffff", "curve": "stepped" },
					{ "time": 1.2, "color": "ffffffff" },
					{ "time": 1.3667, "color": "ffffff00" }
				],
				"attachment": [
					{ "name": "asset/vfx2/smoke_00000" },
					{ "time": 0.1333, "name": "asset/vfx2/smoke_00001" },
					{ "time": 0.3, "name": "asset/vfx2/smoke_00002" },
					{ "time": 0.4667, "name": "asset/vfx2/smoke_00003" },
					{ "time": 0.6, "name": "asset/vfx2/smoke_00004" },
					{ "time": 0.7667, "name": "asset/vfx2/smoke_00000" },
					{ "time": 0.9, "name": "asset/vfx2/smoke_00001" },
					{ "time": 1.0333, "name": "asset/vfx2/smoke_00002" },
					{ "time": 1.1667, "name": "asset/vfx2/smoke_00003" },
					{ "time": 1.3, "name": "asset/vfx2/smoke_00004" }
				]
			}
		},
		"bones": {
			"explosion": {
				"translate": [
					{ "y": 399.36, "curve": 0.189, "c2": 0.79, "c3": 0.75 },
					{ "time": 0.9667, "y": 585.73 }
				],
				"scale": [
					{ "x": 1.333, "y": 1.333, "curve": 0.189, "c2": 0.79, "c3": 0.75 },
					{ "time": 0.9667, "x": 1.811, "y": 1.811 }
				]
			},
			"glow1": {
				"translate": [
					{ "y": 156.42, "curve": 0.233, "c2": 0.91, "c3": 0.652 },
					{ "time": 0.7667, "y": 495.87 }
				],
				"scale": [
					{ "x": 3.35, "y": 3.424, "curve": 0.233, "c2": 0.91, "c3": 0.652 },
					{ "time": 0.7667, "x": 7.14, "y": 5.361 }
				]
			},
			"smoke": {
				"translate": [
					{ "curve": 0.088, "c2": 0.39, "c3": 0.75 },
					{ "time": 1.2667, "y": 133.02 }
				],
				"scale": [
					{ "x": 1.236, "curve": 0.088, "c2": 0.39, "c3": 0.75 },
					{ "time": 1.2667, "x": 1.273, "y": 1.266 }
				]
			},
			"kotor": {
				"rotate": [
					{ "curve": 0.128, "c2": 0.79, "c3": 0.557 },
					{ "time": 0.4333, "angle": 10.34 }
				],
				"translate": [
					{ "x": -25.14, "y": 131.96, "curve": 0.128, "c2": 0.79, "c3": 0.557 },
					{ "time": 0.4333, "x": -118.66, "y": 402.94 }
				],
				"scale": [
					{ "x": 1.6, "y": 1.6, "curve": 0.128, "c2": 0.79, "c3": 0.557 },
					{ "time": 0.4333, "x": 1.6, "y": 2.405 }
				]
			},
			"kotor2": {
				"rotate": [
					{ "curve": 0.236, "c2": 0.89, "c3": 0.706 },
					{ "time": 0.3667, "angle": -31.42 }
				],
				"translate": [
					{ "x": 38.37, "y": 280.57, "curve": 0.236, "c2": 0.89, "c3": 0.706 },
					{ "time": 0.3667, "x": 86.33, "y": 779.68 }
				],
				"scale": [
					{ "x": -1.476, "y": 1.476, "curve": 0.236, "c2": 0.89, "c3": 0.706 },
					{ "time": 0.3667, "x": -1.972, "y": 2.143 }
				]
			},
			"dirt": {
				"translate": [
					{ "x": 27.2 }
				],
				"scale": [
					{ "x": 2.504, "y": 0.725, "curve": 0.244, "c2": 0.82, "c3": 0.644 },
					{ "time": 0.3333, "x": 3.576, "y": 1.901 }
				]
			}
		},
		"drawOrder": [
			{
				"offsets": [
					{ "slot": "gun-hitted", "offset": 2 },
					{ "slot": "explosion", "offset": -4 }
				]
			},
			{
				"time": 0.7667,
				"offsets": [
					{ "slot": "smoke", "offset": -2 },
					{ "slot": "explosion", "offset": -4 }
				]
			}
		]
	},
	"gun-dirt": {
		"slots": {
			"dirt": {
				"color": [
					{ "time": 0.1333, "color": "ffffffff" },
					{ "time": 0.2, "color": "ffffff00", "curve": "stepped" },
					{ "time": 0.2333, "color": "ffffffff", "curve": "stepped" },
					{ "time": 0.3333, "color": "ffffffff" },
					{ "time": 0.4, "color": "ffffff00" }
				],
				"attachment": [
					{ "name": "asset/vfx/gun-dirt-vfx" },
					{ "time": 0.2, "name": "asset/vfx/gun-dirt-vfx2" },
					{ "time": 0.3667, "name": "asset/vfx/gun-dirt-vfx" }
				]
			},
			"glow1": {
				"color": [
					{ "color": "632607ff" }
				],
				"attachment": [
					{ "name": "asset/vfx/vfx-lingkar-2" }
				]
			}
		},
		"bones": {
			"dirt": {
				"scale": [
					{ "x": 0.816, "y": 0.816, "curve": 0.244, "c2": 0.82, "c3": 0.644 },
					{ "time": 0.1667, "x": 1.411, "y": 1.593, "curve": "stepped" },
					{ "time": 0.2, "x": 0.816, "y": 0.816, "curve": 0.244, "c2": 0.82, "c3": 0.644 },
					{ "time": 0.3667, "x": 1.411, "y": 1.593, "curve": "stepped" },
					{ "time": 0.4, "x": 0.816, "y": 0.816 }
				]
			},
			"glow1": {
				"scale": [
					{ "x": 1.139, "y": 1.893, "curve": 0.26, "c2": 0.77, "c3": 0.591, "c4": 0.98 },
					{ "time": 0.1333, "x": 2.745, "y": 4.562, "curve": "stepped" },
					{ "time": 0.2333, "x": 1.139, "y": 1.893, "curve": 0.236, "c2": 0.89, "c3": 0.75 },
					{ "time": 0.4, "x": 2.745, "y": 4.562 }
				]
			}
		}
	},
	"gun-hitted": {
		"slots": {
			"glow1": {
				"color": [
					{ "color": "ffe117af" },
					{ "time": 0.1, "color": "c1b000af" },
					{ "time": 0.2333, "color": "c1b00000" }
				],
				"attachment": [
					{ "name": "asset/vfx/vfx-lingkar-2" }
				]
			},
			"gun-hitted": {
				"attachment": [
					{ "name": "asset/vfx2/gun-hitted_00000" },
					{ "time": 0.0667, "name": "asset/vfx2/gun-hitted_00001" },
					{ "time": 0.1333, "name": "asset/vfx2/gun-hitted_00002" },
					{ "time": 0.2, "name": "asset/vfx2/gun-hitted_00003" },
					{ "time": 0.2667, "name": "asset/vfx2/gun-hitted_00003" }
				]
			}
		},
		"bones": {
			"glow1": {
				"translate": [
					{ "x": -6.38, "y": -15.95 }
				],
				"scale": [
					{ "x": 1.713, "y": 1.713, "curve": 0.223, "c2": 0.86, "c3": 0.618 },
					{ "time": 0.1667, "x": 3.004, "y": 3.004 }
				]
			}
		}
	},
	"missile-ch2-dirt": {
		"slots": {
			"dirt": {
				"color": [
					{ "color": "ffffffff" },
					{ "time": 0.2667, "color": "bebebeff" },
					{ "time": 0.7333, "color": "bebebe00" }
				],
				"attachment": [
					{ "name": "asset/vfx/gun-dirt-vfx" }
				]
			},
			"glow1": {
				"color": [
					{ "color": "632607ff" }
				],
				"attachment": [
					{ "name": "asset/vfx/vfx-lingkar-2" }
				]
			},
			"kotor": {
				"color": [
					{ "color": "7a7a7aff", "curve": "stepped" },
					{ "time": 0.3, "color": "7a7a7aff" },
					{ "time": 0.6333, "color": "7a7a7a00" }
				],
				"attachment": [
					{ "name": "asset/vfx/dirt" }
				]
			},
			"kotor2": {
				"color": [
					{ "color": "6c6c6cff", "curve": "stepped" },
					{ "time": 0.2667, "color": "6c6c6cff" },
					{ "time": 0.5333, "color": "6c6c6c00" }
				],
				"attachment": [
					{ "name": "asset/vfx/dirt" }
				]
			}
		},
		"bones": {
			"dirt": {
				"translate": [
					{ "x": 27.2 }
				],
				"scale": [
					{ "x": 5.417, "y": 1.568, "curve": 0.244, "c2": 0.82, "c3": 0.644 },
					{ "time": 0.3333, "x": 4.248, "y": 2.926 }
				]
			},
			"glow1": {
				"scale": [
					{ "x": 1.139, "y": 1.893 }
				]
			},
			"kotor": {
				"rotate": [
					{ "curve": 0.128, "c2": 0.79, "c3": 0.557 },
					{ "time": 0.4333, "angle": 10.34 }
				],
				"translate": [
					{ "x": -25.14, "y": 131.96, "curve": 0.128, "c2": 0.79, "c3": 0.557 },
					{ "time": 0.4333, "x": -118.66, "y": 402.94 }
				],
				"scale": [
					{ "x": 1.6, "y": 1.6, "curve": 0.128, "c2": 0.79, "c3": 0.557 },
					{ "time": 0.4333, "x": 1.6, "y": 2.405 }
				]
			},
			"kotor2": {
				"rotate": [
					{ "curve": 0.236, "c2": 0.89, "c3": 0.706 },
					{ "time": 0.3667, "angle": -31.42 }
				],
				"translate": [
					{ "x": 38.37, "y": 280.57, "curve": 0.236, "c2": 0.89, "c3": 0.706 },
					{ "time": 0.3667, "x": 86.33, "y": 779.68 }
				],
				"scale": [
					{ "x": -1.476, "y": 1.476, "curve": 0.236, "c2": 0.89, "c3": 0.706 },
					{ "time": 0.3667, "x": -1.972, "y": 2.143 }
				]
			}
		}
	},
	"missile-dead": {
		"slots": {
			"explosion": {
				"color": [
					{ "time": 0.6667, "color": "ffffffff" },
					{ "time": 0.9667, "color": "00000000" }
				],
				"attachment": [
					{ "name": "asset/vfx2/cannon-vfx_00000" },
					{ "time": 0.0667, "name": "asset/vfx2/cannon-vfx_00001" },
					{ "time": 0.1333, "name": "asset/vfx2/cannon-vfx_00002" },
					{ "time": 0.2333, "name": "asset/vfx2/cannon-vfx_00003" },
					{ "time": 0.4333, "name": "asset/vfx2/cannon-vfx_00004" },
					{ "time": 0.6, "name": "asset/vfx2/cannon-vfx_00005" },
					{ "time": 0.7667, "name": "asset/vfx2/cannon-vfx_00006" },
					{ "time": 0.9667, "name": null }
				]
			},
			"glow1": {
				"color": [
					{ "color": "f64900ff", "curve": "stepped" },
					{ "time": 0.5333, "color": "f64900ff" },
					{ "time": 0.9667, "color": "f6480000" }
				],
				"attachment": [
					{ "name": "asset/vfx/vfx-lingkar-2" }
				]
			},
			"kotor": {
				"color": [
					{ "color": "7a7a7aff", "curve": "stepped" },
					{ "time": 0.3, "color": "7a7a7aff" },
					{ "time": 0.6333, "color": "7a7a7a00" }
				],
				"attachment": [
					{ "name": "asset/vfx/dirt" }
				]
			},
			"kotor2": {
				"color": [
					{ "color": "6c6c6cff", "curve": "stepped" },
					{ "time": 0.2667, "color": "6c6c6cff" },
					{ "time": 0.5333, "color": "6c6c6c00" }
				],
				"attachment": [
					{ "name": "asset/vfx/dirt" }
				]
			},
			"smoke": {
				"color": [
					{ "color": "ffffff00" }
				]
			}
		},
		"bones": {
			"explosion": {
				"translate": [
					{ "y": 399.36, "curve": 0.189, "c2": 0.79, "c3": 0.75 },
					{ "time": 0.9667, "y": 408.04 }
				],
				"scale": [
					{ "x": 1.333, "y": 1.333, "curve": 0.189, "c2": 0.79, "c3": 0.75 },
					{ "time": 0.9667, "x": 1.811, "y": 1.811 }
				]
			},
			"glow1": {
				"translate": [
					{ "y": 156.42, "curve": 0.233, "c2": 0.91, "c3": 0.652 },
					{ "time": 0.7667, "y": 495.87 }
				],
				"scale": [
					{ "x": 3.35, "y": 3.424, "curve": 0.233, "c2": 0.91, "c3": 0.652 },
					{ "time": 0.7667, "x": 7.14, "y": 5.361 }
				]
			},
			"smoke": {
				"scale": [
					{ "x": 1.236 }
				]
			},
			"kotor": {
				"rotate": [
					{ "curve": 0.128, "c2": 0.79, "c3": 0.557 },
					{ "time": 0.4333, "angle": 10.34 }
				],
				"translate": [
					{ "x": -25.14, "y": 131.96, "curve": 0.128, "c2": 0.79, "c3": 0.557 },
					{ "time": 0.4333, "x": -118.66, "y": 402.94 }
				],
				"scale": [
					{ "x": 1.6, "y": 1.6, "curve": 0.128, "c2": 0.79, "c3": 0.557 },
					{ "time": 0.4333, "x": 1.6, "y": 2.405 }
				]
			},
			"kotor2": {
				"rotate": [
					{ "curve": 0.236, "c2": 0.89, "c3": 0.706 },
					{ "time": 0.3667, "angle": -31.42 }
				],
				"translate": [
					{ "x": 38.37, "y": 280.57, "curve": 0.236, "c2": 0.89, "c3": 0.706 },
					{ "time": 0.3667, "x": 158.09, "y": 373.06 }
				],
				"scale": [
					{ "x": -1.476, "y": 1.476, "curve": 0.236, "c2": 0.89, "c3": 0.706 },
					{ "time": 0.3667, "x": -1.972, "y": 2.143 }
				]
			},
			"dirt": {
				"translate": [
					{ "x": 27.2 }
				],
				"scale": [
					{ "x": 2.504, "y": 0.725 }
				]
			}
		},
		"drawOrder": [
			{
				"offsets": [
					{ "slot": "gun-hitted", "offset": 2 },
					{ "slot": "explosion", "offset": -4 }
				]
			}
		]
	},
	"smoke": {
		"slots": {
			"smoke": {
				"color": [
					{ "time": 1.3, "color": "ffffffff" },
					{ "time": 2, "color": "ffffff00" }
				],
				"attachment": [
					{ "name": "asset/vfx2/smoke_00000" },
					{ "time": 0.1333, "name": "asset/vfx2/smoke_00001" },
					{ "time": 0.3, "name": "asset/vfx2/smoke_00002" },
					{ "time": 0.4333, "name": "asset/vfx2/smoke_00003" },
					{ "time": 0.5667, "name": "asset/vfx2/smoke_00004" },
					{ "time": 0.7, "name": "asset/vfx2/smoke_00000" },
					{ "time": 0.8667, "name": "asset/vfx2/smoke_00001" },
					{ "time": 1, "name": "asset/vfx2/smoke_00002" },
					{ "time": 1.1333, "name": "asset/vfx2/smoke_00003" },
					{ "time": 1.3, "name": "asset/vfx2/smoke_00004" },
					{ "time": 1.4333, "name": "asset/vfx2/smoke_00000" },
					{ "time": 1.5667, "name": "asset/vfx2/smoke_00001" },
					{ "time": 1.7, "name": "asset/vfx2/smoke_00002" },
					{ "time": 1.8667, "name": "asset/vfx2/smoke_00003" },
					{ "time": 2, "name": "asset/vfx2/smoke_00004" }
				]
			}
		},
		"bones": {
			"smoke": {
				"translate": [
					{ "curve": 0.223, "c2": 0.88, "c3": 0.494 },
					{ "time": 2, "x": 12.02, "y": 55 }
				],
				"scale": [
					{ "curve": 0.17, "c2": 0.46, "c3": 0.458 },
					{ "time": 2, "x": 1.136, "y": 1.136 }
				]
			}
		}
	}
}
}