%YAML 1.1
%TAG !u! tag:unity3d.com,2011:
--- !u!74 &7400000
AnimationClip:
  m_ObjectHideFlags: 0
  m_CorrespondingSourceObject: {fileID: 0}
  m_PrefabInstance: {fileID: 0}
  m_PrefabAsset: {fileID: 0}
  m_Name: diagonal back run right
  serializedVersion: 6
  m_Legacy: 0
  m_Compressed: 0
  m_UseHighQualityCurve: 1
  m_RotationCurves: []
  m_CompressedRotationCurves: []
  m_EulerCurves: []
  m_PositionCurves: []
  m_ScaleCurves: []
  m_FloatCurves: []
  m_PPtrCurves:
  - curve:
    - time: 0
      value: {fileID: 135404875, guid: 1584d814964c3634db1ff938dae56912, type: 3}
    - time: 0.06666667
      value: {fileID: -2053902376, guid: 1584d814964c3634db1ff938dae56912, type: 3}
    - time: 0.13333334
      value: {fileID: 821256132, guid: 1584d814964c3634db1ff938dae56912, type: 3}
    - time: 0.21666667
      value: {fileID: 1715637914, guid: 1584d814964c3634db1ff938dae56912, type: 3}
    - time: 0.28333333
      value: {fileID: -275738804, guid: 1584d814964c3634db1ff938dae56912, type: 3}
    - time: 0.35
      value: {fileID: 1661990526, guid: 1584d814964c3634db1ff938dae56912, type: 3}
    - time: 0.41666666
      value: {fileID: -1512788024, guid: 1584d814964c3634db1ff938dae56912, type: 3}
    - time: 0.48333332
      value: {fileID: -264395523, guid: 1584d814964c3634db1ff938dae56912, type: 3}
    - time: 0.56666666
      value: {fileID: 1687529615, guid: 1584d814964c3634db1ff938dae56912, type: 3}
    - time: 0.6333333
      value: {fileID: -72862028, guid: 1584d814964c3634db1ff938dae56912, type: 3}
    - time: 0.7
      value: {fileID: 2087271748, guid: 1584d814964c3634db1ff938dae56912, type: 3}
    - time: 0.76666665
      value: {fileID: -1777048176, guid: 1584d814964c3634db1ff938dae56912, type: 3}
    - time: 0.85
      value: {fileID: 1215088508, guid: 1584d814964c3634db1ff938dae56912, type: 3}
    - time: 0.9166667
      value: {fileID: 1465593665, guid: 1584d814964c3634db1ff938dae56912, type: 3}
    - time: 0.98333335
      value: {fileID: 2016944789, guid: 1584d814964c3634db1ff938dae56912, type: 3}
    attribute: m_Sprite
    path: 
    classID: 212
    script: {fileID: 0}
  m_SampleRate: 60
  m_WrapMode: 0
  m_Bounds:
    m_Center: {x: 0, y: 0, z: 0}
    m_Extent: {x: 0, y: 0, z: 0}
  m_ClipBindingConstant:
    genericBindings:
    - serializedVersion: 2
      path: 0
      attribute: 0
      script: {fileID: 0}
      typeID: 212
      customType: 23
      isPPtrCurve: 1
    pptrCurveMapping:
    - {fileID: 135404875, guid: 1584d814964c3634db1ff938dae56912, type: 3}
    - {fileID: -2053902376, guid: 1584d814964c3634db1ff938dae56912, type: 3}
    - {fileID: 821256132, guid: 1584d814964c3634db1ff938dae56912, type: 3}
    - {fileID: 1715637914, guid: 1584d814964c3634db1ff938dae56912, type: 3}
    - {fileID: -275738804, guid: 1584d814964c3634db1ff938dae56912, type: 3}
    - {fileID: 1661990526, guid: 1584d814964c3634db1ff938dae56912, type: 3}
    - {fileID: -1512788024, guid: 1584d814964c3634db1ff938dae56912, type: 3}
    - {fileID: -264395523, guid: 1584d814964c3634db1ff938dae56912, type: 3}
    - {fileID: 1687529615, guid: 1584d814964c3634db1ff938dae56912, type: 3}
    - {fileID: -72862028, guid: 1584d814964c3634db1ff938dae56912, type: 3}
    - {fileID: 2087271748, guid: 1584d814964c3634db1ff938dae56912, type: 3}
    - {fileID: -1777048176, guid: 1584d814964c3634db1ff938dae56912, type: 3}
    - {fileID: 1215088508, guid: 1584d814964c3634db1ff938dae56912, type: 3}
    - {fileID: 1465593665, guid: 1584d814964c3634db1ff938dae56912, type: 3}
    - {fileID: 2016944789, guid: 1584d814964c3634db1ff938dae56912, type: 3}
  m_AnimationClipSettings:
    serializedVersion: 2
    m_AdditiveReferencePoseClip: {fileID: 0}
    m_AdditiveReferencePoseTime: 0
    m_StartTime: 0
    m_StopTime: 1
    m_OrientationOffsetY: 0
    m_Level: 0
    m_CycleOffset: 0
    m_HasAdditiveReferencePose: 0
    m_LoopTime: 1
    m_LoopBlend: 0
    m_LoopBlendOrientation: 0
    m_LoopBlendPositionY: 0
    m_LoopBlendPositionXZ: 0
    m_KeepOriginalOrientation: 0
    m_KeepOriginalPositionY: 1
    m_KeepOriginalPositionXZ: 0
    m_HeightFromFeet: 0
    m_Mirror: 0
  m_EditorCurves: []
  m_EulerEditorCurves: []
  m_HasGenericRootTransform: 0
  m_HasMotionFloatCurves: 0
  m_Events: []
