{
  "project_info": {
    "project_number": "10067610951",
    "project_id": "fitness-335305",
    "storage_bucket": "fitness-335305.appspot.com"
  },
  "client": [
    {
      "client_info": {
        "mobilesdk_app_id": "1:10067610951:android:9f80cf9dd2dd6caf609062",
        "android_client_info": {
          "package_name": "com.onebody.fitness"
        }
      },
      "oauth_client": [
        {
          "client_id": "10067610951-e3kqojhsm301gabf56i8ql78gir7p317.apps.googleusercontent.com",
          "client_type": 1,
          "android_info": {
            "package_name": "com.onebody.fitness",
            "certificate_hash": "2d955fc2b6610f134f72d971b783e80821d253bf"
          }
        },
        {
          "client_id": "10067610951-l04lkvjs0edu2c4p4q4bc354liq05vlv.apps.googleusercontent.com",
          "client_type": 1,
          "android_info": {
            "package_name": "com.onebody.fitness",
            "certificate_hash": "9e6c12cc1d8d2db9925f284ec2aaf512f6a0dab3"
          }
        },
        {
          "client_id": "10067610951-1ku9vf20qnmj8c67j8170jhv1g4vq437.apps.googleusercontent.com",
          "client_type": 3
        }
      ],
      "api_key": [
        {
          "current_key": "AIzaSyBw1bbNRxJbW9ESlxrYWESaItL35a5CGBc"
        }
      ],
      "services": {
        "appinvite_service": {
          "other_platform_oauth_client": [
            {
              "client_id": "10067610951-1ku9vf20qnmj8c67j8170jhv1g4vq437.apps.googleusercontent.com",
              "client_type": 3
            },
            {
              "client_id": "10067610951-2ft5ed7n8aothdkf2g4pkqjv2iuv3gbl.apps.googleusercontent.com",
              "client_type": 2,
              "ios_info": {
                "bundle_id": "com.OneBodyFitness"
              }
            }
          ]
        }
      }
    }
  ],
  "configuration_version": "1"
}