<?xml version="1.0" encoding="UTF-8"?>
<svg width="15px" height="10px" viewBox="0 0 15 10" version="1.1" xmlns="http://www.w3.org/2000/svg" xmlns:xlink="http://www.w3.org/1999/xlink">
    <!-- Generator: Sketch 57.1 (83088) - https://sketch.com -->
    <title>Triangle Copy</title>
    <desc>Created with Sketch.</desc>
    <g id="Ingresar-[App-móvil]" stroke="none" stroke-width="1" fill="none" fill-rule="evenodd">
        <g id="5.0-Home" transform="translate(-205.000000, -243.000000)" fill="#6DD400">
            <polygon id="Triangle-Copy" points="212.5 243 220 253 205 253"></polygon>
        </g>
    </g>
</svg>