[{
	"id": "1ecf4eb5-32b8-4083-9e8a-26ca23c29e0e",
	"member_id": "ad23273b-99e3-4ac6-b009-95260733e291",
	"email": "adoel.cs@gmail.com",
	"mobile_number_country_code": "+62",
	"mobile_number": "81296877814",
	"verification_token": "njSBdWep-eb0318d8396a38dfcf685ff2c2833144-dWVrtOYu",
	"status_id": 3,
	"created_by": null,
	"updated_by": null,
	"deleted_by": null,
	"created_at": "2019-06-27 07:21:14",
	"updated_at": "2019-06-27 07:27:26",
	"deleted_at": null,
	"self": {
		"url": "account-management/user/1ecf4eb5-32b8-4083-9e8a-26ca23c29e0e",
		"rel": []
	}
}]

