{
  "builders": [
    {
      "boot_wait": "40s",
      "boot_command": [
        "echo http://{{ .HTTPIP }}:{{ .HTTPPort}} > .packer_http<enter>",
        "mkdir -m 0700 .ssh<enter>",
        "curl $(cat .packer_http)/install_rsa.pub > .ssh/authorized_keys<enter>",
        "systemctl start sshd<enter>"
      ],
      "http_directory": "scripts",
      "iso_checksum_type": "sha256",
      "shutdown_command": "shutdown -h now",
      "ssh_private_key_file": "./scripts/install_rsa",
      "ssh_port": 22,
      "ssh_username": "root",
      "type": "virtualbox-iso",
      "iso_url": "https://d3g5gsiof5omrk.cloudfront.net/nixos/18.09/nixos-18.09.1799.b9fa31cea0e/nixos-minimal-18.09.1799.b9fa31cea0e-i686-linux.iso",
      "iso_checksum": "5df2c4ba60609fcae0b464466c3b25389ee6c594188b4da9d439f3d1a1c6fa95",
      "guest_additions_mode": "disable",
      "guest_os_type": "Linux",
      "vboxmanage": [
        [
          "modifyvm",
          "{{.Name}}",
          "--memory",
          "1024"
        ]
      ]
    },
    {
      "boot_wait": "40s",
      "boot_command": [
        "echo http://{{ .HTTPIP }}:{{ .HTTPPort}} > .packer_http<enter>",
        "mkdir -m 0700 .ssh<enter>",
        "curl $(cat .packer_http)/install_rsa.pub > .ssh/authorized_keys<enter>",
        "systemctl start sshd<enter>"
      ],
      "http_directory": "scripts",
      "iso_checksum_type": "sha256",
      "shutdown_command": "shutdown -h now",
      "ssh_private_key_file": "./scripts/install_rsa",
      "ssh_port": 22,
      "ssh_username": "root",
      "type": "qemu",
      "iso_url": "https://d3g5gsiof5omrk.cloudfront.net/nixos/18.09/nixos-18.09.1799.b9fa31cea0e/nixos-minimal-18.09.1799.b9fa31cea0e-i686-linux.iso",
      "iso_checksum": "5df2c4ba60609fcae0b464466c3b25389ee6c594188b4da9d439f3d1a1c6fa95",
      "disk_interface": "virtio-scsi",
      "qemuargs": [
        [
          "-m",
          "1024"
        ]
      ]
    },
    {
      "boot_wait": "40s",
      "boot_command": [
        "echo http://{{ .HTTPIP }}:{{ .HTTPPort}} > .packer_http<enter>",
        "mkdir -m 0700 .ssh<enter>",
        "curl $(cat .packer_http)/install_rsa.pub > .ssh/authorized_keys<enter>",
        "systemctl start sshd<enter>"
      ],
      "http_directory": "scripts",
      "iso_checksum_type": "sha256",
      "shutdown_command": "shutdown -h now",
      "ssh_private_key_file": "./scripts/install_rsa",
      "ssh_port": 22,
      "ssh_username": "root",
      "type": "vmware-iso",
      "iso_url": "https://d3g5gsiof5omrk.cloudfront.net/nixos/18.09/nixos-18.09.1799.b9fa31cea0e/nixos-minimal-18.09.1799.b9fa31cea0e-i686-linux.iso",
      "iso_checksum": "5df2c4ba60609fcae0b464466c3b25389ee6c594188b4da9d439f3d1a1c6fa95",
      "memory": 1024,
      "guest_os_type": "Linux"
    }
  ],
  "provisioners": [
    {
      "type": "shell",
      "script": "./scripts/install.sh"
    }
  ],
  "post-processors": [
    [
      {
        "type": "vagrant",
        "keep_input_artifact": false
      },
      {
        "type": "vagrant-cloud",
        "only": [
          "virtualbox-iso"
        ],
        "box_tag": "nixos/nixos-18.09-i686",
        "version": "18.09.1799-1"
      }
    ]
  ]
}
