{
    "build": {
        "dockerfile": "./Dockerfile",
        "context": "."
    },
    "features": {
        "ghcr.io/devcontainers/features/common-utils:2": {
            "installZsh": "true",
            "username": "vscode",
            "userUid": "1000",
            "userGid": "1000",
            "upgradePackages": "true"
        },
        "./local-features/git": {}
    },
    "runArgs": [
        "--cap-add=SYS_PTRACE",
        "--security-opt",
        "seccomp=unconfined"
    ],
    "customizations": {
        // Configure properties specific to VS Code.
        "vscode": {
            // Set *default* container specific settings.json values on container create.
            "settings": {
                "go.toolsManagement.checkForUpdates": "local",
                "go.useLanguageServer": true,
                "go.gopath": "/go"
            },
            // Add the IDs of extensions you want installed when the container is created.
            "extensions": [
                "golang.Go"
            ]
        }
    },
    "remoteUser": "vscode"
}