<svg width="176" height="32" viewBox="0 0 176 32" fill="none" xmlns="http://www.w3.org/2000/svg">
<path fill-rule="evenodd" clip-rule="evenodd" d="M0 16.0893C0 24.044 5.77733 30.6587 13.3333 32V20.444H9.33333V16H13.3333V12.444C13.3333 8.444 15.9107 6.22267 19.556 6.22267C20.7107 6.22267 21.956 6.4 23.1107 6.57733V10.6667H21.0667C19.1107 10.6667 18.6667 11.644 18.6667 12.8893V16H22.9333L22.2227 20.444H18.6667V32C26.2227 30.6587 32 24.0453 32 16.0893C32 7.24 24.8 0 16 0C7.2 0 0 7.24 0 16.0893Z" fill="#07A081"/>
<path d="M66.6717 15.7217L62.9283 13.975C62.6017 13.8233 62.3333 13.9933 62.3333 14.355V17.645C62.3333 18.0067 62.6017 18.1767 62.9283 18.025L66.67 16.2783C66.9983 16.125 66.9983 15.875 66.6717 15.7217ZM64 0C55.1633 0 48 7.16333 48 16C48 24.8367 55.1633 32 64 32C72.8367 32 80 24.8367 80 16C80 7.16333 72.8367 0 64 0ZM64 22.5C55.81 22.5 55.6667 21.7617 55.6667 16C55.6667 10.2383 55.81 9.5 64 9.5C72.19 9.5 72.3333 10.2383 72.3333 16C72.3333 21.7617 72.19 22.5 64 22.5Z" fill="#07A081"/>
<path d="M112 0C103.164 0 96 7.16429 96 16C96 24.8357 103.164 32 112 32C120.836 32 128 24.8357 128 16C128 7.16429 120.836 0 112 0ZM119.689 12.0607C119.7 12.2286 119.7 12.4036 119.7 12.575C119.7 17.8179 115.707 23.8571 108.411 23.8571C106.161 23.8571 104.075 23.2036 102.318 22.0786C102.639 22.1143 102.946 22.1286 103.275 22.1286C105.132 22.1286 106.839 21.5 108.2 20.4357C106.457 20.4 104.993 19.2571 104.493 17.6857C105.104 17.775 105.654 17.775 106.282 17.6143C105.385 17.432 104.578 16.9446 103.999 16.2349C103.421 15.5253 103.105 14.6372 103.107 13.7214V13.6714C103.632 13.9679 104.25 14.15 104.896 14.175C104.353 13.8128 103.907 13.3222 103.599 12.7465C103.291 12.1709 103.129 11.528 103.129 10.875C103.129 10.1357 103.321 9.46071 103.668 8.875C104.664 10.1012 105.907 11.1041 107.316 11.8184C108.725 12.5328 110.269 12.9427 111.846 13.0214C111.286 10.325 113.3 8.14286 115.721 8.14286C116.864 8.14286 117.893 8.62143 118.618 9.39286C119.514 9.225 120.371 8.88929 121.136 8.43929C120.839 9.35714 120.218 10.1321 119.393 10.6214C120.193 10.5357 120.964 10.3143 121.679 10.0036C121.139 10.7964 120.464 11.5 119.689 12.0607Z" fill="#07A081"/>
<path d="M159.996 10.6645C157.058 10.6645 154.66 13.0621 154.66 16C154.66 18.9379 157.058 21.3355 159.996 21.3355C162.934 21.3355 165.331 18.9379 165.331 16C165.331 13.0621 162.934 10.6645 159.996 10.6645ZM175.998 16C175.998 13.7905 176.018 11.6011 175.894 9.39566C175.77 6.83398 175.186 4.56048 173.312 2.68725C171.435 0.810019 169.166 0.229638 166.604 0.105556C164.395 -0.0185251 162.205 0.00148811 160 0.00148811C157.79 0.00148811 155.601 -0.0185251 153.395 0.105556C150.834 0.229638 148.56 0.814022 146.687 2.68725C144.81 4.56449 144.229 6.83398 144.105 9.39566C143.981 11.6051 144.001 13.7946 144.001 16C144.001 18.2054 143.981 20.3989 144.105 22.6043C144.229 25.166 144.814 27.4395 146.687 29.3127C148.564 31.19 150.834 31.7704 153.395 31.8944C155.605 32.0185 157.794 31.9985 160 31.9985C162.209 31.9985 164.399 32.0185 166.604 31.8944C169.166 31.7704 171.439 31.186 173.312 29.3127C175.19 27.4355 175.77 25.166 175.894 22.6043C176.022 20.3989 175.998 18.2095 175.998 16ZM159.996 24.2094C155.453 24.2094 151.786 20.543 151.786 16C151.786 11.457 155.453 7.79061 159.996 7.79061C164.539 7.79061 168.205 11.457 168.205 16C168.205 20.543 164.539 24.2094 159.996 24.2094ZM168.541 9.37164C167.481 9.37164 166.624 8.51508 166.624 7.45438C166.624 6.39369 167.481 5.53713 168.541 5.53713C169.602 5.53713 170.459 6.39369 170.459 7.45438C170.459 7.70625 170.41 7.95571 170.313 8.18846C170.217 8.42122 170.076 8.6327 169.898 8.8108C169.72 8.98889 169.508 9.13011 169.275 9.22635C169.043 9.32259 168.793 9.37196 168.541 9.37164Z" fill="#07A081"/>
</svg>
