<svg width="259" height="101" viewBox="0 0 259 101" fill="none" xmlns="http://www.w3.org/2000/svg">
<g filter="url(#filter0_b_9_53)">
<path d="M0 50.5C0 22.6096 22.6096 0 50.5 0H259V101H50.5C22.6096 101 0 78.3904 0 50.5Z" fill="url(#paint0_linear_9_53)" fill-opacity="0.4"/>
</g>
<defs>
<filter id="filter0_b_9_53" x="-12" y="-12" width="283" height="125" filterUnits="userSpaceOnUse" color-interpolation-filters="sRGB">
<feFlood flood-opacity="0" result="BackgroundImageFix"/>
<feGaussianBlur in="BackgroundImageFix" stdDeviation="6"/>
<feComposite in2="SourceAlpha" operator="in" result="effect1_backgroundBlur_9_53"/>
<feBlend mode="normal" in="SourceGraphic" in2="effect1_backgroundBlur_9_53" result="shape"/>
</filter>
<linearGradient id="paint0_linear_9_53" x1="17.6745" y1="24.7644" x2="264.878" y2="63.0277" gradientUnits="userSpaceOnUse">
<stop stop-color="#07A081"/>
<stop offset="1" stop-color="white" stop-opacity="0"/>
</linearGradient>
</defs>
</svg>
