{
	"Products": [
		{
			"Name": "FLUENTE",
			"Type": "Sofa",
			"ImageUrl": "https://product.hstatic.net/200000044142/product/ghe-sofa-beyours-fluente-sofa-90_11c9d63f01614b02a88cedd121280d9d_large.jpg",
			"BuyPrice": 1000,
			"PromotionPrice": 850,
			"Description": "LivingRoom"
			}, 
		{
			"Name": "MOONLIGHT SOFA GREY",
			"Type": "Sofa",
			"ImageUrl": "https://product.hstatic.net/200000044142/product/sofa-cong-poro-sofa-grey-0234_690515029a4e4a0ca47dae073794158d_grande.jpg",
			"BuyPrice": 900,
			"PromotionPrice": 750,
			"Description": "LivingRoom"
			}, 
		{
			"Name": "CRUSAD COFFEE TABLE",
			"Type": "Table",
			"ImageUrl": "https://product.hstatic.net/200000044142/product/ban-tra-crusad-table-01_f4495c8575004f47bb004c820ea4358a_large.png",
			"BuyPrice": 700,
			"PromotionPrice": 550,
			"Description": "LivingRoom"
			}, 
		{
			"Name": "CREG COFFEE TABLE",
			"Type": "Table",
			"ImageUrl": "https://product.hstatic.net/200000044142/product/ban-tra-caveg-table-02_cdbcbd6a4c734095b97a513fe1c7697f_large.jpg",
			"BuyPrice": 600,
			"PromotionPrice": 450,
			"Description": "LivingRoom"
			}, 
		{
			"Name": "KTV01 WHITE",
			"Type": "Tivi Table",
			"ImageUrl": "https://product.hstatic.net/200000044142/product/ktv01-2123_5bd3fc591cfb4c539dbcba54b4803e33_grande.jpg",
			"BuyPrice": 350,
			"PromotionPrice": 250,
			"Description": "LivingRoom"
			}, 
		{
			"Name": "KTV03 WHITE",
			"Type": "Tivi Table",
			"ImageUrl": "https://product.hstatic.net/200000044142/product/ktv03-21_7614fd40ec1c4eda85dbe3463ac941e5_grande.jpg",
			"BuyPrice": 400,
			"PromotionPrice": 280,
			"Description": "LivingRoom"
			},
		{
			"Name": "CRISTAL BED",
			"Type": "Bed",
			"ImageUrl": "https://product.hstatic.net/200000044142/product/giuong-ngu-cristal-01234_02aa2832899941bc9426a8678ef32c1a_large.jpg",
			"BuyPrice": 800,
			"PromotionPrice": 660,
			"Description": "BedRoom"
			},
		{
			"Name": "DREAM BED",
			"Type": "Bed",
			"ImageUrl": "https://product.hstatic.net/200000044142/product/giuong-ngu-dream-01_c3b90503c6224093ade1f47da4b839ee_large.jpg",
			"BuyPrice": 750,
			"PromotionPrice": 600,
			"Description": "BedRoom"
			},
		{
			"Name": "MINA CLOSET NATURAL WHITE",
			"Type": "Clother Deck",
			"ImageUrl": "https://product.hstatic.net/200000044142/product/mina_closet__361ead85b003483b89848c4de4f5dbdc_grande.png",
			"BuyPrice": 300,
			"PromotionPrice": 280,
			"Description": "BedRoom"
			},
		{
			"Name": "DOUBLE HANGER SIZE L BLACK",
			"Type": "Clother Deck",
			"ImageUrl": "https://product.hstatic.net/200000044142/product/gia-treo-quan-ao-double-hanger-l-den_13e132d7b4544b799b934d7d9eb254c6_grande.jpg",
			"BuyPrice": 100,
			"PromotionPrice": 80,
			"Description": "BedRoom"
			},
		{
			"Name": "DAMBI DRESSING TABLE WHITE",
			"Type": "Make Up Table",
			"ImageUrl": "https://product.hstatic.net/200000044142/product/ban-trang-diem-danbi-trang-01_7e7a63ca753c45798903adb60769215b_grande.jpg",
			"BuyPrice": 200,
			"PromotionPrice": 120,
			"Description": "BedRoom"
			},
		{
			"Name": "SHELF MIRROR BLACK",
			"Type": "Mirror",
			"ImageUrl": "https://product.hstatic.net/200000044142/product/guong-soi-toan-than-shelf-mirror-den_15e0148d0ac248c7b4654287640ee60d_grande.jpg",
			"BuyPrice": 400,
			"PromotionPrice": 280,
			"Description": "BedRoom"
			},
		{
			"Name": "BLV02 WHITE",
			"Type": "Table",
			"ImageUrl": "https://product.hstatic.net/200000044142/product/blv02_8b2570edf04a4bcca01b477ed7fa7ea7_grande.jpg",
			"BuyPrice": 300,
			"PromotionPrice": 250,
			"Description": "LoftRoom"
			},
		{
			"Name": "NEULY TABLE NATURAL BLACK",
			"Type": "Table",
			"ImageUrl": "https://product.hstatic.net/200000044142/product/ban-lam-viec-neuly-table-den-phoi-01_f5fd163057754106b2550d3e7d2d3064_grande.jpg",
			"BuyPrice": 320,
			"PromotionPrice": 280,
			"Description": "LoftRoom"
			},
		{
			"Name": "SHORT CHAIR BROWN",
			"Type": "Chair",
			"ImageUrl": "https://product.hstatic.net/200000044142/product/ghe-an-ghort-chair-1_291c29f544a14798ada8491c3f56e57a_grande.jpg",
			"BuyPrice": 150,
			"PromotionPrice": 80,
			"Description": "LoftRoom"
			},
		{
			"Name": "PIN STOOL NATURAL",
			"Type": "Chair",
			"ImageUrl": "https://product.hstatic.net/200000044142/product/ghe-pin-stool-go-01_d3b6b71da40246bbaa322e70e9574781_grande.jpg",
			"BuyPrice": 100,
			"PromotionPrice": 50,
			"Description": "LoftRoom"
			},
		{
			"Name": "KS01 NATURALK",
			"Type": "Book Deck",
			"ImageUrl": "https://product.hstatic.net/200000044142/product/ke-sach-ks01-017_307400639703417a951b3d6635579289_grande.jpg",
			"BuyPrice": 100,
			"PromotionPrice": 80,
			"Description": "LoftRoom"
			},
		{
			"Name": "KS02 BROWN",
			"Type": "Book Deck",
			"ImageUrl": "https://product.hstatic.net/200000044142/product/ks02-031_b12a2a4839ee474c91eaa59a01abc9da_grande.jpg",
			"BuyPrice": 150,
			"PromotionPrice": 110,
			"Description": "LoftRoom"
			},
		{
			"Name": "NARI DINNER TABLE SIZE M NATURAL",
			"Type": "Table",
			"ImageUrl": "https://product.hstatic.net/200000044142/product/bo-ban-an-nari-dinner-01_1f6e2c7dd4844231b69c40103e38b196_grande.jpg",
			"BuyPrice": 300,
			"PromotionPrice": 240,
			"Description": "Kitchen"
			},
		{
			"Name": "BE.HE DINNER BLACK",
			"Type": "Table",
			"ImageUrl": "https://product.hstatic.net/200000044142/product/ban-an-be.he-den-01_4a6ff7ffd9b049849dc431de92bd275f_grande.jpg",
			"BuyPrice": 440,
			"PromotionPrice": 380,
			"Description": "Kitchen"
			},
		{
			"Name": "OVEN RACK 3F BLACK",
			"Type": "Oven rack",
			"ImageUrl": "https://product.hstatic.net/200000044142/product/ke-lo-vi-song-3-tang-den_8393fc70392640f39e82d6f5f9ac76a0_grande.jpg",
			"BuyPrice": 100,
			"PromotionPrice": 50,
			"Description": "Kitchen"
			},
		{
			"Name": "OVEN RACK 2F NATURAL",
			"Type": "Oven rack",
			"ImageUrl": "https://product.hstatic.net/200000044142/product/ke-lo-vi-song-2-tang-go-tu-nhien_1535fcf9511245e082a1fd9d7372e7b8_grande.jpg",
			"BuyPrice": 80,
			"PromotionPrice": 40,
			"Description": "Kitchen"
			},
		{
			"Name": "MODY KITCHEN STORAGE RANGE STAND 02 NATURAL",
			"Type": "Storage",
			"ImageUrl": "https://product.hstatic.net/200000044142/product/tu-bep-dung-mody-kitchen-storage-range-stand-02_b11a2b5214514cda862c977c83a533e8_grande.jpg",
			"BuyPrice": 250,
			"PromotionPrice": 150,
			"Description": "Kitchen"
			},
		{
			"Name": "CUP SHELF NATURAL",
			"Type": "Cup",
			"ImageUrl": "https://product.hstatic.net/200000044142/product/ke-dung-gia-vi-cup-shelf-02_4bc2dee4afcc4523921e76ba0e6860de_grande.jpg",
			"BuyPrice": 30,
			"PromotionPrice": 15,
			"Description": "Kitchen"
			}
	]
}
