<svg width="39" height="30" viewBox="0 0 39 30" fill="none" xmlns="http://www.w3.org/2000/svg">
<path d="M4.1098 0.0082962L20.4995 2.01158L36.8912 0.0082962C37.1111 -0.0184707 37.3338 0.0236259 37.5291 0.128862C37.7243 0.234098 37.8827 0.397366 37.9826 0.596465L40.7748 6.2205C40.915 6.50467 40.9913 6.81641 40.9985 7.13363C41.0056 7.45085 40.9434 7.76577 40.8163 8.05606C40.6891 8.34636 40.5001 8.60492 40.2627 8.81342C40.0252 9.02191 39.7452 9.17524 39.4423 9.26252L28.5078 12.4125C28.0483 12.5445 27.5578 12.5149 27.1172 12.3285C26.6766 12.1422 26.3121 11.8102 26.0839 11.3872L20.4995 2.01158L14.9151 11.3872C14.6868 11.8102 14.3224 12.1422 13.8818 12.3285C13.4412 12.5149 12.9507 12.5445 12.4911 12.4125L1.55462 9.26252C1.25172 9.17543 0.971596 9.02213 0.734212 8.81355C0.496829 8.60497 0.30802 8.34622 0.181231 8.05575C0.0544416 7.76528 -0.00720852 7.45021 0.000670424 7.133C0.00854937 6.81578 0.0857636 6.50422 0.226815 6.2205L3.01903 0.596465C3.11814 0.396839 3.27626 0.233081 3.47161 0.127744C3.66696 0.0224074 3.88993 -0.0193244 4.1098 0.0082962ZM20.5731 6.38912L24.2425 12.5541C25.2402 14.2269 27.2289 14.9621 29.0971 14.4832L37.6411 12.028V23.2855C37.6402 24.008 37.3999 24.7095 36.9584 25.2788C36.5169 25.8482 35.8994 26.2528 35.2038 26.4287L21.5374 29.8687C20.8564 30.044 20.1426 30.044 19.4616 29.8687L5.79517 26.4287C5.09947 26.253 4.48191 25.8483 4.0404 25.2789C3.59888 24.7095 3.35867 24.008 3.35784 23.2855V12.028L11.9019 14.4832C13.7701 14.9621 15.7588 14.2269 16.7564 12.5541L20.4258 6.38912H20.5731Z" fill="#0E50A4"/>
</svg>
