<svg width="35" height="26" viewBox="0 0 35 26" fill="none" xmlns="http://www.w3.org/2000/svg">
<path d="M3.5 2.4375C3.5 1.79103 3.77656 1.17105 4.26884 0.713927C4.76113 0.256807 5.42881 0 6.125 0L20.125 0C20.8212 0 21.4889 0.256807 21.9812 0.713927C22.4734 1.17105 22.75 1.79103 22.75 2.4375V13H33.25V17.875C33.7141 17.875 34.1592 18.0462 34.4874 18.351C34.8156 18.6557 35 19.069 35 19.5C35 19.931 34.8156 20.3443 34.4874 20.649C34.1592 20.9538 33.7141 21.125 33.25 21.125H31.5C31.5 22.4179 30.9469 23.6579 29.9623 24.5721C28.9777 25.4864 27.6424 26 26.25 26C24.8576 26 23.5223 25.4864 22.5377 24.5721C21.5531 23.6579 21 22.4179 21 21.125H14C14 22.4179 13.4469 23.6579 12.4623 24.5721C11.4777 25.4864 10.1424 26 8.75 26C7.35761 26 6.02226 25.4864 5.03769 24.5721C4.05312 23.6579 3.5 22.4179 3.5 21.125V14.625H11.375C11.6071 14.625 11.8296 14.5394 11.9937 14.387C12.1578 14.2347 12.25 14.028 12.25 13.8125C12.25 13.597 12.1578 13.3903 11.9937 13.238C11.8296 13.0856 11.6071 13 11.375 13H0.875C0.642936 13 0.420376 12.9144 0.256282 12.762C0.0921872 12.6097 0 12.403 0 12.1875C0 11.972 0.0921872 11.7653 0.256282 11.613C0.420376 11.4606 0.642936 11.375 0.875 11.375H13.125C13.3571 11.375 13.5796 11.2894 13.7437 11.137C13.9078 10.9847 14 10.778 14 10.5625C14 10.347 13.9078 10.1403 13.7437 9.98798C13.5796 9.8356 13.3571 9.75 13.125 9.75H2.625C2.39294 9.75 2.17038 9.6644 2.00628 9.51202C1.84219 9.35965 1.75 9.15299 1.75 8.9375C1.75 8.72201 1.84219 8.51535 2.00628 8.36298C2.17038 8.2106 2.39294 8.125 2.625 8.125H14.875C15.1071 8.125 15.3296 8.0394 15.4937 7.88702C15.6578 7.73465 15.75 7.52799 15.75 7.3125C15.75 7.09701 15.6578 6.89035 15.4937 6.73798C15.3296 6.5856 15.1071 6.5 14.875 6.5H0.875C0.642936 6.5 0.420376 6.4144 0.256282 6.26202C0.0921872 6.10965 0 5.90299 0 5.6875C0 5.47201 0.0921872 5.26535 0.256282 5.11298C0.420376 4.9606 0.642936 4.875 0.875 4.875H3.5V2.4375ZM8.75 23.5625C9.26918 23.5625 9.77669 23.4195 10.2084 23.1517C10.6401 22.8839 10.9765 22.5032 11.1752 22.0578C11.3739 21.6124 11.4258 21.1223 11.3246 20.6495C11.2233 20.1766 10.9733 19.7423 10.6062 19.4014C10.239 19.0605 9.77131 18.8284 9.26211 18.7343C8.75291 18.6403 8.22511 18.6886 7.74546 18.873C7.2658 19.0575 6.85583 19.37 6.56739 19.7708C6.27895 20.1716 6.125 20.6429 6.125 21.125C6.125 21.7715 6.40156 22.3915 6.89384 22.8486C7.38613 23.3057 8.05381 23.5625 8.75 23.5625ZM26.25 18.6875C25.7308 18.6875 25.2233 18.8305 24.7916 19.0983C24.3599 19.3661 24.0235 19.7468 23.8248 20.1922C23.6261 20.6376 23.5742 21.1277 23.6754 21.6005C23.7767 22.0734 24.0267 22.5077 24.3938 22.8486C24.761 23.1895 25.2287 23.4216 25.7379 23.5157C26.2471 23.6097 26.7749 23.5614 27.2545 23.377C27.7342 23.1925 28.1442 22.88 28.4326 22.4792C28.721 22.0784 28.875 21.6071 28.875 21.125C28.875 20.4785 28.5984 19.8585 28.1062 19.4014C27.6139 18.9443 26.9462 18.6875 26.25 18.6875ZM25.5227 8.125H21.875V4.875H25.5227C26.4523 4.875 27.2945 5.21523 28 5.82461L32.2273 9.75C32.5522 10.0523 32.8097 10.411 32.9852 10.8057C33.1607 11.2004 33.2506 11.6234 33.25 12.0504V14.625H29.75V12.0504L25.5227 8.125Z" fill="#0E50A4"/>
</svg>
