[{
  "_id": {
    "$oid": "622df0cfc40903bff72a906d"
  },
  "totalAmount": 1428000,
  "status": 1,
  "details": [
    {
      "$oid": "622df0cfc40903bff72a9073"
    },
    {
      "$oid": "622df0cfc40903bff72a9071"
    }
  ],
  "timeCreated": {
    "$date": "2022-03-13T13:25:35.424Z"
  },
  "timeUpdated": {
    "$date": "2022-03-13T13:25:35.424Z"
  },
  "__v": 0,
  "customer": {
    "$oid": "621e2247dc4db0ba477d0925"
  }
},{
  "_id": {
    "$oid": "6230cdde78a5ab84ea17296e"
  },
  "totalAmount": 14920000,
  "status": 1,
  "details": [
    {
      "$oid": "6230cdde78a5ab84ea172975"
    },
    {
      "$oid": "6230cdde78a5ab84ea172977"
    },
    {
      "$oid": "6230cdde78a5ab84ea172979"
    }
  ],
  "timeCreated": {
    "$date": "2022-03-15T17:33:18.700Z"
  },
  "timeUpdated": {
    "$date": "2022-03-15T17:33:18.700Z"
  },
  "__v": 0,
  "customer": {
    "$oid": "6230cafc78a5ab84ea172266"
  }
},{
  "_id": {
    "$oid": "6232db12dfa6f21dac0fa688"
  },
  "totalAmount": 11078000,
  "status": 0,
  "details": [],
  "timeCreated": {
    "$date": "2022-03-17T06:54:10.043Z"
  },
  "timeUpdated": {
    "$date": "2022-03-17T06:54:10.043Z"
  },
  "__v": 0
},{
  "_id": {
    "$oid": "6232db57dfa6f21dac0fa68a"
  },
  "totalAmount": 11078000,
  "status": 0,
  "details": [],
  "timeCreated": {
    "$date": "2022-03-17T06:55:19.429Z"
  },
  "timeUpdated": {
    "$date": "2022-03-17T06:55:19.429Z"
  },
  "__v": 0
},{
  "_id": {
    "$oid": "6232dc65dfa6f21dac0fa68e"
  },
  "totalAmount": 11078000,
  "status": 0,
  "details": [],
  "timeCreated": {
    "$date": "2022-03-17T06:59:49.600Z"
  },
  "timeUpdated": {
    "$date": "2022-03-17T06:59:49.600Z"
  },
  "__v": 0
},{
  "_id": {
    "$oid": "6232e0d7dfa6f21dac10fea1"
  },
  "totalAmount": 7704000,
  "status": 1,
  "details": [
    {
      "$oid": "6232e0d7dfa6f21dac10fea5"
    },
    {
      "$oid": "6232e0d7dfa6f21dac10fea7"
    }
  ],
  "timeCreated": {
    "$date": "2022-03-17T07:18:47.931Z"
  },
  "timeUpdated": {
    "$date": "2022-03-17T07:18:47.931Z"
  },
  "__v": 0,
  "customer": {
    "$oid": "6232d9d7dfa6f21dac0f9ac1"
  }
},{
  "_id": {
    "$oid": "623331cbb5575ff8a5190dab"
  },
  "totalAmount": 2700000,
  "status": 0,
  "details": [
    {
      "$oid": "623331cbb5575ff8a5190daf"
    },
    {
      "$oid": "623331cbb5575ff8a5190db1"
    },
    {
      "$oid": "623331cbb5575ff8a5190db3"
    }
  ],
  "timeCreated": {
    "$date": "2022-03-17T13:04:11.046Z"
  },
  "timeUpdated": {
    "$date": "2022-03-17T13:04:11.046Z"
  },
  "__v": 0,
  "customer": {
    "$oid": "6232d9d7dfa6f21dac0f9ac1"
  }
},{
  "_id": {
    "$oid": "6233339eb5575ff8a51923b7"
  },
  "totalAmount": 574000,
  "status": 1,
  "details": [
    {
      "$oid": "6233339eb5575ff8a51923be"
    },
    {
      "$oid": "6233339eb5575ff8a51923c0"
    }
  ],
  "timeCreated": {
    "$date": "2022-03-17T13:11:58.842Z"
  },
  "timeUpdated": {
    "$date": "2022-03-17T13:11:58.842Z"
  },
  "__v": 0,
  "customer": {
    "$oid": "622c59614ab2aeff01e3ad16"
  }
},{
  "_id": {
    "$oid": "623499998aca0b310948027f"
  },
  "totalAmount": 24616000,
  "status": 0,
  "details": [
    {
      "$oid": "623499998aca0b3109480284"
    },
    {
      "$oid": "623499998aca0b3109480286"
    },
    {
      "$oid": "623499998aca0b3109480288"
    }
  ],
  "timeCreated": {
    "$date": "2022-03-18T14:39:21.058Z"
  },
  "timeUpdated": {
    "$date": "2022-03-18T14:39:21.058Z"
  },
  "__v": 0,
  "customer": {
    "$oid": "6230cafc78a5ab84ea172266"
  }
},{
  "_id": {
    "$oid": "623b24687968512a81b91412"
  },
  "totalAmount": 954000,
  "status": 1,
  "details": [
    {
      "$oid": "623b24687968512a81b91416"
    },
    {
      "$oid": "623b24687968512a81b91418"
    }
  ],
  "timeCreated": {
    "$date": "2022-03-23T13:45:12.625Z"
  },
  "timeUpdated": {
    "$date": "2022-03-23T13:45:12.625Z"
  },
  "__v": 0,
  "customer": {
    "$oid": "622b5425a6c07fbb84d00bd4"
  }
},{
  "_id": {
    "$oid": "623bf3536b66d5cd5e9b33b9"
  },
  "totalAmount": 3050000,
  "status": 0,
  "details": [
    {
      "$oid": "623bf3536b66d5cd5e9b33bd"
    },
    {
      "$oid": "623bf3536b66d5cd5e9b33bf"
    }
  ],
  "timeCreated": {
    "$date": "2022-03-24T04:28:03.397Z"
  },
  "timeUpdated": {
    "$date": "2022-03-24T04:28:03.398Z"
  },
  "__v": 0,
  "customer": {
    "$oid": "622b5425a6c07fbb84d00bd4"
  }
},{
  "_id": {
    "$oid": "623c75a2a98442f6d4999b1e"
  },
  "totalAmount": 1039000,
  "status": 0,
  "details": [
    {
      "$oid": "623c75a2a98442f6d4999b22"
    },
    {
      "$oid": "623c75a2a98442f6d4999b24"
    },
    {
      "$oid": "623c75a2a98442f6d4999b26"
    }
  ],
  "timeCreated": {
    "$date": "2022-03-24T13:44:02.844Z"
  },
  "timeUpdated": {
    "$date": "2022-03-24T13:44:02.844Z"
  },
  "__v": 0,
  "customer": {
    "$oid": "622c59614ab2aeff01e3ad16"
  }
}]