com/mycompany/atmmanagementsys/PasswordResetController.class
com/mycompany/atmmanagementsys/BalancePageController.class
com/mycompany/atmmanagementsys/EditCustomerController.class
com/mycompany/atmmanagementsys/AddCustomerController.class
com/mycompany/atmmanagementsys/UserPageController.class
com/mycompany/atmmanagementsys/MainApp.class
com/mycompany/atmmanagementsys/PasswordResetController$1.class
com/mycompany/atmmanagementsys/Quotes.class
com/mycompany/atmmanagementsys/FXMLController.class
com/mycompany/atmmanagementsys/CustomerData.class
com/mycompany/atmmanagementsys/AccountInfoController.class
com/mycompany/atmmanagementsys/AdminPageController.class
com/mycompany/atmmanagementsys/DbConnection.class
