127.0.0.1 - - [22/Apr/2021:10:37:38 -0300] "GET / HTTP/1.1" 404 763
0:0:0:0:0:0:0:1 - - [22/Apr/2021:10:37:41 -0300] "GET /PortoPrintWeb/semacesso.jsp HTTP/1.1" 200 1608
0:0:0:0:0:0:0:1 - - [22/Apr/2021:10:37:41 -0300] "GET /PortoPrintWeb/signin.css HTTP/1.1" 404 791
0:0:0:0:0:0:0:1 - - [22/Apr/2021:10:37:41 -0300] "GET /dist/css/bootstrap.min.css HTTP/1.1" 404 797
0:0:0:0:0:0:0:1 - - [22/Apr/2021:10:37:41 -0300] "GET /docs/4.0/assets/img/favicons/favicon.ico HTTP/1.1" 404 823
0:0:0:0:0:0:0:1 - - [22/Apr/2021:10:38:24 -0300] "GET /PortoPrintWeb/semacesso.jsp HTTP/1.1" 200 1619
0:0:0:0:0:0:0:1 - - [22/Apr/2021:10:38:24 -0300] "GET /PortoPrintWeb/signin.css HTTP/1.1" 404 791
0:0:0:0:0:0:0:1 - - [22/Apr/2021:10:38:24 -0300] "GET /PortoPrintWeb/resources/bootstrap/css/bootstrap.min.css HTTP/1.1" 200 144877
0:0:0:0:0:0:0:1 - - [22/Apr/2021:10:39:21 -0300] "GET /PortoPrintWeb/semacesso.jsp HTTP/1.1" 200 1635
0:0:0:0:0:0:0:1 - - [22/Apr/2021:10:39:21 -0300] "GET /PortoPrintWeb/resources/css/signin.css HTTP/1.1" 200 951
0:0:0:0:0:0:0:1 - - [22/Apr/2021:10:39:21 -0300] "GET /PortoPrintWeb/resources/bootstrap/css/bootstrap.min.css HTTP/1.1" 304 -
0:0:0:0:0:0:0:1 - - [22/Apr/2021:10:41:20 -0300] "GET /PortoPrintWeb/semacesso.jsp HTTP/1.1" 200 1577
0:0:0:0:0:0:0:1 - - [22/Apr/2021:10:41:20 -0300] "GET /PortoPrintWeb/resources/css/signin.css HTTP/1.1" 304 -
0:0:0:0:0:0:0:1 - - [22/Apr/2021:10:41:20 -0300] "GET /PortoPrintWeb/resources/bootstrap/css/bootstrap.min.css HTTP/1.1" 304 -
0:0:0:0:0:0:0:1 - - [22/Apr/2021:10:41:20 -0300] "GET /PortoPrintWeb/resources/css/pslogo.png HTTP/1.1" 200 17346
0:0:0:0:0:0:0:1 - - [22/Apr/2021:10:41:30 -0300] "GET /PortoPrintWeb/semacesso.jsp HTTP/1.1" 200 1578
0:0:0:0:0:0:0:1 - - [22/Apr/2021:10:41:30 -0300] "GET /PortoPrintWeb/resources/css/pslogo.png HTTP/1.1" 304 -
0:0:0:0:0:0:0:1 - - [22/Apr/2021:10:44:59 -0300] "GET /PortoPrintWeb/semacesso.jsp HTTP/1.1" 200 1607
0:0:0:0:0:0:0:1 - - [22/Apr/2021:10:44:59 -0300] "GET /PortoPrintWeb/resources/bootstrap/css/bootstrap.min.css HTTP/1.1" 304 -
0:0:0:0:0:0:0:1 - - [22/Apr/2021:10:44:59 -0300] "GET /PortoPrintWeb/resources/css/signin.css HTTP/1.1" 304 -
0:0:0:0:0:0:0:1 - - [22/Apr/2021:10:44:59 -0300] "GET /PortoPrintWeb/resources/css/pslogo.png HTTP/1.1" 304 -
0:0:0:0:0:0:0:1 - - [22/Apr/2021:10:45:55 -0300] "GET /PortoPrintWeb/semacesso.jsp HTTP/1.1" 200 1604
0:0:0:0:0:0:0:1 - - [22/Apr/2021:10:45:55 -0300] "GET /PortoPrintWeb/resources/bootstrap/css/bootstrap.min.css HTTP/1.1" 304 -
0:0:0:0:0:0:0:1 - - [22/Apr/2021:10:45:55 -0300] "GET /PortoPrintWeb/resources/css/signin.css HTTP/1.1" 304 -
0:0:0:0:0:0:0:1 - - [22/Apr/2021:10:45:55 -0300] "GET /PortoPrintWeb/resources/css/pslogo.png HTTP/1.1" 304 -
0:0:0:0:0:0:0:1 - - [22/Apr/2021:10:46:08 -0300] "GET /PortoPrintWeb/semacesso.jsp HTTP/1.1" 200 1596
0:0:0:0:0:0:0:1 - - [22/Apr/2021:10:46:15 -0300] "GET /PortoPrintWeb/semacesso.jsp HTTP/1.1" 200 1593
0:0:0:0:0:0:0:1 - - [22/Apr/2021:10:48:57 -0300] "GET /PortoPrintWeb/semacesso.jsp HTTP/1.1" 200 1589
0:0:0:0:0:0:0:1 - - [22/Apr/2021:10:48:57 -0300] "GET /PortoPrintWeb/resources/bootstrap/css/bootstrap.min.css HTTP/1.1" 304 -
0:0:0:0:0:0:0:1 - - [22/Apr/2021:10:48:57 -0300] "GET /PortoPrintWeb/resources/css/signin.css HTTP/1.1" 304 -
0:0:0:0:0:0:0:1 - - [22/Apr/2021:10:48:57 -0300] "GET /PortoPrintWeb/resources/css/pslogo.png HTTP/1.1" 304 -
0:0:0:0:0:0:0:1 - - [22/Apr/2021:10:49:07 -0300] "GET /PortoPrintWeb/semacesso.jsp HTTP/1.1" 200 1587
0:0:0:0:0:0:0:1 - - [22/Apr/2021:10:51:16 -0300] "GET /PortoPrintWeb/semacesso.jsp HTTP/1.1" 200 1587
0:0:0:0:0:0:0:1 - - [22/Apr/2021:10:51:16 -0300] "GET /PortoPrintWeb/resources/bootstrap/css/bootstrap.min.css HTTP/1.1" 304 -
0:0:0:0:0:0:0:1 - - [22/Apr/2021:10:51:16 -0300] "GET /PortoPrintWeb/resources/css/signin.css HTTP/1.1" 304 -
0:0:0:0:0:0:0:1 - - [22/Apr/2021:10:51:16 -0300] "GET /PortoPrintWeb/resources/css/pslogo.png HTTP/1.1" 304 -
0:0:0:0:0:0:0:1 - - [22/Apr/2021:10:51:18 -0300] "GET /PortoPrintWeb/semacesso.jsp HTTP/1.1" 200 1587
0:0:0:0:0:0:0:1 - - [22/Apr/2021:10:51:28 -0300] "GET /PortoPrintWeb/semacesso.jsp HTTP/1.1" 200 1527
127.0.0.1 - - [22/Apr/2021:10:51:43 -0300] "GET / HTTP/1.1" 404 763
0:0:0:0:0:0:0:1 - - [22/Apr/2021:10:51:52 -0300] "GET /PortoPrintWeb/semacesso.jsp HTTP/1.1" 200 1527
0:0:0:0:0:0:0:1 - - [22/Apr/2021:10:53:22 -0300] "GET /PortoPrintWeb/semacesso.jsp HTTP/1.1" 404 755
0:0:0:0:0:0:0:1 - - [22/Apr/2021:10:53:23 -0300] "GET /favicon.ico HTTP/1.1" 404 774
0:0:0:0:0:0:0:1 - - [22/Apr/2021:10:53:30 -0300] "GET /PortoPrintWeb/login.jsp HTTP/1.1" 200 1527
0:0:0:0:0:0:0:1 - - [22/Apr/2021:10:53:30 -0300] "GET /PortoPrintWeb/resources/css/signin.css HTTP/1.1" 304 -
0:0:0:0:0:0:0:1 - - [22/Apr/2021:10:53:30 -0300] "GET /PortoPrintWeb/resources/bootstrap/css/bootstrap.min.css HTTP/1.1" 304 -
0:0:0:0:0:0:0:1 - - [22/Apr/2021:10:53:30 -0300] "GET /PortoPrintWeb/resources/css/pslogo.png HTTP/1.1" 304 -
0:0:0:0:0:0:0:1 - - [22/Apr/2021:10:54:40 -0300] "GET /PortoPrintWeb/login.jsp HTTP/1.1" 200 1518
0:0:0:0:0:0:0:1 - - [22/Apr/2021:10:55:09 -0300] "GET /PortoPrintWeb/login.jsp HTTP/1.1" 200 1428
0:0:0:0:0:0:0:1 - - [22/Apr/2021:10:55:09 -0300] "GET /PortoPrintWeb/resources/css/signin.css HTTP/1.1" 304 -
0:0:0:0:0:0:0:1 - - [22/Apr/2021:10:55:09 -0300] "GET /PortoPrintWeb/resources/css/pslogo.png HTTP/1.1" 304 -
0:0:0:0:0:0:0:1 - - [22/Apr/2021:10:55:52 -0300] "GET /PortoPrintWeb/login.jsp HTTP/1.1" 200 1427
0:0:0:0:0:0:0:1 - - [22/Apr/2021:10:55:52 -0300] "GET /PortoPrintWeb/resources/bootstrap/css/bootstrap.min.css HTTP/1.1" 304 -
0:0:0:0:0:0:0:1 - - [22/Apr/2021:10:55:57 -0300] "POST /PortoPrintWeb/login HTTP/1.1" 302 -
0:0:0:0:0:0:0:1 - - [22/Apr/2021:10:55:57 -0300] "GET /PortoPrintWeb/resultado.jsp HTTP/1.1" 200 151
0:0:0:0:0:0:0:1 - - [22/Apr/2021:11:01:47 -0300] "GET /PortoPrintWeb/index.jsp HTTP/1.1" 200 548
0:0:0:0:0:0:0:1 - - [22/Apr/2021:11:01:47 -0300] "GET /PortoPrintWeb/resources/css/style.css HTTP/1.1" 304 -
0:0:0:0:0:0:0:1 - - [22/Apr/2021:11:01:47 -0300] "GET /PortoPrintWeb/resources/css/logo-2.png HTTP/1.1" 304 -
0:0:0:0:0:0:0:1 - - [22/Apr/2021:11:02:20 -0300] "GET /PortoPrintWeb/index.jsp HTTP/1.1" 200 553
0:0:0:0:0:0:0:1 - - [22/Apr/2021:11:03:21 -0300] "GET /PortoPrintWeb/index.jsp HTTP/1.1" 200 524
0:0:0:0:0:0:0:1 - - [22/Apr/2021:11:03:43 -0300] "GET /PortoPrintWeb/index.jsp HTTP/1.1" 200 524
0:0:0:0:0:0:0:1 - - [22/Apr/2021:11:03:44 -0300] "GET /PortoPrintWeb/index.jsp HTTP/1.1" 200 524
0:0:0:0:0:0:0:1 - - [22/Apr/2021:11:03:55 -0300] "GET /PortoPrintWeb/index.jsp HTTP/1.1" 200 524
0:0:0:0:0:0:0:1 - - [22/Apr/2021:11:03:55 -0300] "GET /PortoPrintWeb/index.jsp HTTP/1.1" 200 524
127.0.0.1 - - [22/Apr/2021:11:04:07 -0300] "GET / HTTP/1.1" 404 763
0:0:0:0:0:0:0:1 - - [22/Apr/2021:11:04:14 -0300] "GET /PortoPrintWeb/index.jsp HTTP/1.1" 200 524
0:0:0:0:0:0:0:1 - - [22/Apr/2021:11:04:33 -0300] "GET /PortoPrintWeb/index.jsp HTTP/1.1" 200 524
0:0:0:0:0:0:0:1 - - [22/Apr/2021:11:04:34 -0300] "GET /PortoPrintWeb/index.jsp HTTP/1.1" 200 524
0:0:0:0:0:0:0:1 - - [22/Apr/2021:11:04:34 -0300] "GET /PortoPrintWeb/index.jsp HTTP/1.1" 200 524
0:0:0:0:0:0:0:1 - - [22/Apr/2021:11:04:34 -0300] "GET /PortoPrintWeb/index.jsp HTTP/1.1" 200 524
0:0:0:0:0:0:0:1 - - [22/Apr/2021:11:04:43 -0300] "GET /PortoPrintWeb/index.jsp HTTP/1.1" 200 524
0:0:0:0:0:0:0:1 - - [22/Apr/2021:11:05:08 -0300] "GET /PortoPrintWeb/index.jsp HTTP/1.1" 200 524
0:0:0:0:0:0:0:1 - - [22/Apr/2021:11:05:09 -0300] "GET /PortoPrintWeb/index.jsp HTTP/1.1" 200 524
0:0:0:0:0:0:0:1 - - [22/Apr/2021:11:05:19 -0300] "GET /PortoPrintWeb/index.jsp HTTP/1.1" 200 516
0:0:0:0:0:0:0:1 - - [22/Apr/2021:11:05:19 -0300] "GET /PortoPrintWeb/index.jsp HTTP/1.1" 200 516
0:0:0:0:0:0:0:1 - - [22/Apr/2021:11:05:19 -0300] "GET /PortoPrintWeb/index.jsp HTTP/1.1" 200 516
0:0:0:0:0:0:0:1 - - [22/Apr/2021:11:05:29 -0300] "GET /PortoPrintWeb/index.jsp HTTP/1.1" 200 548
0:0:0:0:0:0:0:1 - - [22/Apr/2021:11:05:30 -0300] "GET /PortoPrintWeb/index.jsp HTTP/1.1" 200 548
0:0:0:0:0:0:0:1 - - [22/Apr/2021:11:06:02 -0300] "GET /PortoPrintWeb/index.jsp HTTP/1.1" 200 524
0:0:0:0:0:0:0:1 - - [22/Apr/2021:11:06:19 -0300] "GET /PortoPrintWeb/index.jsp HTTP/1.1" 200 524
0:0:0:0:0:0:0:1 - - [22/Apr/2021:11:06:19 -0300] "GET /PortoPrintWeb/index.jsp HTTP/1.1" 200 524
0:0:0:0:0:0:0:1 - - [22/Apr/2021:11:06:20 -0300] "GET /PortoPrintWeb/index.jsp HTTP/1.1" 200 524
0:0:0:0:0:0:0:1 - - [22/Apr/2021:11:06:20 -0300] "GET /PortoPrintWeb/index.jsp HTTP/1.1" 200 524
0:0:0:0:0:0:0:1 - - [22/Apr/2021:11:06:20 -0300] "GET /PortoPrintWeb/index.jsp HTTP/1.1" 200 524
0:0:0:0:0:0:0:1 - - [22/Apr/2021:11:06:20 -0300] "GET /PortoPrintWeb/index.jsp HTTP/1.1" 200 524
0:0:0:0:0:0:0:1 - - [22/Apr/2021:11:06:20 -0300] "GET /PortoPrintWeb/index.jsp HTTP/1.1" 200 524
0:0:0:0:0:0:0:1 - - [22/Apr/2021:11:06:20 -0300] "GET /PortoPrintWeb/index.jsp HTTP/1.1" 200 524
0:0:0:0:0:0:0:1 - - [22/Apr/2021:11:06:20 -0300] "GET /PortoPrintWeb/index.jsp HTTP/1.1" 200 524
0:0:0:0:0:0:0:1 - - [22/Apr/2021:11:06:21 -0300] "GET /PortoPrintWeb/index.jsp HTTP/1.1" 200 524
0:0:0:0:0:0:0:1 - - [22/Apr/2021:11:06:41 -0300] "GET /PortoPrintWeb/index.jsp HTTP/1.1" 200 524
0:0:0:0:0:0:0:1 - - [22/Apr/2021:11:06:42 -0300] "GET /PortoPrintWeb/index.jsp HTTP/1.1" 200 524
0:0:0:0:0:0:0:1 - - [22/Apr/2021:11:06:42 -0300] "GET /PortoPrintWeb/index.jsp HTTP/1.1" 200 524
0:0:0:0:0:0:0:1 - - [22/Apr/2021:11:06:58 -0300] "GET /PortoPrintWeb/index.jsp HTTP/1.1" 200 521
0:0:0:0:0:0:0:1 - - [22/Apr/2021:11:07:12 -0300] "GET /PortoPrintWeb/index.jsp HTTP/1.1" 200 521
0:0:0:0:0:0:0:1 - - [22/Apr/2021:11:07:13 -0300] "GET /PortoPrintWeb/index.jsp HTTP/1.1" 200 521
0:0:0:0:0:0:0:1 - - [22/Apr/2021:11:18:34 -0300] "GET /PortoPrintWeb/index.jsp HTTP/1.1" 200 521
0:0:0:0:0:0:0:1 - - [22/Apr/2021:11:18:57 -0300] "GET /PortoPrintWeb/index.jsp HTTP/1.1" 200 521
127.0.0.1 - - [22/Apr/2021:11:19:07 -0300] "GET / HTTP/1.1" 404 763
0:0:0:0:0:0:0:1 - - [22/Apr/2021:11:19:08 -0300] "GET /PortoPrintWeb/index.jsp HTTP/1.1" 200 521
0:0:0:0:0:0:0:1 - - [22/Apr/2021:11:19:09 -0300] "GET /PortoPrintWeb/index.jsp HTTP/1.1" 200 521
0:0:0:0:0:0:0:1 - - [22/Apr/2021:11:19:16 -0300] "GET /PortoPrintWeb/ HTTP/1.1" 200 521
0:0:0:0:0:0:0:1 - - [22/Apr/2021:11:20:00 -0300] "GET /PortoPrintWeb/ HTTP/1.1" 200 524
0:0:0:0:0:0:0:1 - - [22/Apr/2021:11:20:06 -0300] "GET /PortoPrintWeb/ HTTP/1.1" 200 521
0:0:0:0:0:0:0:1 - - [22/Apr/2021:11:21:04 -0300] "GET /PortoPrintWeb/ HTTP/1.1" 200 521
0:0:0:0:0:0:0:1 - - [22/Apr/2021:11:21:04 -0300] "GET /PortoPrintWeb/ HTTP/1.1" 200 521
127.0.0.1 - - [22/Apr/2021:11:21:15 -0300] "GET / HTTP/1.1" 404 763
0:0:0:0:0:0:0:1 - - [22/Apr/2021:11:21:17 -0300] "GET /PortoPrintWeb/ HTTP/1.1" 200 521
0:0:0:0:0:0:0:1 - - [22/Apr/2021:11:21:18 -0300] "GET /PortoPrintWeb/ HTTP/1.1" 200 521
0:0:0:0:0:0:0:1 - - [22/Apr/2021:11:22:07 -0300] "GET /PortoPrintWeb/ HTTP/1.1" 200 559
0:0:0:0:0:0:0:1 - - [22/Apr/2021:11:22:31 -0300] "GET /PortoPrintWeb/ HTTP/1.1" 200 526
0:0:0:0:0:0:0:1 - - [22/Apr/2021:11:22:32 -0300] "GET /PortoPrintWeb/ HTTP/1.1" 200 526
0:0:0:0:0:0:0:1 - - [22/Apr/2021:11:22:32 -0300] "GET /PortoPrintWeb/ HTTP/1.1" 200 526
0:0:0:0:0:0:0:1 - - [22/Apr/2021:11:24:32 -0300] "GET /PortoPrintWeb/ HTTP/1.1" 200 543
0:0:0:0:0:0:0:1 - - [22/Apr/2021:11:26:06 -0300] "GET /PortoPrintWeb/ HTTP/1.1" 200 645
0:0:0:0:0:0:0:1 - - [22/Apr/2021:11:26:48 -0300] "GET /PortoPrintWeb/ HTTP/1.1" 200 642
0:0:0:0:0:0:0:1 - - [22/Apr/2021:11:27:11 -0300] "GET /PortoPrintWeb/ HTTP/1.1" 200 642
0:0:0:0:0:0:0:1 - - [22/Apr/2021:11:27:39 -0300] "GET /PortoPrintWeb/ HTTP/1.1" 200 655
0:0:0:0:0:0:0:1 - - [22/Apr/2021:11:27:46 -0300] "GET /PortoPrintWeb/ HTTP/1.1" 200 642
0:0:0:0:0:0:0:1 - - [22/Apr/2021:11:28:22 -0300] "GET /PortoPrintWeb/ HTTP/1.1" 200 642
0:0:0:0:0:0:0:1 - - [22/Apr/2021:11:28:23 -0300] "GET /PortoPrintWeb/ HTTP/1.1" 200 642
0:0:0:0:0:0:0:1 - - [22/Apr/2021:11:28:29 -0300] "GET /PortoPrintWeb/ HTTP/1.1" 200 642
0:0:0:0:0:0:0:1 - - [22/Apr/2021:11:28:29 -0300] "GET /PortoPrintWeb/ HTTP/1.1" 200 642
127.0.0.1 - - [22/Apr/2021:11:28:44 -0300] "GET / HTTP/1.1" 404 763
0:0:0:0:0:0:0:1 - - [22/Apr/2021:11:28:52 -0300] "GET /PortoPrintWeb/ HTTP/1.1" 200 642
0:0:0:0:0:0:0:1 - - [22/Apr/2021:11:29:15 -0300] "GET /PortoPrintWeb/ HTTP/1.1" 200 642
0:0:0:0:0:0:0:1 - - [22/Apr/2021:11:29:27 -0300] "GET /PortoPrintWeb/ HTTP/1.1" 200 642
0:0:0:0:0:0:0:1 - - [22/Apr/2021:11:29:27 -0300] "GET /PortoPrintWeb/ HTTP/1.1" 200 642
127.0.0.1 - - [22/Apr/2021:11:29:37 -0300] "GET / HTTP/1.1" 404 763
0:0:0:0:0:0:0:1 - - [22/Apr/2021:11:29:40 -0300] "GET /PortoPrintWeb/ HTTP/1.1" 200 642
0:0:0:0:0:0:0:1 - - [22/Apr/2021:11:29:45 -0300] "GET /PortoPrintWeb/ HTTP/1.1" 200 642
0:0:0:0:0:0:0:1 - - [22/Apr/2021:11:29:59 -0300] "GET /PortoPrintWeb/ HTTP/1.1" 200 642
0:0:0:0:0:0:0:1 - - [22/Apr/2021:11:30:26 -0300] "GET /PortoPrintWeb/ HTTP/1.1" 200 628
0:0:0:0:0:0:0:1 - - [22/Apr/2021:11:30:28 -0300] "GET /PortoPrintWeb/login.jsp HTTP/1.1" 200 1427
0:0:0:0:0:0:0:1 - - [22/Apr/2021:11:30:28 -0300] "GET /PortoPrintWeb/resources/bootstrap/css/bootstrap.min.css HTTP/1.1" 304 -
0:0:0:0:0:0:0:1 - - [22/Apr/2021:11:30:28 -0300] "GET /PortoPrintWeb/resources/css/signin.css HTTP/1.1" 304 -
0:0:0:0:0:0:0:1 - - [22/Apr/2021:11:30:28 -0300] "GET /PortoPrintWeb/resources/css/pslogo.png HTTP/1.1" 304 -
0:0:0:0:0:0:0:1 - - [22/Apr/2021:11:30:36 -0300] "POST /PortoPrintWeb/login HTTP/1.1" 302 -
0:0:0:0:0:0:0:1 - - [22/Apr/2021:11:30:36 -0300] "GET /PortoPrintWeb/resultado.jsp HTTP/1.1" 200 151
0:0:0:0:0:0:0:1 - - [22/Apr/2021:11:31:27 -0300] "GET /PortoPrintWeb/index.jsp HTTP/1.1" 200 628
0:0:0:0:0:0:0:1 - - [22/Apr/2021:11:31:28 -0300] "GET /favicon.ico HTTP/1.1" 404 774
0:0:0:0:0:0:0:1 - - [22/Apr/2021:11:31:31 -0300] "GET /PortoPrintWeb/login.jsp HTTP/1.1" 200 1427
0:0:0:0:0:0:0:1 - - [22/Apr/2021:11:31:31 -0300] "GET /docs/4.0/assets/img/favicons/favicon.ico HTTP/1.1" 404 823
0:0:0:0:0:0:0:1 - - [22/Apr/2021:11:31:37 -0300] "POST /PortoPrintWeb/login HTTP/1.1" 302 -
0:0:0:0:0:0:0:1 - - [22/Apr/2021:11:31:37 -0300] "GET /PortoPrintWeb/index.jsp?falha=true HTTP/1.1" 200 628
0:0:0:0:0:0:0:1 - - [22/Apr/2021:11:31:40 -0300] "GET /PortoPrintWeb/login.jsp HTTP/1.1" 200 1427
127.0.0.1 - - [22/Apr/2021:11:32:37 -0300] "GET / HTTP/1.1" 404 763
