INDEX VERSION 1.4+S:\desenv\wksp\ppweb\.metadata\.plugins\org.eclipse.wst.jsdt.core\indexes
2201549041.index
1009949985.index
246458055.index
1662744323.index
1150243528.index
2777391199.index
1635221404.index
