\headcommand {\slideentry {0}{0}{1}{1/1}{}{0}}
\headcommand {\beamer@framepages {1}{1}}
\headcommand {\slideentry {0}{0}{2}{2/5}{}{0}}
\headcommand {\beamer@framepages {2}{5}}
\headcommand {\slideentry {0}{0}{3}{6/9}{}{0}}
\headcommand {\beamer@framepages {6}{9}}
\headcommand {\slideentry {0}{0}{4}{10/13}{}{0}}
\headcommand {\beamer@framepages {10}{13}}
\headcommand {\slideentry {0}{0}{5}{14/18}{}{0}}
\headcommand {\beamer@framepages {14}{18}}
\headcommand {\slideentry {0}{0}{6}{19/22}{}{0}}
\headcommand {\beamer@framepages {19}{22}}
\headcommand {\slideentry {0}{0}{7}{23/26}{}{0}}
\headcommand {\beamer@framepages {23}{26}}
\headcommand {\slideentry {0}{0}{8}{27/30}{}{0}}
\headcommand {\beamer@framepages {27}{30}}
\headcommand {\slideentry {0}{0}{9}{31/33}{}{0}}
\headcommand {\beamer@framepages {31}{33}}
\headcommand {\slideentry {0}{0}{10}{34/34}{}{0}}
\headcommand {\beamer@framepages {34}{34}}
\headcommand {\slideentry {0}{0}{11}{35/38}{}{0}}
\headcommand {\beamer@framepages {35}{38}}
\headcommand {\slideentry {0}{0}{12}{39/40}{}{0}}
\headcommand {\beamer@framepages {39}{40}}
\headcommand {\slideentry {0}{0}{13}{41/41}{}{0}}
\headcommand {\beamer@framepages {41}{41}}
\headcommand {\slideentry {0}{0}{14}{42/45}{}{0}}
\headcommand {\beamer@framepages {42}{45}}
\headcommand {\slideentry {0}{0}{15}{46/48}{}{0}}
\headcommand {\beamer@framepages {46}{48}}
\headcommand {\slideentry {0}{0}{16}{49/50}{}{0}}
\headcommand {\beamer@framepages {49}{50}}
\headcommand {\slideentry {0}{0}{17}{51/55}{}{0}}
\headcommand {\beamer@framepages {51}{55}}
\headcommand {\slideentry {0}{0}{18}{56/56}{}{0}}
\headcommand {\beamer@framepages {56}{56}}
\headcommand {\slideentry {0}{0}{19}{57/59}{}{0}}
\headcommand {\beamer@framepages {57}{59}}
\headcommand {\beamer@partpages {1}{59}}
\headcommand {\beamer@subsectionpages {1}{59}}
\headcommand {\beamer@sectionpages {1}{59}}
\headcommand {\beamer@documentpages {59}}
\headcommand {\gdef \inserttotalframenumber {19}}
