# Fdb version 3
["pdflatex"] 1643393068 "slides.tex" "slides.pdf" "slides" 1643393068
  "/usr/local/texlive/2021/texmf-dist/fonts/map/fontname/texfonts.map" 1577235249 3524 cb3e574dea2d1052e39280babc910dc8 ""
  "/usr/local/texlive/2021/texmf-dist/fonts/tfm/public/amsfonts/cmextra/cmex7.tfm" 1246382020 1004 54797486969f23fa377b128694d548df ""
  "/usr/local/texlive/2021/texmf-dist/fonts/tfm/public/amsfonts/symbols/msam10.tfm" 1246382020 916 f87d7c45f9c908e672703b83b72241a3 ""
  "/usr/local/texlive/2021/texmf-dist/fonts/tfm/public/amsfonts/symbols/msam5.tfm" 1246382020 924 9904cf1d39e9767e7a3622f2a125a565 ""
  "/usr/local/texlive/2021/texmf-dist/fonts/tfm/public/amsfonts/symbols/msam7.tfm" 1246382020 928 2dc8d444221b7a635bb58038579b861a ""
  "/usr/local/texlive/2021/texmf-dist/fonts/tfm/public/amsfonts/symbols/msbm10.tfm" 1246382020 908 2921f8a10601f252058503cc6570e581 ""
  "/usr/local/texlive/2021/texmf-dist/fonts/tfm/public/amsfonts/symbols/msbm5.tfm" 1246382020 940 75ac932a52f80982a9f8ea75d03a34cf ""
  "/usr/local/texlive/2021/texmf-dist/fonts/tfm/public/amsfonts/symbols/msbm7.tfm" 1246382020 940 228d6584342e91276bf566bcf9716b83 ""
  "/usr/local/texlive/2021/texmf-dist/fonts/tfm/public/cm/cmss10.tfm" 1136768653 1316 b636689f1933f24d1294acdf6041daaa ""
  "/usr/local/texlive/2021/texmf-dist/fonts/tfm/public/cm/cmss12.tfm" 1136768653 1324 37b971caf729d7edd9cbb9f9b0ea76eb ""
  "/usr/local/texlive/2021/texmf-dist/fonts/tfm/public/cm/cmss8.tfm" 1136768653 1296 d77f431d10d47c8ea2cc18cf45346274 ""
  "/usr/local/texlive/2021/texmf-dist/fonts/tfm/public/cm/cmssbx10.tfm" 1136768653 1272 e2d13f0df30bf3ad990bb9d028e37f34 ""
  "/usr/local/texlive/2021/texmf-dist/fonts/tfm/public/cm/cmssi10.tfm" 1136768653 1520 ca2bb4b78ac9800bd686e30c6d19ef95 ""
  "/usr/local/texlive/2021/texmf-dist/fonts/tfm/public/cm/cmtt10.tfm" 1136768653 768 1321e9409b4137d6fb428ac9dc956269 ""
  "/usr/local/texlive/2021/texmf-dist/fonts/tfm/public/cm/cmtt8.tfm" 1136768653 768 d7b9a2629a0c353102ad947dc9221d49 ""
  "/usr/local/texlive/2021/texmf-dist/fonts/tfm/public/sansmathaccent/mathkerncmssi10.tfm" 1336178347 1696 aaa5bbd1f47f001247d42218ce371101 ""
  "/usr/local/texlive/2021/texmf-dist/fonts/tfm/public/sansmathaccent/mathkerncmssi8.tfm" 1336178347 1676 fb6c6a335484692abff897d6e8965829 ""
  "/usr/local/texlive/2021/texmf-dist/fonts/type1/public/amsfonts/cm/cmmi10.pfb" 1248133631 36299 5f9df58c2139e7edcf37c8fca4bd384d ""
  "/usr/local/texlive/2021/texmf-dist/fonts/type1/public/amsfonts/cm/cmss10.pfb" 1248133631 24457 5cbb7bdf209d5d1ce9892a9b80a307cc ""
  "/usr/local/texlive/2021/texmf-dist/fonts/type1/public/amsfonts/cm/cmss12.pfb" 1248133631 24393 3b7eb51a67a0a62aec5849271bdb9c2e ""
  "/usr/local/texlive/2021/texmf-dist/fonts/type1/public/amsfonts/cm/cmss8.pfb" 1248133631 24420 52dbb8e8aa0069a1b987309557f8d303 ""
  "/usr/local/texlive/2021/texmf-dist/fonts/type1/public/amsfonts/cm/cmssbx10.pfb" 1248133631 28902 2f5c04fd2884d1878057baa5aad22765 ""
  "/usr/local/texlive/2021/texmf-dist/fonts/type1/public/amsfonts/cm/cmssi10.pfb" 1248133631 25150 e0d09798d232ab9d00c5c0a8df6cc22d ""
  "/usr/local/texlive/2021/texmf-dist/fonts/type1/public/amsfonts/cm/cmtt10.pfb" 1248133631 31099 c85edf1dd5b9e826d67c9c7293b6786c ""
  "/usr/local/texlive/2021/texmf-dist/fonts/type1/public/amsfonts/symbols/msam10.pfb" 1248133631 31764 459c573c03a4949a528c2cc7f557e217 ""
  "/usr/local/texlive/2021/texmf-dist/tex/context/base/mkii/supp-pdf.mkii" 1461363279 71627 94eb9990bed73c364d7f53f960cc8c5b ""
  "/usr/local/texlive/2021/texmf-dist/tex/generic/atbegshi/atbegshi.sty" 1575674566 24708 5584a51a7101caf7e6bbf1fc27d8f7b1 ""
  "/usr/local/texlive/2021/texmf-dist/tex/generic/bigintcalc/bigintcalc.sty" 1576625341 40635 c40361e206be584d448876bba8a64a3b ""
  "/usr/local/texlive/2021/texmf-dist/tex/generic/bitset/bitset.sty" 1576016050 33961 6b5c75130e435b2bfdb9f480a09a39f9 ""
  "/usr/local/texlive/2021/texmf-dist/tex/generic/etexcmds/etexcmds.sty" 1576625273 7734 b98cbb34c81f667027c1e3ebdbfce34b ""
  "/usr/local/texlive/2021/texmf-dist/tex/generic/gettitlestring/gettitlestring.sty" 1576625223 8371 9d55b8bd010bc717624922fb3477d92e ""
  "/usr/local/texlive/2021/texmf-dist/tex/generic/iftex/ifpdf.sty" 1572645307 480 5778104efadad304ced77548ca2184b1 ""
  "/usr/local/texlive/2021/texmf-dist/tex/generic/iftex/iftex.sty" 1583617216 6501 4011d89d9621e0b0901138815ba5ff29 ""
  "/usr/local/texlive/2021/texmf-dist/tex/generic/iftex/ifvtex.sty" 1572645307 1057 525c2192b5febbd8c1f662c9468335bb ""
  "/usr/local/texlive/2021/texmf-dist/tex/generic/infwarerr/infwarerr.sty" 1575499628 8356 7bbb2c2373aa810be568c29e333da8ed ""
  "/usr/local/texlive/2021/texmf-dist/tex/generic/intcalc/intcalc.sty" 1576625065 31769 002a487f55041f8e805cfbf6385ffd97 ""
  "/usr/local/texlive/2021/texmf-dist/tex/generic/kvdefinekeys/kvdefinekeys.sty" 1576878844 5412 d5a2436094cd7be85769db90f29250a6 ""
  "/usr/local/texlive/2021/texmf-dist/tex/generic/kvsetkeys/kvsetkeys.sty" 1576624944 13807 952b0226d4efca026f0e19dd266dcc22 ""
  "/usr/local/texlive/2021/texmf-dist/tex/generic/ltxcmds/ltxcmds.sty" 1600895880 17859 4409f8f50cd365c68e684407e5350b1b ""
  "/usr/local/texlive/2021/texmf-dist/tex/generic/pdfescape/pdfescape.sty" 1576015897 19007 15924f7228aca6c6d184b115f4baa231 ""
  "/usr/local/texlive/2021/texmf-dist/tex/generic/pdftexcmds/pdftexcmds.sty" 1593379760 20089 80423eac55aa175305d35b49e04fe23b ""
  "/usr/local/texlive/2021/texmf-dist/tex/generic/pgf/basiclayer/pgfcore.code.tex" 1601326656 992 855ff26741653ab54814101ca36e153c ""
  "/usr/local/texlive/2021/texmf-dist/tex/generic/pgf/basiclayer/pgfcorearrows.code.tex" 1601326656 43820 1fef971b75380574ab35a0d37fd92608 ""
  "/usr/local/texlive/2021/texmf-dist/tex/generic/pgf/basiclayer/pgfcoreexternal.code.tex" 1601326656 19324 f4e4c6403dd0f1605fd20ed22fa79dea ""
  "/usr/local/texlive/2021/texmf-dist/tex/generic/pgf/basiclayer/pgfcoregraphicstate.code.tex" 1601326656 6038 ccb406740cc3f03bbfb58ad504fe8c27 ""
  "/usr/local/texlive/2021/texmf-dist/tex/generic/pgf/basiclayer/pgfcoreimage.code.tex" 1601326656 6944 e12f8f7a7364ddf66f93ba30fb3a3742 ""
  "/usr/local/texlive/2021/texmf-dist/tex/generic/pgf/basiclayer/pgfcorelayers.code.tex" 1601326656 4883 42daaf41e27c3735286e23e48d2d7af9 ""
  "/usr/local/texlive/2021/texmf-dist/tex/generic/pgf/basiclayer/pgfcoreobjects.code.tex" 1601326656 2544 8c06d2a7f0f469616ac9e13db6d2f842 ""
  "/usr/local/texlive/2021/texmf-dist/tex/generic/pgf/basiclayer/pgfcorepathconstruct.code.tex" 1601326656 44195 5e390c414de027626ca5e2df888fa68d ""
  "/usr/local/texlive/2021/texmf-dist/tex/generic/pgf/basiclayer/pgfcorepathprocessing.code.tex" 1601326656 17311 2ef6b2e29e2fc6a2fc8d6d652176e257 ""
  "/usr/local/texlive/2021/texmf-dist/tex/generic/pgf/basiclayer/pgfcorepathusage.code.tex" 1601326656 21302 788a79944eb22192a4929e46963a3067 ""
  "/usr/local/texlive/2021/texmf-dist/tex/generic/pgf/basiclayer/pgfcorepatterns.code.tex" 1601326656 9690 01feb7cde25d4293ef36eef45123eb80 ""
  "/usr/local/texlive/2021/texmf-dist/tex/generic/pgf/basiclayer/pgfcorepoints.code.tex" 1601326656 33335 dd1fa4814d4e51f18be97d88bf0da60c ""
  "/usr/local/texlive/2021/texmf-dist/tex/generic/pgf/basiclayer/pgfcorequick.code.tex" 1601326656 2965 4c2b1f4e0826925746439038172e5d6f ""
  "/usr/local/texlive/2021/texmf-dist/tex/generic/pgf/basiclayer/pgfcorerdf.code.tex" 1601326656 5196 2cc249e0ee7e03da5f5f6589257b1e5b ""
  "/usr/local/texlive/2021/texmf-dist/tex/generic/pgf/basiclayer/pgfcorescopes.code.tex" 1601326656 20726 d4c8db1e2e53b72721d29916314a22ea ""
  "/usr/local/texlive/2021/texmf-dist/tex/generic/pgf/basiclayer/pgfcoreshade.code.tex" 1601326656 35249 abd4adf948f960299a4b3d27c5dddf46 ""
  "/usr/local/texlive/2021/texmf-dist/tex/generic/pgf/basiclayer/pgfcoretransformations.code.tex" 1601326656 21989 fdc867d05d228316de137a9fc5ec3bbe ""
  "/usr/local/texlive/2021/texmf-dist/tex/generic/pgf/basiclayer/pgfcoretransparency.code.tex" 1601326656 8893 e851de2175338fdf7c17f3e091d94618 ""
  "/usr/local/texlive/2021/texmf-dist/tex/generic/pgf/math/pgfint.code.tex" 1557692582 3063 8c415c68a0f3394e45cfeca0b65f6ee6 ""
  "/usr/local/texlive/2021/texmf-dist/tex/generic/pgf/math/pgfmath.code.tex" 1601326656 521 8e224a7af69b7fee4451d1bf76b46654 ""
  "/usr/local/texlive/2021/texmf-dist/tex/generic/pgf/math/pgfmathcalc.code.tex" 1601326656 13391 84d29568c13bdce4133ab4a214711112 ""
  "/usr/local/texlive/2021/texmf-dist/tex/generic/pgf/math/pgfmathfloat.code.tex" 1601326656 104935 184ed87524e76d4957860df4ce0cd1c3 ""
  "/usr/local/texlive/2021/texmf-dist/tex/generic/pgf/math/pgfmathfunctions.base.code.tex" 1601326656 10165 cec5fa73d49da442e56efc2d605ef154 ""
  "/usr/local/texlive/2021/texmf-dist/tex/generic/pgf/math/pgfmathfunctions.basic.code.tex" 1601326656 28178 41c17713108e0795aac6fef3d275fbca ""
  "/usr/local/texlive/2021/texmf-dist/tex/generic/pgf/math/pgfmathfunctions.code.tex" 1601326656 9989 c55967bf45126ff9b061fa2ca0c4694f ""
  "/usr/local/texlive/2021/texmf-dist/tex/generic/pgf/math/pgfmathfunctions.comparison.code.tex" 1601326656 3865 ac538ab80c5cf82b345016e474786549 ""
  "/usr/local/texlive/2021/texmf-dist/tex/generic/pgf/math/pgfmathfunctions.integerarithmetics.code.tex" 1557692582 3177 27d85c44fbfe09ff3b2cf2879e3ea434 ""
  "/usr/local/texlive/2021/texmf-dist/tex/generic/pgf/math/pgfmathfunctions.misc.code.tex" 1601326656 10925 139ac69ce3e9a1892add56d0b818cf97 ""
  "/usr/local/texlive/2021/texmf-dist/tex/generic/pgf/math/pgfmathfunctions.random.code.tex" 1608933718 7854 4176998eeefd8745ac6d2d4bd9c98451 ""
  "/usr/local/texlive/2021/texmf-dist/tex/generic/pgf/math/pgfmathfunctions.round.code.tex" 1601326656 3379 781797a101f647bab82741a99944a229 ""
  "/usr/local/texlive/2021/texmf-dist/tex/generic/pgf/math/pgfmathfunctions.trigonometric.code.tex" 1601326656 92405 f515f31275db273f97b9d8f52e1b0736 ""
  "/usr/local/texlive/2021/texmf-dist/tex/generic/pgf/math/pgfmathparser.code.tex" 1601326656 37376 11cd75aac3da1c1b152b2848f30adc14 ""
  "/usr/local/texlive/2021/texmf-dist/tex/generic/pgf/math/pgfmathutil.code.tex" 1601326656 8471 c2883569d03f69e8e1cabfef4999cfd7 ""
  "/usr/local/texlive/2021/texmf-dist/tex/generic/pgf/pgf.revision.tex" 1609106292 465 311958b39a263956b78fd69c4bc8a85c ""
  "/usr/local/texlive/2021/texmf-dist/tex/generic/pgf/systemlayer/pgf.cfg" 1601326656 926 2963ea0dcf6cc6c0a770b69ec46a477b ""
  "/usr/local/texlive/2021/texmf-dist/tex/generic/pgf/systemlayer/pgfsys-common-pdf.def" 1601326656 5546 f3f24d7898386cb7daac70bdd2c4d6dc ""
  "/usr/local/texlive/2021/texmf-dist/tex/generic/pgf/systemlayer/pgfsys-pdftex.def" 1601326656 12601 4786e597516eddd82097506db7cfa098 ""
  "/usr/local/texlive/2021/texmf-dist/tex/generic/pgf/systemlayer/pgfsys.code.tex" 1601326656 60544 7aef020a49f066dc86a26e7719af2a98 ""
  "/usr/local/texlive/2021/texmf-dist/tex/generic/pgf/systemlayer/pgfsysprotocol.code.tex" 1601326656 1896 b8e0ca0ac371d74c0ca05583f6313c91 ""
  "/usr/local/texlive/2021/texmf-dist/tex/generic/pgf/systemlayer/pgfsyssoftpath.code.tex" 1601326656 7778 53c8b5623d80238f6a20aa1df1868e63 ""
  "/usr/local/texlive/2021/texmf-dist/tex/generic/pgf/utilities/pgfkeys.code.tex" 1606168878 36938 2b5b0039ae51cc081ebb25d84b8a3408 ""
  "/usr/local/texlive/2021/texmf-dist/tex/generic/pgf/utilities/pgfkeysfiltered.code.tex" 1601326656 37431 9abe862035de1b29c7a677f3205e3d9f ""
  "/usr/local/texlive/2021/texmf-dist/tex/generic/pgf/utilities/pgfrcs.code.tex" 1601326656 4494 af17fb7efeafe423710479858e42fa7e ""
  "/usr/local/texlive/2021/texmf-dist/tex/generic/pgf/utilities/pgfutil-common-lists.tex" 1601326656 7251 fb18c67117e09c64de82267e12cd8aa4 ""
  "/usr/local/texlive/2021/texmf-dist/tex/generic/pgf/utilities/pgfutil-common.tex" 1601326656 28579 1cdb9cf41947e1e5889d97a41f9bb448 ""
  "/usr/local/texlive/2021/texmf-dist/tex/generic/pgf/utilities/pgfutil-latex.def" 1606168878 6860 2503857fc7e280acd60acdfa6c8c90c4 ""
  "/usr/local/texlive/2021/texmf-dist/tex/generic/uniquecounter/uniquecounter.sty" 1576624663 7008 f92eaa0a3872ed622bbf538217cd2ab7 ""
  "/usr/local/texlive/2021/texmf-dist/tex/latex/algorithmicx/algorithmicx.sty" 1160617237 26750 ce139c05a983e19ddca355b43e29c395 ""
  "/usr/local/texlive/2021/texmf-dist/tex/latex/algorithmicx/algpseudocode.sty" 1160617237 3457 d9077efe6b74c5a094199256af8d7d9a ""
  "/usr/local/texlive/2021/texmf-dist/tex/latex/algorithms/algorithm.sty" 1251330371 3249 15763257e50278eef5db1952ccde229c ""
  "/usr/local/texlive/2021/texmf-dist/tex/latex/amscls/amsthm.sty" 1591045760 12594 0d51ac3a545aaaa555021326ff22a6cc ""
  "/usr/local/texlive/2021/texmf-dist/tex/latex/amsfonts/amsfonts.sty" 1359763108 5949 3f3fd50a8cc94c3d4cbf4fc66cd3df1c ""
  "/usr/local/texlive/2021/texmf-dist/tex/latex/amsfonts/amssymb.sty" 1359763108 13829 94730e64147574077f8ecfea9bb69af4 ""
  "/usr/local/texlive/2021/texmf-dist/tex/latex/amsfonts/umsa.fd" 1359763108 961 6518c6525a34feb5e8250ffa91731cff ""
  "/usr/local/texlive/2021/texmf-dist/tex/latex/amsfonts/umsb.fd" 1359763108 961 d02606146ba5601b5645f987c92e6193 ""
  "/usr/local/texlive/2021/texmf-dist/tex/latex/amsmath/amsbsy.sty" 1523134290 2211 ca7ce284ab93c8eecdc6029dc5ccbd73 ""
  "/usr/local/texlive/2021/texmf-dist/tex/latex/amsmath/amsgen.sty" 1523134290 4161 7f6eb9092061a11f87d08ed13515b48d ""
  "/usr/local/texlive/2021/texmf-dist/tex/latex/amsmath/amsmath.sty" 1601675358 87353 2c21ff5f2e32e1bf714e600924d810db ""
  "/usr/local/texlive/2021/texmf-dist/tex/latex/amsmath/amsopn.sty" 1523134290 4116 32e6abd27229755a83a8b7f18e583890 ""
  "/usr/local/texlive/2021/texmf-dist/tex/latex/amsmath/amstext.sty" 1523134290 2432 8ff93b1137020e8f21930562a874ae66 ""
  "/usr/local/texlive/2021/texmf-dist/tex/latex/atveryend/atveryend.sty" 1576191570 19336 ce7ae9438967282886b3b036cfad1e4d ""
  "/usr/local/texlive/2021/texmf-dist/tex/latex/auxhook/auxhook.sty" 1576625391 3935 57aa3c3e203a5c2effb4d2bd2efbc323 ""
  "/usr/local/texlive/2021/texmf-dist/tex/latex/base/atbegshi-ltx.sty" 1609451599 2973 00085839f5881178c538db5970d3c38e ""
  "/usr/local/texlive/2021/texmf-dist/tex/latex/base/atveryend-ltx.sty" 1610149055 2596 b3a02e33035865e9f0457e064d436fb8 ""
  "/usr/local/texlive/2021/texmf-dist/tex/latex/base/ifthen.sty" 1580683321 5159 892429808d9e0e2b3548aaefd9a06ed0 ""
  "/usr/local/texlive/2021/texmf-dist/tex/latex/base/size10.clo" 1601675358 8449 a72d5d4e612221b46000c3d71724e0ef ""
  "/usr/local/texlive/2021/texmf-dist/tex/latex/beamer/beamer.cls" 1616189216 11587 4ebe8d56871fcb3949f286bafb9b2218 ""
  "/usr/local/texlive/2021/texmf-dist/tex/latex/beamer/beamerbaseauxtemplates.sty" 1519256047 22666 933c376468a06913d7754fc13742473c ""
  "/usr/local/texlive/2021/texmf-dist/tex/latex/beamer/beamerbaseboxes.sty" 1612994634 6954 d9eb3846e78d9008aaac86cd82372855 ""
  "/usr/local/texlive/2021/texmf-dist/tex/latex/beamer/beamerbasecolor.sty" 1607984133 12834 a2e2edcc4215056529fd4e140e2ed26a ""
  "/usr/local/texlive/2021/texmf-dist/tex/latex/beamer/beamerbasecompatibility.sty" 1616189216 25556 12bc4eaa5d3e5e9f1f4fefb344102fbd ""
  "/usr/local/texlive/2021/texmf-dist/tex/latex/beamer/beamerbasedecode.sty" 1563915504 9407 98317d4428bbbc4430035c0c0e3898d5 ""
  "/usr/local/texlive/2021/texmf-dist/tex/latex/beamer/beamerbasefont.sty" 1607984133 13626 5a8efa954e5cf512c91c80f637cbf1f1 ""
  "/usr/local/texlive/2021/texmf-dist/tex/latex/beamer/beamerbaseframe.sty" 1588799267 25162 9e33f2887dc316e20c319466b078d6eb ""
  "/usr/local/texlive/2021/texmf-dist/tex/latex/beamer/beamerbaseframecomponents.sty" 1519256047 11898 264f0ae03dbfa791611c1821393bc0b9 ""
  "/usr/local/texlive/2021/texmf-dist/tex/latex/beamer/beamerbaseframesize.sty" 1537478106 8800 544bcf1a583ad768d77d8b1d8f18a993 ""
  "/usr/local/texlive/2021/texmf-dist/tex/latex/beamer/beamerbaselocalstructure.sty" 1612994634 17622 85760d86f730e8faf1f7378f6e67e409 ""
  "/usr/local/texlive/2021/texmf-dist/tex/latex/beamer/beamerbasemisc.sty" 1519256047 8313 358d4bb860bd9098eb24099f36b27af1 ""
  "/usr/local/texlive/2021/texmf-dist/tex/latex/beamer/beamerbasemodes.sty" 1616189216 7574 6d0e29b16443d86a896479ec2aabff07 ""
  "/usr/local/texlive/2021/texmf-dist/tex/latex/beamer/beamerbasenavigation.sty" 1519256047 29020 6cae2187b2d2bc4f39b6bb5bddbcf031 ""
  "/usr/local/texlive/2021/texmf-dist/tex/latex/beamer/beamerbasenotes.sty" 1595450012 5595 c0c140ec41fa3c9299aa6df19444c391 ""
  "/usr/local/texlive/2021/texmf-dist/tex/latex/beamer/beamerbaseoptions.sty" 1500070590 1753 c10ec1df45e4b4c7ee05e306d23f95d7 ""
  "/usr/local/texlive/2021/texmf-dist/tex/latex/beamer/beamerbaseoverlay.sty" 1595450012 27425 7f090822023c1cb57d609b70b5e7cc42 ""
  "/usr/local/texlive/2021/texmf-dist/tex/latex/beamer/beamerbaserequires.sty" 1500070590 1593 48c3729494fa250d34789fd6af677f99 ""
  "/usr/local/texlive/2021/texmf-dist/tex/latex/beamer/beamerbasesection.sty" 1616189216 13527 6266cecef9dcaa294ba1dc5ff2d8a798 ""
  "/usr/local/texlive/2021/texmf-dist/tex/latex/beamer/beamerbasetemplates.sty" 1500070590 5753 fbf8c2f7c7d6d5d1d2b900c353f094e8 ""
  "/usr/local/texlive/2021/texmf-dist/tex/latex/beamer/beamerbasethemes.sty" 1500070590 1140 cdaff8d445bd2a4e7afdec5190a758c0 ""
  "/usr/local/texlive/2021/texmf-dist/tex/latex/beamer/beamerbasetheorems.sty" 1500070590 4548 cdde9ae4b614ce5ea4cf7a232ceeb6a8 ""
  "/usr/local/texlive/2021/texmf-dist/tex/latex/beamer/beamerbasetitle.sty" 1563915504 5356 d32dea458460fce4541d4f9aa765b876 ""
  "/usr/local/texlive/2021/texmf-dist/tex/latex/beamer/beamerbasetoc.sty" 1543789491 7540 49f6c8ecb1955d667d1620733f995fe0 ""
  "/usr/local/texlive/2021/texmf-dist/tex/latex/beamer/beamerbasetranslator.sty" 1483400771 637 685bd3d40aca2fa87965a39bc31aca7f ""
  "/usr/local/texlive/2021/texmf-dist/tex/latex/beamer/beamerbasetwoscreens.sty" 1595450012 1808 098e1772761e9b4a016e74f1a4c1cb74 ""
  "/usr/local/texlive/2021/texmf-dist/tex/latex/beamer/beamerbaseverbatim.sty" 1519256047 4026 1ba2c6a2acf275d63cb85d60d8597fe8 ""
  "/usr/local/texlive/2021/texmf-dist/tex/latex/beamer/beamercolorthemedefault.sty" 1535061494 7089 c34bc77851d46db7348b94bd5e51168a ""
  "/usr/local/texlive/2021/texmf-dist/tex/latex/beamer/beamercolorthemestructure.sty" 1513642141 823 42ac9f832cbf9adf20b81881a152902b ""
  "/usr/local/texlive/2021/texmf-dist/tex/latex/beamer/beamerfontthemedefault.sty" 1519256047 4236 21e590075d6781cc58fee783316ee268 ""
  "/usr/local/texlive/2021/texmf-dist/tex/latex/beamer/beamericonarticle.20.pdf" 1513642141 2958 4e0c4a6e994e5c4d9da11c477e927f0f ""
  "/usr/local/texlive/2021/texmf-dist/tex/latex/beamer/beamericonarticle.pdf" 1513642141 2936 6cc3ef0682cbb62be8aa1b19f0a84ed6 ""
  "/usr/local/texlive/2021/texmf-dist/tex/latex/beamer/beamericonbook.20.pdf" 1513642141 2734 0bcf939051dd2a936cdfe5982f7c233b ""
  "/usr/local/texlive/2021/texmf-dist/tex/latex/beamer/beamericonbook.pdf" 1513642141 2667 7624351b441ffe4bd2d14e08fbcf063d ""
  "/usr/local/texlive/2021/texmf-dist/tex/latex/beamer/beamericononline.20.pdf" 1513642141 24451 195d2c060e84f339954bc6d9b52131d7 ""
  "/usr/local/texlive/2021/texmf-dist/tex/latex/beamer/beamericononline.pdf" 1513642141 24611 df07010540266b2b205b492a4d02e7e1 ""
  "/usr/local/texlive/2021/texmf-dist/tex/latex/beamer/beamerinnerthemedefault.sty" 1519256047 13031 a33a15e4b12bfa976c11f59131636ea9 ""
  "/usr/local/texlive/2021/texmf-dist/tex/latex/beamer/beamerouterthemedefault.sty" 1588799267 6630 9731ba35f4c7921e311abc957adf446b ""
  "/usr/local/texlive/2021/texmf-dist/tex/latex/beamer/beamerthemedefault.sty" 1513642141 355 75c98e7b8f427eb7c625ed391b140c5b ""
  "/usr/local/texlive/2021/texmf-dist/tex/latex/epstopdf-pkg/epstopdf-base.sty" 1579991033 13886 d1306dcf79a944f6988e688c1785f9ce ""
  "/usr/local/texlive/2021/texmf-dist/tex/latex/etoolbox/etoolbox.sty" 1601931149 46845 3b58f70c6e861a13d927bff09d35ecbc ""
  "/usr/local/texlive/2021/texmf-dist/tex/latex/float/float.sty" 1137110151 6749 16d2656a1984957e674b149555f1ea1d ""
  "/usr/local/texlive/2021/texmf-dist/tex/latex/geometry/geometry.sty" 1578002852 41601 9cf6c5257b1bc7af01a58859749dd37a ""
  "/usr/local/texlive/2021/texmf-dist/tex/latex/graphics-cfg/color.cfg" 1459978653 1213 620bba36b25224fa9b7e1ccb4ecb76fd ""
  "/usr/local/texlive/2021/texmf-dist/tex/latex/graphics-cfg/graphics.cfg" 1465944070 1224 978390e9c2234eab29404bc21b268d1e ""
  "/usr/local/texlive/2021/texmf-dist/tex/latex/graphics-def/pdftex.def" 1601931164 19103 48d29b6e2a64cb717117ef65f107b404 ""
  "/usr/local/texlive/2021/texmf-dist/tex/latex/graphics/graphics.sty" 1601675358 18272 a8c6a275b34ab6717ceeb8fa04b104e2 ""
  "/usr/local/texlive/2021/texmf-dist/tex/latex/graphics/graphicx.sty" 1601675358 7919 20fdfdd783821971c55bc8ee918cbe63 ""
  "/usr/local/texlive/2021/texmf-dist/tex/latex/graphics/keyval.sty" 1580683321 2590 e3b24ff953e5b58d924f163d25380312 ""
  "/usr/local/texlive/2021/texmf-dist/tex/latex/graphics/trig.sty" 1580683321 3976 d7fa7d81d2870d509d25b17d0245e735 ""
  "/usr/local/texlive/2021/texmf-dist/tex/latex/grfext/grfext.sty" 1575499774 7133 b94bbacbee6e4fdccdc7f810b2aec370 ""
  "/usr/local/texlive/2021/texmf-dist/tex/latex/hycolor/hycolor.sty" 1580250785 17914 4c28a13fc3d975e6e81c9bea1d697276 ""
  "/usr/local/texlive/2021/texmf-dist/tex/latex/hyperref/hpdftex.def" 1614638310 49890 ad792e908af8bc5c293b806bd181e58d ""
  "/usr/local/texlive/2021/texmf-dist/tex/latex/hyperref/hyperref-langpatches.def" 1614638310 1777 31eee4f3f5c138e44a4e16abfcaefa41 ""
  "/usr/local/texlive/2021/texmf-dist/tex/latex/hyperref/hyperref.sty" 1614638310 230839 177eac084bda18ae827a77792a17292e ""
  "/usr/local/texlive/2021/texmf-dist/tex/latex/hyperref/nameref.sty" 1612734870 13242 133e617c5eebffdd05e421624022b267 ""
  "/usr/local/texlive/2021/texmf-dist/tex/latex/hyperref/pd1enc.def" 1614638310 14132 3a8b7a8250bdb5871e322188be7c9ff6 ""
  "/usr/local/texlive/2021/texmf-dist/tex/latex/hyperref/puenc.def" 1614638310 117004 7c05c6dde5b2b6a14f97dd4137739212 ""
  "/usr/local/texlive/2021/texmf-dist/tex/latex/koma-script/scrlfile-hook.sty" 1616362473 9861 1c84049c7d8ca184731fe52eeb4c342f ""
  "/usr/local/texlive/2021/texmf-dist/tex/latex/koma-script/scrlfile.sty" 1616362473 3128 0f937965be3412c191cc30181f7ad889 ""
  "/usr/local/texlive/2021/texmf-dist/tex/latex/koma-script/scrlogo.sty" 1616362473 1954 d3f157130a5b7ccb270d92af50c6297b ""
  "/usr/local/texlive/2021/texmf-dist/tex/latex/kvoptions/kvoptions.sty" 1602274869 22521 d2fceb764a442a2001d257ef11db7618 ""
  "/usr/local/texlive/2021/texmf-dist/tex/latex/l3backend/l3backend-pdftex.def" 1616101731 27164 3d5f7887a89df4eb2f6e86ba26ef3254 ""
  "/usr/local/texlive/2021/texmf-dist/tex/latex/latexconfig/epstopdf-sys.cfg" 1279039959 678 4792914a8f45be57bb98413425e4c7af ""
  "/usr/local/texlive/2021/texmf-dist/tex/latex/letltxmacro/letltxmacro.sty" 1575499565 5766 13a9e8766c47f30327caf893ece86ac8 ""
  "/usr/local/texlive/2021/texmf-dist/tex/latex/pgf/basiclayer/pgfcore.sty" 1601326656 410 615550c46f918fcbee37641b02a862d9 ""
  "/usr/local/texlive/2021/texmf-dist/tex/latex/pgf/systemlayer/pgfsys.sty" 1601326656 443 8c872229db56122037e86bcda49e14f3 ""
  "/usr/local/texlive/2021/texmf-dist/tex/latex/pgf/utilities/pgfrcs.sty" 1601326656 325 f9f16d12354225b7dd52a3321f085955 ""
  "/usr/local/texlive/2021/texmf-dist/tex/latex/pgf/utilities/xxcolor.sty" 1601326656 2232 b9a67bccba736ed334b4b1a860a85c6f ""
  "/usr/local/texlive/2021/texmf-dist/tex/latex/refcount/refcount.sty" 1576624809 9878 9e94e8fa600d95f9c7731bb21dfb67a4 ""
  "/usr/local/texlive/2021/texmf-dist/tex/latex/rerunfilecheck/rerunfilecheck.sty" 1575674187 9715 b051d5b493d9fe5f4bc251462d039e5f ""
  "/usr/local/texlive/2021/texmf-dist/tex/latex/sansmathaccent/ot1mathkerncmss.fd" 1580595219 1299 5a2b7aad8540e4f7415f2af0eb91bc10 ""
  "/usr/local/texlive/2021/texmf-dist/tex/latex/sansmathaccent/sansmathaccent.sty" 1580595219 4282 5d27280ace1239baaa4a225df16125ff ""
  "/usr/local/texlive/2021/texmf-dist/tex/latex/tools/enumerate.sty" 1580683321 3469 19b6cb25f21abe53fb90b9fe27615441 ""
  "/usr/local/texlive/2021/texmf-dist/tex/latex/translator/translator-basic-dictionary-English.dict" 1596662134 3535 7dc96051305a7e943219126c49c44cd6 ""
  "/usr/local/texlive/2021/texmf-dist/tex/latex/translator/translator-bibliography-dictionary-English.dict" 1512078926 903 c6d17f0656e9e1abb172b4faebabd617 ""
  "/usr/local/texlive/2021/texmf-dist/tex/latex/translator/translator-environment-dictionary-English.dict" 1512078926 433 bfb8d1c2c020defd2de8e5c276710094 ""
  "/usr/local/texlive/2021/texmf-dist/tex/latex/translator/translator-months-dictionary-English.dict" 1512078926 1337 9a6c05e8f0c8b3c5f27cbd0e455cf475 ""
  "/usr/local/texlive/2021/texmf-dist/tex/latex/translator/translator-numbers-dictionary-English.dict" 1512078926 1638 2bf1a1dea98f8a4d28033fce76e9cc67 ""
  "/usr/local/texlive/2021/texmf-dist/tex/latex/translator/translator-theorem-dictionary-English.dict" 1512078926 3523 1f9d9b91f7d78b73e74c7e97bca30fb0 ""
  "/usr/local/texlive/2021/texmf-dist/tex/latex/translator/translator.sty" 1596662134 8765 3368c4a5a4b5466261cafb836195e916 ""
  "/usr/local/texlive/2021/texmf-dist/tex/latex/url/url.sty" 1388531844 12796 8edb7d69a20b857904dd0ea757c14ec9 ""
  "/usr/local/texlive/2021/texmf-dist/tex/latex/xcolor/xcolor.sty" 1463002160 55589 34128738f682d033422ca125f82e5d62 ""
  "/usr/local/texlive/2021/texmf-dist/web2c/texmf.cnf" 1616443989 39972 3d6bb4d9d719e93193fa020b58adf5d4 ""
  "/usr/local/texlive/2021/texmf-var/fonts/map/pdftex/updmap/pdftex.map" 1616695603 5169178 a2ce6e2d73f603b690db6777d06dbccb ""
  "/usr/local/texlive/2021/texmf-var/web2c/pdftex/pdflatex.fmt" 1633545698 2724737 e764e0be7fe88ef071971d465c428b3c ""
  "/usr/local/texlive/2021/texmf.cnf" 1616695596 577 4c1911a7228e554c6032256d3cf5567d ""
  "slides.aux" 1643393027 1630 1aff34149e379691d926dc7256084fb7 "pdflatex"
  "slides.nav" 1643393027 673 4735e2d08078e861dcaacd15ed1fd1ec "pdflatex"
  "slides.out" 1643393026 0 d41d8cd98f00b204e9800998ecf8427e "pdflatex"
  "slides.tex" 1643393068 2228 cc44379f991190be769d483c6b1867d2 ""
  (generated)
  "slides.toc"
  "slides.aux"
  "slides.log"
  "slides.nav"
  "slides.out"
  "slides.snm"
  "slides.pdf"
